c00009

df1455d

1 @ FreeBSD i386 11.2-REL 1.04 phk

*    top   0.0 TEST ../../../../bin/varnishtest/tests/c00009.vtc starting
[...]
*    top   0.0 TEST Test restarts
[...]
**** v1    0.1 CLI TX|\t\tset resp.http.method = req.method;
**** v1    0.1 CLI TX|\t\tset resp.http.url = req.url;
**** v1    0.1 CLI TX|\t\tset resp.http.proto = req.proto;
**** v1    0.1 CLI TX|\t\tset resp.http.preserveme = req.http.preserveme;
**** v1    0.1 CLI TX|\t\tset resp.http.restarts = req.restarts;
**** v1    0.1 CLI TX|\t\tset resp.http.storage = req.storage;
**** v1    0.1 CLI TX|\t\tset resp.http.ttl = req.ttl;
**** v1    0.1 CLI TX|\t\tset resp.http.esi = req.esi;
**** v1    0.1 CLI TX|\t\tset resp.http.backend_hint = req.backend_hint;
**** v1    0.1 CLI TX|\t\tset resp.http.hash-ignore-busy = req.hash_ignore_busy;
**** v1    0.1 CLI TX|\t\tset resp.http.hash-always-miss = req.hash_always_miss;
**** v1    0.1 CLI TX|\t}
**** v1    0.1 CLI TX|
**** v1    0.1 CLI TX|%XJEIFLH|)Xspa8P
***  v1    0.2 vsl|No VSL chunk found (child not started ?)
***  v1    0.2 CLI RX  106
**** v1    0.2 CLI RX|Message from VCC-compiler:
**** v1    0.2 CLI RX|Symbol not found.
**** v1    0.2 CLI RX|('<vcl.inline>' Line 21 Pos 9)
**** v1    0.2 CLI RX|        sub vcl_backend_fetch {
**** v1    0.2 CLI RX|--------###--------------------
**** v1    0.2 CLI RX|
**** v1    0.2 CLI RX|Running VCC-compiler failed, exited with 2
**** v1    0.2 CLI RX|VCL compilation failed
---- v1    0.2 FAIL VCL does not compile
*    top   0.2 RESETTING after ../../../../bin/varnishtest/tests/c00009.vtc
**   s1    0.2 Waiting for server (3/-1)
**   s2    0.2 Waiting for server (4/-1)
**   v1    0.2 Wait
**** v1    0.2 CLI TX|panic.clear
***  v1    0.3 CLI RX  300
**** v1    0.3 CLI RX|No panic to clear
***  v1    0.3 vsl|No VSL chunk found (child not started ?)
***  v1    0.3 debug|Info: manager stopping child
***  v1    0.3 debug|Info: manager dies
**** v1    0.3 STDOUT poll 0x11
**   v1    0.3 WAIT4 pid=22778 status=0x0000 (user 0.011405 sys 0.000000)
*    top   0.3 TEST ../../../../bin/varnishtest/tests/c00009.vtc FAILED
#    top  TEST ../../../../bin/varnishtest/tests/c00009.vtc FAILED (0.338) exit=2
FAIL tests/c00009.vtc (exit status: 2)

1 @ Linux x86_64 3.10.0 1.04 phk

*    top   0.0 TEST ../../../bin/varnishtest/tests/c00009.vtc starting
[...]
*    top   0.0 TEST Test restarts
[...]
**** v1    0.1 CLI TX|\t\tif (resp.status != 200) {
**** v1    0.1 CLI TX|\t\t\treturn (restart);
**** v1    0.1 CLI TX|\t\t}
**** v1    0.1 CLI TX|\t\tset resp.http.method = req.method;
**** v1    0.1 CLI TX|\t\tset resp.http.url = req.url;
**** v1    0.1 CLI TX|\t\tset resp.http.proto = req.proto;
**** v1    0.1 CLI TX|\t\tset resp.http.preserveme = req.http.preserveme;
**** v1    0.1 CLI TX|\t\tset resp.http.restarts = req.restarts;
**** v1    0.1 CLI TX|\t\tset resp.http.storage = req.storage;
**** v1    0.1 CLI TX|\t\tset resp.http.ttl = req.ttl;
**** v1    0.1 CLI TX|\t\tset resp.http.esi = req.esi;
**** v1    0.1 CLI TX|\t\tset resp.http.backend_hint = req.backend_hint;
**** v1    0.1 CLI TX|\t\tset resp.http.hash-ignore-busy = req.hash_ignore_busy;
**** v1    0.1 CLI TX|\t\tset resp.http.hash-always-miss = req.hash_always_miss;
**** v1    0.1 CLI TX|\t}
**** v1    0.1 CLI TX|
**** v1    0.1 CLI TX|%XJEIFLH|)Xspa8P
***  v1    0.1 CLI RX  106
**** v1    0.1 CLI RX|Message from VCC-compiler:
**** v1    0.1 CLI RX|Symbol not found.
**** v1    0.1 CLI RX|('<vcl.inline>' Line 21 Pos 9)
**** v1    0.1 CLI RX|        sub vcl_backend_fetch {
**** v1    0.1 CLI RX|--------###--------------------
**** v1    0.1 CLI RX|
**** v1    0.1 CLI RX|Running VCC-compiler failed, exited with 2
**** v1    0.1 CLI RX|VCL compilation failed
---- v1    0.1 FAIL VCL does not compile
*    top   0.1 RESETTING after ../../../bin/varnishtest/tests/c00009.vtc
**   s1    0.1 Waiting for server (4/-1)
**   s2    0.1 Waiting for server (5/-1)
**   v1    0.1 Wait
**** v1    0.1 CLI TX|panic.clear
***  v1    0.2 CLI RX  300
**** v1    0.2 CLI RX|No panic to clear
***  v1    0.2 debug|Info: manager stopping child
***  v1    0.2 debug|Info: manager dies
**** v1    0.2 STDOUT poll 0x10
**   v1    0.2 WAIT4 pid=8596 status=0x0000 (user 0.004733 sys 0.005852)
*    top   0.2 TEST ../../../bin/varnishtest/tests/c00009.vtc FAILED
#    top  TEST ../../../bin/varnishtest/tests/c00009.vtc FAILED (0.158) exit=2

1 @ SunOS i86pc 5.11 1.04 32_sun12.4 uplex

*    top   0.0 TEST ../../../bin/varnishtest/tests/c00009.vtc starting
[...]
*    top   0.0 TEST Test restarts
[...]
**** v1    0.1 CLI TX|\t\t}
**** v1    0.1 CLI TX|\t\tset resp.http.method = req.method;
**** v1    0.1 CLI TX|\t\tset resp.http.url = req.url;
**** v1    0.1 CLI TX|\t\tset resp.http.proto = req.proto;
**** v1    0.1 CLI TX|\t\tset resp.http.preserveme = req.http.preserveme;
**** v1    0.1 CLI TX|\t\tset resp.http.restarts = req.restarts;
**** v1    0.1 CLI TX|\t\tset resp.http.storage = req.storage;
**** v1    0.1 CLI TX|\t\tset resp.http.ttl = req.ttl;
**** v1    0.1 CLI TX|\t\tset resp.http.esi = req.esi;
**** v1    0.1 CLI TX|\t\tset resp.http.backend_hint = req.backend_hint;
**** v1    0.1 CLI TX|\t\tset resp.http.hash-ignore-busy = req.hash_ignore_busy;
**** v1    0.1 CLI TX|\t\tset resp.http.hash-always-miss = req.hash_always_miss;
**** v1    0.1 CLI TX|\t}
**** v1    0.1 CLI TX|
**** v1    0.1 CLI TX|%XJEIFLH|)Xspa8P
***  v1    0.2 CLI RX  106
**** v1    0.2 CLI RX|Message from VCC-compiler:
**** v1    0.2 CLI RX|Security: Privilege proc_setid missing, will not change uid/gid
**** v1    0.2 CLI RX|Symbol not found.
**** v1    0.2 CLI RX|('<vcl.inline>' Line 21 Pos 9)
**** v1    0.2 CLI RX|        sub vcl_backend_fetch {
**** v1    0.2 CLI RX|--------###--------------------
**** v1    0.2 CLI RX|
**** v1    0.2 CLI RX|Running VCC-compiler failed, exited with 2
**** v1    0.2 CLI RX|VCL compilation failed
---- v1    0.2 FAIL VCL does not compile
*    top   0.2 RESETTING after ../../../bin/varnishtest/tests/c00009.vtc
**   s1    0.2 Waiting for server (3/-1)
**   s2    0.2 Waiting for server (4/-1)
**   v1    0.2 Wait
**** v1    0.2 CLI TX|panic.clear
***  v1    0.2 CLI RX  300
**** v1    0.2 CLI RX|No panic to clear
***  v1    0.2 debug|Info: manager stopping child
***  v1    0.2 debug|Info: manager dies
**** v1    0.2 STDOUT poll 0x10
***  v1    0.2 vsl|No VSL chunk found (child not started ?)
**   v1    0.2 WAIT4 pid=29016 status=0x0000 (user 0.009000 sys 0.026000)
*    top   0.2 TEST ../../../bin/varnishtest/tests/c00009.vtc FAILED
#    top  TEST ../../../bin/varnishtest/tests/c00009.vtc FAILED (0.250) exit=2

1 @ FreeBSD i386 11.2-REL 1.04 phk

*    top   0.0 TEST ../../../../bin/varnishtest/tests/c00009.vtc starting
[...]
*    top   0.0 TEST Test restarts
[...]
**** v1    0.1 CLI TX|\t\tset resp.http.method = req.method;
**** v1    0.1 CLI TX|\t\tset resp.http.url = req.url;
**** v1    0.1 CLI TX|\t\tset resp.http.proto = req.proto;
**** v1    0.1 CLI TX|\t\tset resp.http.preserveme = req.http.preserveme;
**** v1    0.1 CLI TX|\t\tset resp.http.restarts = req.restarts;
**** v1    0.1 CLI TX|\t\tset resp.http.storage = req.storage;
**** v1    0.1 CLI TX|\t\tset resp.http.ttl = req.ttl;
**** v1    0.1 CLI TX|\t\tset resp.http.esi = req.esi;
**** v1    0.1 CLI TX|\t\tset resp.http.backend_hint = req.backend_hint;
**** v1    0.1 CLI TX|\t\tset resp.http.hash-ignore-busy = req.hash_ignore_busy;
**** v1    0.1 CLI TX|\t\tset resp.http.hash-always-miss = req.hash_always_miss;
**** v1    0.1 CLI TX|\t}
**** v1    0.1 CLI TX|
**** v1    0.1 CLI TX|%XJEIFLH|)Xspa8P
***  v1    0.2 vsl|No VSL chunk found (child not started ?)
***  v1    0.2 CLI RX  106
**** v1    0.2 CLI RX|Message from VCC-compiler:
**** v1    0.2 CLI RX|Symbol not found.
**** v1    0.2 CLI RX|('<vcl.inline>' Line 21 Pos 9)
**** v1    0.2 CLI RX|        sub vcl_backend_fetch {
**** v1    0.2 CLI RX|--------###--------------------
**** v1    0.2 CLI RX|
**** v1    0.2 CLI RX|Running VCC-compiler failed, exited with 2
**** v1    0.2 CLI RX|VCL compilation failed
---- v1    0.2 FAIL VCL does not compile
*    top   0.2 RESETTING after ../../../../bin/varnishtest/tests/c00009.vtc
**   s1    0.2 Waiting for server (3/-1)
**   s2    0.2 Waiting for server (4/-1)
**   v1    0.2 Wait
**** v1    0.2 CLI TX|panic.clear
***  v1    0.3 CLI RX  300
**** v1    0.3 CLI RX|No panic to clear
***  v1    0.3 vsl|No VSL chunk found (child not started ?)
***  v1    0.3 debug|Info: manager stopping child
***  v1    0.3 debug|Info: manager dies
**** v1    0.3 STDOUT poll 0x11
**   v1    0.3 WAIT4 pid=74327 status=0x0000 (user 0.005756 sys 0.005756)
*    top   0.3 TEST ../../../../bin/varnishtest/tests/c00009.vtc FAILED
#    top  TEST ../../../../bin/varnishtest/tests/c00009.vtc FAILED (0.329) exit=2
FAIL tests/c00009.vtc (exit status: 2)

1 @ FreeBSD i386 11.2-REL 1.04 phk

*    top   0.0 TEST ../../../../bin/varnishtest/tests/c00009.vtc starting
[...]
*    top   0.0 TEST Test restarts
[...]
**** v1    0.1 CLI TX|\t\t}
**** v1    0.1 CLI TX|\t\tset resp.http.method = req.method;
**** v1    0.1 CLI TX|\t\tset resp.http.url = req.url;
**** v1    0.1 CLI TX|\t\tset resp.http.proto = req.proto;
**** v1    0.1 CLI TX|\t\tset resp.http.preserveme = req.http.preserveme;
**** v1    0.1 CLI TX|\t\tset resp.http.restarts = req.restarts;
**** v1    0.1 CLI TX|\t\tset resp.http.storage = req.storage;
**** v1    0.1 CLI TX|\t\tset resp.http.ttl = req.ttl;
**** v1    0.1 CLI TX|\t\tset resp.http.esi = req.esi;
**** v1    0.1 CLI TX|\t\tset resp.http.backend_hint = req.backend_hint;
**** v1    0.1 CLI TX|\t\tset resp.http.hash-ignore-busy = req.hash_ignore_busy;
**** v1    0.1 CLI TX|\t\tset resp.http.hash-always-miss = req.hash_always_miss;
**** v1    0.1 CLI TX|\t}
**** v1    0.1 CLI TX|
**** v1    0.1 CLI TX|%XJEIFLH|)Xspa8P
***  v1    0.2 CLI RX  106
**** v1    0.2 CLI RX|Message from VCC-compiler:
**** v1    0.2 CLI RX|Symbol not found.
**** v1    0.2 CLI RX|('<vcl.inline>' Line 21 Pos 9)
**** v1    0.2 CLI RX|        sub vcl_backend_fetch {
**** v1    0.2 CLI RX|--------###--------------------
**** v1    0.2 CLI RX|
**** v1    0.2 CLI RX|Running VCC-compiler failed, exited with 2
**** v1    0.2 CLI RX|VCL compilation failed
---- v1    0.2 FAIL VCL does not compile
*    top   0.2 RESETTING after ../../../../bin/varnishtest/tests/c00009.vtc
**   s1    0.2 Waiting for server (3/-1)
**   s2    0.2 Waiting for server (4/-1)
**   v1    0.2 Wait
**** v1    0.2 CLI TX|panic.clear
***  v1    0.3 vsl|No VSL chunk found (child not started ?)
***  v1    0.4 CLI RX  300
**** v1    0.4 CLI RX|No panic to clear
***  v1    0.4 debug|Info: manager stopping child
***  v1    0.4 debug|Info: manager dies
**** v1    0.4 STDOUT poll 0x11
**   v1    0.4 WAIT4 pid=25991 status=0x0000 (user 0.000000 sys 0.011575)
*    top   0.4 TEST ../../../../bin/varnishtest/tests/c00009.vtc FAILED
#    top  TEST ../../../../bin/varnishtest/tests/c00009.vtc FAILED (0.352) exit=2
FAIL tests/c00009.vtc (exit status: 2)

1 @ SunOS i86pc 5.11 1.04 64_sun12.4 uplex

*    top   0.0 TEST ../../../bin/varnishtest/tests/c00009.vtc starting
[...]
*    top   0.0 TEST Test restarts
[...]
**** v1    0.2 CLI TX|\t\t}
**** v1    0.2 CLI TX|\t\tset resp.http.method = req.method;
**** v1    0.2 CLI TX|\t\tset resp.http.url = req.url;
**** v1    0.2 CLI TX|\t\tset resp.http.proto = req.proto;
**** v1    0.2 CLI TX|\t\tset resp.http.preserveme = req.http.preserveme;
**** v1    0.2 CLI TX|\t\tset resp.http.restarts = req.restarts;
**** v1    0.2 CLI TX|\t\tset resp.http.storage = req.storage;
**** v1    0.2 CLI TX|\t\tset resp.http.ttl = req.ttl;
**** v1    0.2 CLI TX|\t\tset resp.http.esi = req.esi;
**** v1    0.2 CLI TX|\t\tset resp.http.backend_hint = req.backend_hint;
**** v1    0.2 CLI TX|\t\tset resp.http.hash-ignore-busy = req.hash_ignore_busy;
**** v1    0.2 CLI TX|\t\tset resp.http.hash-always-miss = req.hash_always_miss;
**** v1    0.2 CLI TX|\t}
**** v1    0.2 CLI TX|
**** v1    0.2 CLI TX|%XJEIFLH|)Xspa8P
***  v1    0.2 CLI RX  106
**** v1    0.2 CLI RX|Message from VCC-compiler:
**** v1    0.2 CLI RX|Security: Privilege proc_setid missing, will not change uid/gid
**** v1    0.2 CLI RX|Symbol not found.
**** v1    0.2 CLI RX|('<vcl.inline>' Line 21 Pos 9)
**** v1    0.2 CLI RX|        sub vcl_backend_fetch {
**** v1    0.2 CLI RX|--------###--------------------
**** v1    0.2 CLI RX|
**** v1    0.2 CLI RX|Running VCC-compiler failed, exited with 2
**** v1    0.2 CLI RX|VCL compilation failed
---- v1    0.2 FAIL VCL does not compile
*    top   0.2 RESETTING after ../../../bin/varnishtest/tests/c00009.vtc
**   s1    0.2 Waiting for server (3/-1)
**   s2    0.2 Waiting for server (4/-1)
**   v1    0.2 Wait
**** v1    0.2 CLI TX|panic.clear
***  v1    0.2 CLI RX  300
**** v1    0.2 CLI RX|No panic to clear
***  v1    0.2 debug|Info: manager stopping child
***  v1    0.2 debug|Info: manager dies
**** v1    0.2 STDOUT poll 0x10
***  v1    0.3 vsl|No VSL chunk found (child not started ?)
**   v1    0.3 WAIT4 pid=27418 status=0x0000 (user 0.010000 sys 0.033000)
*    top   0.3 TEST ../../../bin/varnishtest/tests/c00009.vtc FAILED
#    top  TEST ../../../bin/varnishtest/tests/c00009.vtc FAILED (0.262) exit=2

1 @ SunOS i86pc 5.11 1.04 64_gcc4.7 uplex

*    top   0.0 TEST ../../../bin/varnishtest/tests/c00009.vtc starting
[...]
*    top   0.0 TEST Test restarts
[...]
**** v1    0.1 CLI TX|\t\t}
**** v1    0.1 CLI TX|\t\tset resp.http.method = req.method;
**** v1    0.1 CLI TX|\t\tset resp.http.url = req.url;
**** v1    0.1 CLI TX|\t\tset resp.http.proto = req.proto;
**** v1    0.1 CLI TX|\t\tset resp.http.preserveme = req.http.preserveme;
**** v1    0.1 CLI TX|\t\tset resp.http.restarts = req.restarts;
**** v1    0.1 CLI TX|\t\tset resp.http.storage = req.storage;
**** v1    0.1 CLI TX|\t\tset resp.http.ttl = req.ttl;
**** v1    0.1 CLI TX|\t\tset resp.http.esi = req.esi;
**** v1    0.1 CLI TX|\t\tset resp.http.backend_hint = req.backend_hint;
**** v1    0.1 CLI TX|\t\tset resp.http.hash-ignore-busy = req.hash_ignore_busy;
**** v1    0.1 CLI TX|\t\tset resp.http.hash-always-miss = req.hash_always_miss;
**** v1    0.1 CLI TX|\t}
**** v1    0.1 CLI TX|
**** v1    0.1 CLI TX|%XJEIFLH|)Xspa8P
***  v1    0.2 CLI RX  106
**** v1    0.2 CLI RX|Message from VCC-compiler:
**** v1    0.2 CLI RX|Security: Privilege proc_setid missing, will not change uid/gid
**** v1    0.2 CLI RX|Symbol not found.
**** v1    0.2 CLI RX|('<vcl.inline>' Line 21 Pos 9)
**** v1    0.2 CLI RX|        sub vcl_backend_fetch {
**** v1    0.2 CLI RX|--------###--------------------
**** v1    0.2 CLI RX|
**** v1    0.2 CLI RX|Running VCC-compiler failed, exited with 2
**** v1    0.2 CLI RX|VCL compilation failed
---- v1    0.2 FAIL VCL does not compile
*    top   0.2 RESETTING after ../../../bin/varnishtest/tests/c00009.vtc
**   s1    0.2 Waiting for server (3/-1)
**   s2    0.2 Waiting for server (4/-1)
**   v1    0.2 Wait
**** v1    0.2 CLI TX|panic.clear
***  v1    0.2 CLI RX  300
**** v1    0.2 CLI RX|No panic to clear
***  v1    0.2 debug|Info: manager stopping child
***  v1    0.2 debug|Info: manager dies
**** v1    0.2 STDOUT poll 0x10
***  v1    0.2 vsl|No VSL chunk found (child not started ?)
**   v1    0.2 WAIT4 pid=22613 status=0x0000 (user 0.009000 sys 0.028000)
*    top   0.2 TEST ../../../bin/varnishtest/tests/c00009.vtc FAILED
#    top  TEST ../../../bin/varnishtest/tests/c00009.vtc FAILED (0.250) exit=2

1 @ FreeBSD amd64 11.2-REL 1.04 phk

*    top   0.0 TEST ../../../../bin/varnishtest/tests/c00009.vtc starting
[...]
*    top   0.0 TEST Test restarts
[...]
**** v1    0.1 CLI TX|\t\t}
**** v1    0.1 CLI TX|\t\tset resp.http.method = req.method;
**** v1    0.1 CLI TX|\t\tset resp.http.url = req.url;
**** v1    0.1 CLI TX|\t\tset resp.http.proto = req.proto;
**** v1    0.1 CLI TX|\t\tset resp.http.preserveme = req.http.preserveme;
**** v1    0.1 CLI TX|\t\tset resp.http.restarts = req.restarts;
**** v1    0.1 CLI TX|\t\tset resp.http.storage = req.storage;
**** v1    0.1 CLI TX|\t\tset resp.http.ttl = req.ttl;
**** v1    0.1 CLI TX|\t\tset resp.http.esi = req.esi;
**** v1    0.1 CLI TX|\t\tset resp.http.backend_hint = req.backend_hint;
**** v1    0.1 CLI TX|\t\tset resp.http.hash-ignore-busy = req.hash_ignore_busy;
**** v1    0.1 CLI TX|\t\tset resp.http.hash-always-miss = req.hash_always_miss;
**** v1    0.1 CLI TX|\t}
**** v1    0.1 CLI TX|
**** v1    0.1 CLI TX|%XJEIFLH|)Xspa8P
***  v1    0.2 CLI RX  106
**** v1    0.2 CLI RX|Message from VCC-compiler:
**** v1    0.2 CLI RX|Symbol not found.
**** v1    0.2 CLI RX|('<vcl.inline>' Line 21 Pos 9)
**** v1    0.2 CLI RX|        sub vcl_backend_fetch {
**** v1    0.2 CLI RX|--------###--------------------
**** v1    0.2 CLI RX|
**** v1    0.2 CLI RX|Running VCC-compiler failed, exited with 2
**** v1    0.2 CLI RX|VCL compilation failed
---- v1    0.2 FAIL VCL does not compile
*    top   0.2 RESETTING after ../../../../bin/varnishtest/tests/c00009.vtc
**   s1    0.2 Waiting for server (3/-1)
**   s2    0.2 Waiting for server (4/-1)
**   v1    0.2 Wait
**** v1    0.2 CLI TX|panic.clear
***  v1    0.2 vsl|No VSL chunk found (child not started ?)
***  v1    0.3 CLI RX  300
**** v1    0.3 CLI RX|No panic to clear
***  v1    0.3 debug|Info: manager stopping child
***  v1    0.3 debug|Info: manager dies
**** v1    0.3 STDOUT poll 0x11
**   v1    0.3 WAIT4 pid=45686 status=0x0000 (user 0.006776 sys 0.014625)
*    top   0.3 TEST ../../../../bin/varnishtest/tests/c00009.vtc FAILED
#    top  TEST ../../../../bin/varnishtest/tests/c00009.vtc FAILED (0.319) exit=2
FAIL tests/c00009.vtc (exit status: 2)

1 @ SunOS i86pc 5.11 1.04 32_gcc4.7 uplex

*    top   0.0 TEST ../../../bin/varnishtest/tests/c00009.vtc starting
[...]
*    top   0.0 TEST Test restarts
[...]
**** v1    0.2 CLI TX|\t\t}
**** v1    0.2 CLI TX|\t\tset resp.http.method = req.method;
**** v1    0.2 CLI TX|\t\tset resp.http.url = req.url;
**** v1    0.2 CLI TX|\t\tset resp.http.proto = req.proto;
**** v1    0.2 CLI TX|\t\tset resp.http.preserveme = req.http.preserveme;
**** v1    0.2 CLI TX|\t\tset resp.http.restarts = req.restarts;
**** v1    0.2 CLI TX|\t\tset resp.http.storage = req.storage;
**** v1    0.2 CLI TX|\t\tset resp.http.ttl = req.ttl;
**** v1    0.2 CLI TX|\t\tset resp.http.esi = req.esi;
**** v1    0.2 CLI TX|\t\tset resp.http.backend_hint = req.backend_hint;
**** v1    0.2 CLI TX|\t\tset resp.http.hash-ignore-busy = req.hash_ignore_busy;
**** v1    0.2 CLI TX|\t\tset resp.http.hash-always-miss = req.hash_always_miss;
**** v1    0.2 CLI TX|\t}
**** v1    0.2 CLI TX|
**** v1    0.2 CLI TX|%XJEIFLH|)Xspa8P
***  v1    0.2 CLI RX  106
**** v1    0.2 CLI RX|Message from VCC-compiler:
**** v1    0.2 CLI RX|Security: Privilege proc_setid missing, will not change uid/gid
**** v1    0.2 CLI RX|Symbol not found.
**** v1    0.2 CLI RX|('<vcl.inline>' Line 21 Pos 9)
**** v1    0.2 CLI RX|        sub vcl_backend_fetch {
**** v1    0.2 CLI RX|--------###--------------------
**** v1    0.2 CLI RX|
**** v1    0.2 CLI RX|Running VCC-compiler failed, exited with 2
**** v1    0.2 CLI RX|VCL compilation failed
---- v1    0.2 FAIL VCL does not compile
*    top   0.2 RESETTING after ../../../bin/varnishtest/tests/c00009.vtc
**   s1    0.2 Waiting for server (3/-1)
**   s2    0.2 Waiting for server (4/-1)
**   v1    0.2 Wait
**** v1    0.2 CLI TX|panic.clear
***  v1    0.2 CLI RX  300
**** v1    0.2 CLI RX|No panic to clear
***  v1    0.2 debug|Info: manager stopping child
***  v1    0.2 debug|Info: manager dies
**** v1    0.2 STDOUT poll 0x10
***  v1    0.3 vsl|No VSL chunk found (child not started ?)
**   v1    0.3 WAIT4 pid=26483 status=0x0000 (user 0.010000 sys 0.030000)
*    top   0.3 TEST ../../../bin/varnishtest/tests/c00009.vtc FAILED
#    top  TEST ../../../bin/varnishtest/tests/c00009.vtc FAILED (0.261) exit=2

1 @ SunOS i86pc 5.11 1.04 32_sun12.4 uplex

*    top   0.0 TEST ../../../bin/varnishtest/tests/c00009.vtc starting
[...]
*    top   0.0 TEST Test restarts
[...]
**** v1    0.2 CLI TX|\t\t}
**** v1    0.2 CLI TX|\t\tset resp.http.method = req.method;
**** v1    0.2 CLI TX|\t\tset resp.http.url = req.url;
**** v1    0.2 CLI TX|\t\tset resp.http.proto = req.proto;
**** v1    0.2 CLI TX|\t\tset resp.http.preserveme = req.http.preserveme;
**** v1    0.2 CLI TX|\t\tset resp.http.restarts = req.restarts;
**** v1    0.2 CLI TX|\t\tset resp.http.storage = req.storage;
**** v1    0.2 CLI TX|\t\tset resp.http.ttl = req.ttl;
**** v1    0.2 CLI TX|\t\tset resp.http.esi = req.esi;
**** v1    0.2 CLI TX|\t\tset resp.http.backend_hint = req.backend_hint;
**** v1    0.2 CLI TX|\t\tset resp.http.hash-ignore-busy = req.hash_ignore_busy;
**** v1    0.2 CLI TX|\t\tset resp.http.hash-always-miss = req.hash_always_miss;
**** v1    0.2 CLI TX|\t}
**** v1    0.2 CLI TX|
**** v1    0.2 CLI TX|%XJEIFLH|)Xspa8P
***  v1    0.2 CLI RX  106
**** v1    0.2 CLI RX|Message from VCC-compiler:
**** v1    0.2 CLI RX|Security: Privilege proc_setid missing, will not change uid/gid
**** v1    0.2 CLI RX|Symbol not found.
**** v1    0.2 CLI RX|('<vcl.inline>' Line 21 Pos 9)
**** v1    0.2 CLI RX|        sub vcl_backend_fetch {
**** v1    0.2 CLI RX|--------###--------------------
**** v1    0.2 CLI RX|
**** v1    0.2 CLI RX|Running VCC-compiler failed, exited with 2
**** v1    0.2 CLI RX|VCL compilation failed
---- v1    0.2 FAIL VCL does not compile
*    top   0.2 RESETTING after ../../../bin/varnishtest/tests/c00009.vtc
**   s1    0.2 Waiting for server (3/-1)
**   s2    0.2 Waiting for server (4/-1)
**   v1    0.2 Wait
**** v1    0.2 CLI TX|panic.clear
***  v1    0.2 CLI RX  300
**** v1    0.2 CLI RX|No panic to clear
***  v1    0.2 debug|Info: manager stopping child
***  v1    0.2 debug|Info: manager dies
**** v1    0.2 STDOUT poll 0x10
***  v1    0.3 vsl|No VSL chunk found (child not started ?)
**   v1    0.3 WAIT4 pid=45030 status=0x0000 (user 0.011000 sys 0.033000)
*    top   0.3 TEST ../../../bin/varnishtest/tests/c00009.vtc FAILED
#    top  TEST ../../../bin/varnishtest/tests/c00009.vtc FAILED (0.262) exit=2

1 @ FreeBSD amd64 11.2-REL 1.04 GCOV phk

*    top   0.0 TEST ./tests/c00009.vtc starting
[...]
*    top   0.0 TEST Test restarts
[...]
**** v1    0.5 CLI TX|\t\tset resp.http.esi = req.esi;
**** v1    0.5 CLI TX|\t\tset resp.http.backend_hint = req.backend_hint;
**** v1    0.5 CLI TX|\t\tset resp.http.hash-ignore-busy = req.hash_ignore_busy;
**** v1    0.5 CLI TX|\t\tset resp.http.hash-always-miss = req.hash_always_miss;
**** v1    0.5 CLI TX|\t}
**** v1    0.5 CLI TX|
**** v1    0.5 CLI TX|%XJEIFLH|)Xspa8P
***  v1    0.6 vsl|No VSL chunk found (child not started ?)
***  v1    0.7 vsl|No VSL chunk found (child not started ?)
***  v1    0.8 vsl|No VSL chunk found (child not started ?)
***  v1    0.9 vsl|No VSL chunk found (child not started ?)
***  v1    1.0 vsl|No VSL chunk found (child not started ?)
***  v1    1.1 vsl|No VSL chunk found (child not started ?)
***  v1    1.2 vsl|No VSL chunk found (child not started ?)
***  v1    1.3 vsl|No VSL chunk found (child not started ?)
***  v1    1.4 CLI RX  106
**** v1    1.4 CLI RX|Message from VCC-compiler:
**** v1    1.4 CLI RX|Symbol not found.
**** v1    1.4 CLI RX|('<vcl.inline>' Line 21 Pos 9)
**** v1    1.4 CLI RX|        sub vcl_backend_fetch {
**** v1    1.4 CLI RX|--------###--------------------
**** v1    1.4 CLI RX|
**** v1    1.4 CLI RX|Running VCC-compiler failed, exited with 2
**** v1    1.4 CLI RX|VCL compilation failed
---- v1    1.4 FAIL VCL does not compile
*    top   1.4 RESETTING after ./tests/c00009.vtc
**   s1    1.4 Waiting for server (3/-1)
**   s2    1.4 Waiting for server (4/-1)
**   v1    1.4 Wait
**** v1    1.4 CLI TX|panic.clear
***  v1    1.4 vsl|No VSL chunk found (child not started ?)
***  v1    1.5 CLI RX  300
**** v1    1.5 CLI RX|No panic to clear
***  v1    1.5 debug|Info: manager stopping child
***  v1    1.5 debug|Info: manager dies
**** v1    1.9 STDOUT poll 0x11
**   v1    1.9 WAIT4 pid=47237 status=0x0000 (user 0.127107 sys 1.255187)
*    top   1.9 TEST ./tests/c00009.vtc FAILED
#    top  TEST ./tests/c00009.vtc FAILED (2.253) exit=2
FAIL tests/c00009.vtc (exit status: 2)

1 @ SunOS i86pc 5.11 1.04 64_sun12.4 uplex

*    top   0.0 TEST ../../../bin/varnishtest/tests/c00009.vtc starting
[...]
*    top   0.0 TEST Test restarts
[...]
**** v1    0.1 CLI TX|\t\t}
**** v1    0.1 CLI TX|\t\tset resp.http.method = req.method;
**** v1    0.1 CLI TX|\t\tset resp.http.url = req.url;
**** v1    0.1 CLI TX|\t\tset resp.http.proto = req.proto;
**** v1    0.1 CLI TX|\t\tset resp.http.preserveme = req.http.preserveme;
**** v1    0.1 CLI TX|\t\tset resp.http.restarts = req.restarts;
**** v1    0.1 CLI TX|\t\tset resp.http.storage = req.storage;
**** v1    0.1 CLI TX|\t\tset resp.http.ttl = req.ttl;
**** v1    0.1 CLI TX|\t\tset resp.http.esi = req.esi;
**** v1    0.1 CLI TX|\t\tset resp.http.backend_hint = req.backend_hint;
**** v1    0.1 CLI TX|\t\tset resp.http.hash-ignore-busy = req.hash_ignore_busy;
**** v1    0.1 CLI TX|\t\tset resp.http.hash-always-miss = req.hash_always_miss;
**** v1    0.1 CLI TX|\t}
**** v1    0.1 CLI TX|
**** v1    0.1 CLI TX|%XJEIFLH|)Xspa8P
***  v1    0.2 CLI RX  106
**** v1    0.2 CLI RX|Message from VCC-compiler:
**** v1    0.2 CLI RX|Security: Privilege proc_setid missing, will not change uid/gid
**** v1    0.2 CLI RX|Symbol not found.
**** v1    0.2 CLI RX|('<vcl.inline>' Line 21 Pos 9)
**** v1    0.2 CLI RX|        sub vcl_backend_fetch {
**** v1    0.2 CLI RX|--------###--------------------
**** v1    0.2 CLI RX|
**** v1    0.2 CLI RX|Running VCC-compiler failed, exited with 2
**** v1    0.2 CLI RX|VCL compilation failed
---- v1    0.2 FAIL VCL does not compile
*    top   0.2 RESETTING after ../../../bin/varnishtest/tests/c00009.vtc
**   s1    0.2 Waiting for server (3/-1)
**   s2    0.2 Waiting for server (4/-1)
**   v1    0.2 Wait
**** v1    0.2 CLI TX|panic.clear
***  v1    0.2 CLI RX  300
**** v1    0.2 CLI RX|No panic to clear
***  v1    0.2 debug|Info: manager stopping child
***  v1    0.2 debug|Info: manager dies
**** v1    0.2 STDOUT poll 0x10
***  v1    0.2 vsl|No VSL chunk found (child not started ?)
**   v1    0.2 WAIT4 pid=29209 status=0x0000 (user 0.009000 sys 0.027000)
*    top   0.2 TEST ../../../bin/varnishtest/tests/c00009.vtc FAILED
#    top  TEST ../../../bin/varnishtest/tests/c00009.vtc FAILED (0.250) exit=2

1 @ SunOS i86pc 5.11 1.04 64_gcc4.7 uplex

*    top   0.0 TEST ../../../bin/varnishtest/tests/c00009.vtc starting
[...]
*    top   0.0 TEST Test restarts
[...]
**** v1    0.1 CLI TX|\t\t}
**** v1    0.1 CLI TX|\t\tset resp.http.method = req.method;
**** v1    0.1 CLI TX|\t\tset resp.http.url = req.url;
**** v1    0.1 CLI TX|\t\tset resp.http.proto = req.proto;
**** v1    0.1 CLI TX|\t\tset resp.http.preserveme = req.http.preserveme;
**** v1    0.1 CLI TX|\t\tset resp.http.restarts = req.restarts;
**** v1    0.1 CLI TX|\t\tset resp.http.storage = req.storage;
**** v1    0.1 CLI TX|\t\tset resp.http.ttl = req.ttl;
**** v1    0.1 CLI TX|\t\tset resp.http.esi = req.esi;
**** v1    0.1 CLI TX|\t\tset resp.http.backend_hint = req.backend_hint;
**** v1    0.1 CLI TX|\t\tset resp.http.hash-ignore-busy = req.hash_ignore_busy;
**** v1    0.1 CLI TX|\t\tset resp.http.hash-always-miss = req.hash_always_miss;
**** v1    0.1 CLI TX|\t}
**** v1    0.1 CLI TX|
**** v1    0.1 CLI TX|%XJEIFLH|)Xspa8P
***  v1    0.2 CLI RX  106
**** v1    0.2 CLI RX|Message from VCC-compiler:
**** v1    0.2 CLI RX|Security: Privilege proc_setid missing, will not change uid/gid
**** v1    0.2 CLI RX|Symbol not found.
**** v1    0.2 CLI RX|('<vcl.inline>' Line 21 Pos 9)
**** v1    0.2 CLI RX|        sub vcl_backend_fetch {
**** v1    0.2 CLI RX|--------###--------------------
**** v1    0.2 CLI RX|
**** v1    0.2 CLI RX|Running VCC-compiler failed, exited with 2
**** v1    0.2 CLI RX|VCL compilation failed
---- v1    0.2 FAIL VCL does not compile
*    top   0.2 RESETTING after ../../../bin/varnishtest/tests/c00009.vtc
**   s1    0.2 Waiting for server (3/-1)
**   s2    0.2 Waiting for server (4/-1)
**   v1    0.2 Wait
**** v1    0.2 CLI TX|panic.clear
***  v1    0.2 CLI RX  300
**** v1    0.2 CLI RX|No panic to clear
***  v1    0.2 debug|Info: manager stopping child
***  v1    0.2 debug|Info: manager dies
**** v1    0.2 STDOUT poll 0x10
***  v1    0.2 vsl|No VSL chunk found (child not started ?)
**   v1    0.2 WAIT4 pid=50385 status=0x0000 (user 0.009000 sys 0.025000)
*    top   0.2 TEST ../../../bin/varnishtest/tests/c00009.vtc FAILED
#    top  TEST ../../../bin/varnishtest/tests/c00009.vtc FAILED (0.250) exit=2

1 @ FreeBSD amd64 11.2-REL 1.04 phk

*    top   0.0 TEST ../../../../bin/varnishtest/tests/c00009.vtc starting
[...]
*    top   0.0 TEST Test restarts
[...]
**** v1    0.1 CLI TX|\t\tset resp.http.method = req.method;
**** v1    0.1 CLI TX|\t\tset resp.http.url = req.url;
**** v1    0.1 CLI TX|\t\tset resp.http.proto = req.proto;
**** v1    0.1 CLI TX|\t\tset resp.http.preserveme = req.http.preserveme;
**** v1    0.1 CLI TX|\t\tset resp.http.restarts = req.restarts;
**** v1    0.1 CLI TX|\t\tset resp.http.storage = req.storage;
**** v1    0.1 CLI TX|\t\tset resp.http.ttl = req.ttl;
**** v1    0.1 CLI TX|\t\tset resp.http.esi = req.esi;
**** v1    0.1 CLI TX|\t\tset resp.http.backend_hint = req.backend_hint;
**** v1    0.1 CLI TX|\t\tset resp.http.hash-ignore-busy = req.hash_ignore_busy;
**** v1    0.1 CLI TX|\t\tset resp.http.hash-always-miss = req.hash_always_miss;
**** v1    0.1 CLI TX|\t}
**** v1    0.1 CLI TX|
**** v1    0.1 CLI TX|%XJEIFLH|)Xspa8P
***  v1    0.2 vsl|No VSL chunk found (child not started ?)
***  v1    0.2 CLI RX  106
**** v1    0.2 CLI RX|Message from VCC-compiler:
**** v1    0.2 CLI RX|Symbol not found.
**** v1    0.2 CLI RX|('<vcl.inline>' Line 21 Pos 9)
**** v1    0.2 CLI RX|        sub vcl_backend_fetch {
**** v1    0.2 CLI RX|--------###--------------------
**** v1    0.2 CLI RX|
**** v1    0.2 CLI RX|Running VCC-compiler failed, exited with 2
**** v1    0.2 CLI RX|VCL compilation failed
---- v1    0.2 FAIL VCL does not compile
*    top   0.2 RESETTING after ../../../../bin/varnishtest/tests/c00009.vtc
**   s1    0.2 Waiting for server (3/-1)
**   s2    0.2 Waiting for server (4/-1)
**   v1    0.2 Wait
**** v1    0.2 CLI TX|panic.clear
***  v1    0.3 vsl|No VSL chunk found (child not started ?)
***  v1    0.3 CLI RX  300
**** v1    0.3 CLI RX|No panic to clear
***  v1    0.3 debug|Info: manager stopping child
***  v1    0.3 debug|Info: manager dies
**** v1    0.3 STDOUT poll 0x11
**   v1    0.3 WAIT4 pid=57042 status=0x0000 (user 0.009964 sys 0.011870)
*    top   0.3 TEST ../../../../bin/varnishtest/tests/c00009.vtc FAILED
#    top  TEST ../../../../bin/varnishtest/tests/c00009.vtc FAILED (0.341) exit=2
FAIL tests/c00009.vtc (exit status: 2)

1 @ SunOS i86pc 5.11 1.04 32_gcc4.7 uplex

*    top   0.0 TEST ../../../bin/varnishtest/tests/c00009.vtc starting
[...]
*    top   0.0 TEST Test restarts
[...]
**** v1    0.1 CLI TX|\t\tset resp.http.method = req.method;
**** v1    0.1 CLI TX|\t\tset resp.http.url = req.url;
**** v1    0.1 CLI TX|\t\tset resp.http.proto = req.proto;
**** v1    0.1 CLI TX|\t\tset resp.http.preserveme = req.http.preserveme;
**** v1    0.1 CLI TX|\t\tset resp.http.restarts = req.restarts;
**** v1    0.1 CLI TX|\t\tset resp.http.storage = req.storage;
**** v1    0.1 CLI TX|\t\tset resp.http.ttl = req.ttl;
**** v1    0.1 CLI TX|\t\tset resp.http.esi = req.esi;
**** v1    0.1 CLI TX|\t\tset resp.http.backend_hint = req.backend_hint;
**** v1    0.1 CLI TX|\t\tset resp.http.hash-ignore-busy = req.hash_ignore_busy;
**** v1    0.1 CLI TX|\t\tset resp.http.hash-always-miss = req.hash_always_miss;
**** v1    0.1 CLI TX|\t}
**** v1    0.1 CLI TX|
**** v1    0.1 CLI TX|%XJEIFLH|)Xspa8P
***  v1    0.2 CLI RX  106
**** v1    0.2 CLI RX|Message from VCC-compiler:
**** v1    0.2 CLI RX|Security: Privilege proc_setid missing, will not change uid/gid
**** v1    0.2 CLI RX|Symbol not found.
**** v1    0.2 CLI RX|('<vcl.inline>' Line 21 Pos 9)
**** v1    0.2 CLI RX|        sub vcl_backend_fetch {
**** v1    0.2 CLI RX|--------###--------------------
**** v1    0.2 CLI RX|
**** v1    0.2 CLI RX|Running VCC-compiler failed, exited with 2
**** v1    0.2 CLI RX|VCL compilation failed
---- v1    0.2 FAIL VCL does not compile
*    top   0.2 RESETTING after ../../../bin/varnishtest/tests/c00009.vtc
**   s1    0.2 Waiting for server (3/-1)
**   s2    0.2 Waiting for server (4/-1)
**   v1    0.2 Wait
**** v1    0.2 CLI TX|panic.clear
***  v1    0.2 CLI RX  300
**** v1    0.2 CLI RX|No panic to clear
***  v1    0.2 debug|Info: manager stopping child
***  v1    0.2 debug|Info: manager dies
***  v1    0.2 debug|
**** v1    0.2 STDOUT poll 0x10
***  v1    0.2 vsl|No VSL chunk found (child not started ?)
**   v1    0.2 WAIT4 pid=47106 status=0x0000 (user 0.009000 sys 0.026000)
*    top   0.2 TEST ../../../bin/varnishtest/tests/c00009.vtc FAILED
#    top  TEST ../../../bin/varnishtest/tests/c00009.vtc FAILED (0.252) exit=2

1 @ SunOS i86pc 5.11 1.04 32_gcc4.7 uplex

*    top   0.0 TEST ../../../bin/varnishtest/tests/c00009.vtc starting
[...]
*    top   0.0 TEST Test restarts
[...]
**** v1    0.2 CLI TX|\t\tset resp.http.method = req.method;
**** v1    0.2 CLI TX|\t\tset resp.http.url = req.url;
**** v1    0.2 CLI TX|\t\tset resp.http.proto = req.proto;
**** v1    0.2 CLI TX|\t\tset resp.http.preserveme = req.http.preserveme;
**** v1    0.2 CLI TX|\t\tset resp.http.restarts = req.restarts;
**** v1    0.2 CLI TX|\t\tset resp.http.storage = req.storage;
**** v1    0.2 CLI TX|\t\tset resp.http.ttl = req.ttl;
**** v1    0.2 CLI TX|\t\tset resp.http.esi = req.esi;
**** v1    0.2 CLI TX|\t\tset resp.http.backend_hint = req.backend_hint;
**** v1    0.2 CLI TX|\t\tset resp.http.hash-ignore-busy = req.hash_ignore_busy;
**** v1    0.2 CLI TX|\t\tset resp.http.hash-always-miss = req.hash_always_miss;
**** v1    0.2 CLI TX|\t}
**** v1    0.2 CLI TX|
**** v1    0.2 CLI TX|%XJEIFLH|)Xspa8P
***  v1    0.2 CLI RX  106
**** v1    0.2 CLI RX|Message from VCC-compiler:
**** v1    0.2 CLI RX|Security: Privilege proc_setid missing, will not change uid/gid
**** v1    0.2 CLI RX|Symbol not found.
**** v1    0.2 CLI RX|('<vcl.inline>' Line 21 Pos 9)
**** v1    0.2 CLI RX|        sub vcl_backend_fetch {
**** v1    0.2 CLI RX|--------###--------------------
**** v1    0.2 CLI RX|
**** v1    0.2 CLI RX|Running VCC-compiler failed, exited with 2
**** v1    0.2 CLI RX|VCL compilation failed
---- v1    0.2 FAIL VCL does not compile
*    top   0.2 RESETTING after ../../../bin/varnishtest/tests/c00009.vtc
**   s1    0.2 Waiting for server (3/-1)
**   s2    0.2 Waiting for server (4/-1)
**   v1    0.2 Wait
**** v1    0.2 CLI TX|panic.clear
***  v1    0.2 CLI RX  300
**** v1    0.2 CLI RX|No panic to clear
***  v1    0.2 debug|Info: manager stopping child
***  v1    0.2 debug|Info:
***  v1    0.2 debug|manager dies
**** v1    0.2 STDOUT poll 0x10
***  v1    0.3 vsl|No VSL chunk found (child not started ?)
**   v1    0.3 WAIT4 pid=37973 status=0x0000 (user 0.011000 sys 0.040000)
*    top   0.3 TEST ../../../bin/varnishtest/tests/c00009.vtc FAILED
#    top  TEST ../../../bin/varnishtest/tests/c00009.vtc FAILED (0.298) exit=2

1 @ FreeBSD i386 11.2-REL 1.04 phk

*    top   0.0 TEST ../../../../bin/varnishtest/tests/c00009.vtc starting
[...]
*    top   0.0 TEST Test restarts
[...]
**** v1    0.1 CLI TX|\t\tset resp.http.method = req.method;
**** v1    0.1 CLI TX|\t\tset resp.http.url = req.url;
**** v1    0.1 CLI TX|\t\tset resp.http.proto = req.proto;
**** v1    0.1 CLI TX|\t\tset resp.http.preserveme = req.http.preserveme;
**** v1    0.1 CLI TX|\t\tset resp.http.restarts = req.restarts;
**** v1    0.1 CLI TX|\t\tset resp.http.storage = req.storage;
**** v1    0.1 CLI TX|\t\tset resp.http.ttl = req.ttl;
**** v1    0.1 CLI TX|\t\tset resp.http.esi = req.esi;
**** v1    0.1 CLI TX|\t\tset resp.http.backend_hint = req.backend_hint;
**** v1    0.1 CLI TX|\t\tset resp.http.hash-ignore-busy = req.hash_ignore_busy;
**** v1    0.1 CLI TX|\t\tset resp.http.hash-always-miss = req.hash_always_miss;
**** v1    0.1 CLI TX|\t}
**** v1    0.1 CLI TX|
**** v1    0.1 CLI TX|%XJEIFLH|)Xspa8P
***  v1    0.2 vsl|No VSL chunk found (child not started ?)
***  v1    0.2 CLI RX  106
**** v1    0.2 CLI RX|Message from VCC-compiler:
**** v1    0.2 CLI RX|Symbol not found.
**** v1    0.2 CLI RX|('<vcl.inline>' Line 21 Pos 9)
**** v1    0.2 CLI RX|        sub vcl_backend_fetch {
**** v1    0.2 CLI RX|--------###--------------------
**** v1    0.2 CLI RX|
**** v1    0.2 CLI RX|Running VCC-compiler failed, exited with 2
**** v1    0.2 CLI RX|VCL compilation failed
---- v1    0.2 FAIL VCL does not compile
*    top   0.2 RESETTING after ../../../../bin/varnishtest/tests/c00009.vtc
**   s1    0.2 Waiting for server (3/-1)
**   s2    0.2 Waiting for server (4/-1)
**   v1    0.2 Wait
**** v1    0.2 CLI TX|panic.clear
***  v1    0.3 CLI RX  300
**** v1    0.3 CLI RX|No panic to clear
***  v1    0.3 debug|Info: manager stopping child
***  v1    0.3 debug|Info: manager dies
**** v1    0.3 STDOUT poll 0x11
***  v1    0.3 vsl|No VSL chunk found (child not started ?)
**   v1    0.3 WAIT4 pid=71110 status=0x0000 (user 0.000000 sys 0.011804)
*    top   0.3 TEST ../../../../bin/varnishtest/tests/c00009.vtc FAILED
#    top  TEST ../../../../bin/varnishtest/tests/c00009.vtc FAILED (0.332) exit=2
FAIL tests/c00009.vtc (exit status: 2)

1 @ SunOS i86pc 5.11 1.04 64_gcc4.7 uplex

*    top   0.0 TEST ../../../bin/varnishtest/tests/c00009.vtc starting
[...]
*    top   0.0 TEST Test restarts
[...]
**** v1    0.2 CLI TX|\t\t}
**** v1    0.2 CLI TX|\t\tset resp.http.method = req.method;
**** v1    0.2 CLI TX|\t\tset resp.http.url = req.url;
**** v1    0.2 CLI TX|\t\tset resp.http.proto = req.proto;
**** v1    0.2 CLI TX|\t\tset resp.http.preserveme = req.http.preserveme;
**** v1    0.2 CLI TX|\t\tset resp.http.restarts = req.restarts;
**** v1    0.2 CLI TX|\t\tset resp.http.storage = req.storage;
**** v1    0.2 CLI TX|\t\tset resp.http.ttl = req.ttl;
**** v1    0.2 CLI TX|\t\tset resp.http.esi = req.esi;
**** v1    0.2 CLI TX|\t\tset resp.http.backend_hint = req.backend_hint;
**** v1    0.2 CLI TX|\t\tset resp.http.hash-ignore-busy = req.hash_ignore_busy;
**** v1    0.2 CLI TX|\t\tset resp.http.hash-always-miss = req.hash_always_miss;
**** v1    0.2 CLI TX|\t}
**** v1    0.2 CLI TX|
**** v1    0.2 CLI TX|%XJEIFLH|)Xspa8P
***  v1    0.2 CLI RX  106
**** v1    0.2 CLI RX|Message from VCC-compiler:
**** v1    0.2 CLI RX|Security: Privilege proc_setid missing, will not change uid/gid
**** v1    0.2 CLI RX|Symbol not found.
**** v1    0.2 CLI RX|('<vcl.inline>' Line 21 Pos 9)
**** v1    0.2 CLI RX|        sub vcl_backend_fetch {
**** v1    0.2 CLI RX|--------###--------------------
**** v1    0.2 CLI RX|
**** v1    0.2 CLI RX|Running VCC-compiler failed, exited with 2
**** v1    0.2 CLI RX|VCL compilation failed
---- v1    0.2 FAIL VCL does not compile
*    top   0.2 RESETTING after ../../../bin/varnishtest/tests/c00009.vtc
**   s1    0.2 Waiting for server (3/-1)
**   s2    0.2 Waiting for server (4/-1)
**   v1    0.2 Wait
**** v1    0.2 CLI TX|panic.clear
***  v1    0.2 CLI RX  300
**** v1    0.2 CLI RX|No panic to clear
***  v1    0.2 debug|Info: manager stopping child
***  v1    0.2 debug|Info: manager dies
**** v1    0.2 STDOUT poll 0x10
***  v1    0.3 vsl|No VSL chunk found (child not started ?)
**   v1    0.3 WAIT4 pid=52146 status=0x0000 (user 0.009000 sys 0.032000)
*    top   0.3 TEST ../../../bin/varnishtest/tests/c00009.vtc FAILED
#    top  TEST ../../../bin/varnishtest/tests/c00009.vtc FAILED (0.256) exit=2

1 @ Linux x86_64 3.10.0 1.04 phk

*    top   0.0 TEST ../../../bin/varnishtest/tests/c00009.vtc starting
[...]
*    top   0.0 TEST Test restarts
[...]
**** v1    0.1 CLI TX|\t\tif (resp.status != 200) {
**** v1    0.1 CLI TX|\t\t\treturn (restart);
**** v1    0.1 CLI TX|\t\t}
**** v1    0.1 CLI TX|\t\tset resp.http.method = req.method;
**** v1    0.1 CLI TX|\t\tset resp.http.url = req.url;
**** v1    0.1 CLI TX|\t\tset resp.http.proto = req.proto;
**** v1    0.1 CLI TX|\t\tset resp.http.preserveme = req.http.preserveme;
**** v1    0.1 CLI TX|\t\tset resp.http.restarts = req.restarts;
**** v1    0.1 CLI TX|\t\tset resp.http.storage = req.storage;
**** v1    0.1 CLI TX|\t\tset resp.http.ttl = req.ttl;
**** v1    0.1 CLI TX|\t\tset resp.http.esi = req.esi;
**** v1    0.1 CLI TX|\t\tset resp.http.backend_hint = req.backend_hint;
**** v1    0.1 CLI TX|\t\tset resp.http.hash-ignore-busy = req.hash_ignore_busy;
**** v1    0.1 CLI TX|\t\tset resp.http.hash-always-miss = req.hash_always_miss;
**** v1    0.1 CLI TX|\t}
**** v1    0.1 CLI TX|
**** v1    0.1 CLI TX|%XJEIFLH|)Xspa8P
***  v1    0.1 CLI RX  106
**** v1    0.1 CLI RX|Message from VCC-compiler:
**** v1    0.1 CLI RX|Symbol not found.
**** v1    0.1 CLI RX|('<vcl.inline>' Line 21 Pos 9)
**** v1    0.1 CLI RX|        sub vcl_backend_fetch {
**** v1    0.1 CLI RX|--------###--------------------
**** v1    0.1 CLI RX|
**** v1    0.1 CLI RX|Running VCC-compiler failed, exited with 2
**** v1    0.1 CLI RX|VCL compilation failed
---- v1    0.1 FAIL VCL does not compile
*    top   0.1 RESETTING after ../../../bin/varnishtest/tests/c00009.vtc
**   s1    0.1 Waiting for server (4/-1)
**   s2    0.1 Waiting for server (5/-1)
**   v1    0.1 Wait
**** v1    0.1 CLI TX|panic.clear
***  v1    0.2 CLI RX  300
**** v1    0.2 CLI RX|No panic to clear
***  v1    0.2 debug|Info: manager stopping child
***  v1    0.2 debug|Info: manager dies
**** v1    0.2 STDOUT poll 0x10
**   v1    0.2 WAIT4 pid=24529 status=0x0000 (user 0.004138 sys 0.006869)
*    top   0.2 TEST ../../../bin/varnishtest/tests/c00009.vtc FAILED
#    top  TEST ../../../bin/varnishtest/tests/c00009.vtc FAILED (0.156) exit=2

1 @ FreeBSD amd64 11.2-REL 1.04 phk

*    top   0.0 TEST ../../../../bin/varnishtest/tests/c00009.vtc starting
[...]
*    top   0.0 TEST Test restarts
[...]
**** v1    0.1 CLI TX|\t\tset resp.http.method = req.method;
**** v1    0.1 CLI TX|\t\tset resp.http.url = req.url;
**** v1    0.1 CLI TX|\t\tset resp.http.proto = req.proto;
**** v1    0.1 CLI TX|\t\tset resp.http.preserveme = req.http.preserveme;
**** v1    0.1 CLI TX|\t\tset resp.http.restarts = req.restarts;
**** v1    0.1 CLI TX|\t\tset resp.http.storage = req.storage;
**** v1    0.1 CLI TX|\t\tset resp.http.ttl = req.ttl;
**** v1    0.1 CLI TX|\t\tset resp.http.esi = req.esi;
**** v1    0.1 CLI TX|\t\tset resp.http.backend_hint = req.backend_hint;
**** v1    0.1 CLI TX|\t\tset resp.http.hash-ignore-busy = req.hash_ignore_busy;
**** v1    0.1 CLI TX|\t\tset resp.http.hash-always-miss = req.hash_always_miss;
**** v1    0.1 CLI TX|\t}
**** v1    0.1 CLI TX|
**** v1    0.1 CLI TX|%XJEIFLH|)Xspa8P
***  v1    0.2 vsl|No VSL chunk found (child not started ?)
***  v1    0.2 CLI RX  106
**** v1    0.2 CLI RX|Message from VCC-compiler:
**** v1    0.2 CLI RX|Symbol not found.
**** v1    0.2 CLI RX|('<vcl.inline>' Line 21 Pos 9)
**** v1    0.2 CLI RX|        sub vcl_backend_fetch {
**** v1    0.2 CLI RX|--------###--------------------
**** v1    0.2 CLI RX|
**** v1    0.2 CLI RX|Running VCC-compiler failed, exited with 2
**** v1    0.2 CLI RX|VCL compilation failed
---- v1    0.2 FAIL VCL does not compile
*    top   0.2 RESETTING after ../../../../bin/varnishtest/tests/c00009.vtc
**   s1    0.2 Waiting for server (3/-1)
**   s2    0.2 Waiting for server (4/-1)
**   v1    0.2 Wait
**** v1    0.2 CLI TX|panic.clear
***  v1    0.3 vsl|No VSL chunk found (child not started ?)
***  v1    0.3 CLI RX  300
**** v1    0.3 CLI RX|No panic to clear
***  v1    0.3 debug|Info: manager stopping child
***  v1    0.3 debug|Info: manager dies
**** v1    0.3 STDOUT poll 0x11
**   v1    0.3 WAIT4 pid=79231 status=0x0000 (user 0.014078 sys 0.007368)
*    top   0.3 TEST ../../../../bin/varnishtest/tests/c00009.vtc FAILED
#    top  TEST ../../../../bin/varnishtest/tests/c00009.vtc FAILED (0.334) exit=2
FAIL tests/c00009.vtc (exit status: 2)

1 @ SunOS i86pc 5.11 1.04 64_sun12.4 uplex

*    top   0.0 TEST ../../../bin/varnishtest/tests/c00009.vtc starting
[...]
*    top   0.0 TEST Test restarts
[...]
**** v1    0.1 CLI TX|\t\t}
**** v1    0.1 CLI TX|\t\tset resp.http.method = req.method;
**** v1    0.1 CLI TX|\t\tset resp.http.url = req.url;
**** v1    0.1 CLI TX|\t\tset resp.http.proto = req.proto;
**** v1    0.1 CLI TX|\t\tset resp.http.preserveme = req.http.preserveme;
**** v1    0.1 CLI TX|\t\tset resp.http.restarts = req.restarts;
**** v1    0.1 CLI TX|\t\tset resp.http.storage = req.storage;
**** v1    0.1 CLI TX|\t\tset resp.http.ttl = req.ttl;
**** v1    0.1 CLI TX|\t\tset resp.http.esi = req.esi;
**** v1    0.1 CLI TX|\t\tset resp.http.backend_hint = req.backend_hint;
**** v1    0.1 CLI TX|\t\tset resp.http.hash-ignore-busy = req.hash_ignore_busy;
**** v1    0.1 CLI TX|\t\tset resp.http.hash-always-miss = req.hash_always_miss;
**** v1    0.1 CLI TX|\t}
**** v1    0.1 CLI TX|
**** v1    0.1 CLI TX|%XJEIFLH|)Xspa8P
***  v1    0.2 CLI RX  106
**** v1    0.2 CLI RX|Message from VCC-compiler:
**** v1    0.2 CLI RX|Security: Privilege proc_setid missing, will not change uid/gid
**** v1    0.2 CLI RX|Symbol not found.
**** v1    0.2 CLI RX|('<vcl.inline>' Line 21 Pos 9)
**** v1    0.2 CLI RX|        sub vcl_backend_fetch {
**** v1    0.2 CLI RX|--------###--------------------
**** v1    0.2 CLI RX|
**** v1    0.2 CLI RX|Running VCC-compiler failed, exited with 2
**** v1    0.2 CLI RX|VCL compilation failed
---- v1    0.2 FAIL VCL does not compile
*    top   0.2 RESETTING after ../../../bin/varnishtest/tests/c00009.vtc
**   s1    0.2 Waiting for server (3/-1)
**   s2    0.2 Waiting for server (4/-1)
**   v1    0.2 Wait
**** v1    0.2 CLI TX|panic.clear
***  v1    0.2 CLI RX  300
**** v1    0.2 CLI RX|No panic to clear
***  v1    0.2 debug|Info: manager stopping child
***  v1    0.2 debug|Info: manager dies
**** v1    0.2 STDOUT poll 0x10
***  v1    0.2 vsl|No VSL chunk found (child not started ?)
**   v1    0.2 WAIT4 pid=33016 status=0x0000 (user 0.009000 sys 0.028000)
*    top   0.2 TEST ../../../bin/varnishtest/tests/c00009.vtc FAILED
#    top  TEST ../../../bin/varnishtest/tests/c00009.vtc FAILED (0.253) exit=2

1 @ SunOS i86pc 5.11 1.04 32_sun12.4 uplex

*    top   0.0 TEST ../../../bin/varnishtest/tests/c00009.vtc starting
[...]
*    top   0.0 TEST Test restarts
[...]
**** v1    0.2 CLI TX|\t\t}
**** v1    0.2 CLI TX|\t\tset resp.http.method = req.method;
**** v1    0.2 CLI TX|\t\tset resp.http.url = req.url;
**** v1    0.2 CLI TX|\t\tset resp.http.proto = req.proto;
**** v1    0.2 CLI TX|\t\tset resp.http.preserveme = req.http.preserveme;
**** v1    0.2 CLI TX|\t\tset resp.http.restarts = req.restarts;
**** v1    0.2 CLI TX|\t\tset resp.http.storage = req.storage;
**** v1    0.2 CLI TX|\t\tset resp.http.ttl = req.ttl;
**** v1    0.2 CLI TX|\t\tset resp.http.esi = req.esi;
**** v1    0.2 CLI TX|\t\tset resp.http.backend_hint = req.backend_hint;
**** v1    0.2 CLI TX|\t\tset resp.http.hash-ignore-busy = req.hash_ignore_busy;
**** v1    0.2 CLI TX|\t\tset resp.http.hash-always-miss = req.hash_always_miss;
**** v1    0.2 CLI TX|\t}
**** v1    0.2 CLI TX|
**** v1    0.2 CLI TX|%XJEIFLH|)Xspa8P
***  v1    0.2 CLI RX  106
**** v1    0.2 CLI RX|Message from VCC-compiler:
**** v1    0.2 CLI RX|Security: Privilege proc_setid missing, will not change uid/gid
**** v1    0.2 CLI RX|Symbol not found.
**** v1    0.2 CLI RX|('<vcl.inline>' Line 21 Pos 9)
**** v1    0.2 CLI RX|        sub vcl_backend_fetch {
**** v1    0.2 CLI RX|--------###--------------------
**** v1    0.2 CLI RX|
**** v1    0.2 CLI RX|Running VCC-compiler failed, exited with 2
**** v1    0.2 CLI RX|VCL compilation failed
---- v1    0.2 FAIL VCL does not compile
*    top   0.2 RESETTING after ../../../bin/varnishtest/tests/c00009.vtc
**   s1    0.2 Waiting for server (3/-1)
**   s2    0.2 Waiting for server (4/-1)
**   v1    0.2 Wait
**** v1    0.2 CLI TX|panic.clear
***  v1    0.2 CLI RX  300
**** v1    0.2 CLI RX|No panic to clear
***  v1    0.2 debug|Info: manager stopping child
***  v1    0.2 debug|Info: manager dies
**** v1    0.2 STDOUT poll 0x10
***  v1    0.3 vsl|No VSL chunk found (child not started ?)
**   v1    0.3 WAIT4 pid=26992 status=0x0000 (user 0.009000 sys 0.032000)
*    top   0.3 TEST ../../../bin/varnishtest/tests/c00009.vtc FAILED
#    top  TEST ../../../bin/varnishtest/tests/c00009.vtc FAILED (0.256) exit=2

1 @ SunOS i86pc 5.11 1.04 64_sun12.4 uplex

*    top   0.0 TEST ../../../bin/varnishtest/tests/c00009.vtc starting
[...]
*    top   0.0 TEST Test restarts
[...]
**** v1    0.2 CLI TX|\t\t}
**** v1    0.2 CLI TX|\t\tset resp.http.method = req.method;
**** v1    0.2 CLI TX|\t\tset resp.http.url = req.url;
**** v1    0.2 CLI TX|\t\tset resp.http.proto = req.proto;
**** v1    0.2 CLI TX|\t\tset resp.http.preserveme = req.http.preserveme;
**** v1    0.2 CLI TX|\t\tset resp.http.restarts = req.restarts;
**** v1    0.2 CLI TX|\t\tset resp.http.storage = req.storage;
**** v1    0.2 CLI TX|\t\tset resp.http.ttl = req.ttl;
**** v1    0.2 CLI TX|\t\tset resp.http.esi = req.esi;
**** v1    0.2 CLI TX|\t\tset resp.http.backend_hint = req.backend_hint;
**** v1    0.2 CLI TX|\t\tset resp.http.hash-ignore-busy = req.hash_ignore_busy;
**** v1    0.2 CLI TX|\t\tset resp.http.hash-always-miss = req.hash_always_miss;
**** v1    0.2 CLI TX|\t}
**** v1    0.2 CLI TX|
**** v1    0.2 CLI TX|%XJEIFLH|)Xspa8P
***  v1    0.2 CLI RX  106
**** v1    0.2 CLI RX|Message from VCC-compiler:
**** v1    0.2 CLI RX|Security: Privilege proc_setid missing, will not change uid/gid
**** v1    0.2 CLI RX|Symbol not found.
**** v1    0.2 CLI RX|('<vcl.inline>' Line 21 Pos 9)
**** v1    0.2 CLI RX|        sub vcl_backend_fetch {
**** v1    0.2 CLI RX|--------###--------------------
**** v1    0.2 CLI RX|
**** v1    0.2 CLI RX|Running VCC-compiler failed, exited with 2
**** v1    0.2 CLI RX|VCL compilation failed
---- v1    0.2 FAIL VCL does not compile
*    top   0.2 RESETTING after ../../../bin/varnishtest/tests/c00009.vtc
**   s1    0.2 Waiting for server (3/-1)
**   s2    0.2 Waiting for server (4/-1)
**   v1    0.2 Wait
**** v1    0.2 CLI TX|panic.clear
***  v1    0.2 CLI RX  300
**** v1    0.2 CLI RX|No panic to clear
***  v1    0.2 debug|Info: manager stopping child
***  v1    0.2 debug|Info: manager dies
**** v1    0.2 STDOUT poll 0x10
***  v1    0.3 vsl|No VSL chunk found (child not started ?)
**   v1    0.3 WAIT4 pid=45244 status=0x0000 (user 0.010000 sys 0.032000)
*    top   0.3 TEST ../../../bin/varnishtest/tests/c00009.vtc FAILED
#    top  TEST ../../../bin/varnishtest/tests/c00009.vtc FAILED (0.262) exit=2

1 @ SunOS i86pc 5.11 1.04 32_gcc4.7 uplex

*    top   0.0 TEST ../../../bin/varnishtest/tests/c00009.vtc starting
[...]
*    top   0.0 TEST Test restarts
[...]
**** v1    0.2 CLI TX|\t\tset resp.http.method = req.method;
**** v1    0.2 CLI TX|\t\tset resp.http.url = req.url;
**** v1    0.2 CLI TX|\t\tset resp.http.proto = req.proto;
**** v1    0.2 CLI TX|\t\tset resp.http.preserveme = req.http.preserveme;
**** v1    0.2 CLI TX|\t\tset resp.http.restarts = req.restarts;
**** v1    0.2 CLI TX|\t\tset resp.http.storage = req.storage;
**** v1    0.2 CLI TX|\t\tset resp.http.ttl = req.ttl;
**** v1    0.2 CLI TX|\t\tset resp.http.esi = req.esi;
**** v1    0.2 CLI TX|\t\tset resp.http.backend_hint = req.backend_hint;
**** v1    0.2 CLI TX|\t\tset resp.http.hash-ignore-busy = req.hash_ignore_busy;
**** v1    0.2 CLI TX|\t\tset resp.http.hash-always-miss = req.hash_always_miss;
**** v1    0.2 CLI TX|\t}
**** v1    0.2 CLI TX|
**** v1    0.2 CLI TX|%XJEIFLH|)Xspa8P
***  v1    0.2 CLI RX  106
**** v1    0.2 CLI RX|Message from VCC-compiler:
**** v1    0.2 CLI RX|Security: Privilege proc_setid missing, will not change uid/gid
**** v1    0.2 CLI RX|Symbol not found.
**** v1    0.2 CLI RX|('<vcl.inline>' Line 21 Pos 9)
**** v1    0.2 CLI RX|        sub vcl_backend_fetch {
**** v1    0.2 CLI RX|--------###--------------------
**** v1    0.2 CLI RX|
**** v1    0.2 CLI RX|Running VCC-compiler failed, exited with 2
**** v1    0.2 CLI RX|VCL compilation failed
---- v1    0.2 FAIL VCL does not compile
*    top   0.2 RESETTING after ../../../bin/varnishtest/tests/c00009.vtc
**   s1    0.2 Waiting for server (3/-1)
**   s2    0.2 Waiting for server (4/-1)
**   v1    0.2 Wait
**** v1    0.2 CLI TX|panic.clear
***  v1    0.2 CLI RX  300
**** v1    0.2 CLI RX|No panic to clear
***  v1    0.2 debug|Info: manager stopping child
***  v1    0.2 debug|Info:
***  v1    0.2 debug|manager dies
**** v1    0.2 STDOUT poll 0x10
***  v1    0.3 vsl|No VSL chunk found (child not started ?)
**   v1    0.3 WAIT4 pid=53132 status=0x0000 (user 0.009000 sys 0.030000)
*    top   0.3 TEST ../../../bin/varnishtest/tests/c00009.vtc FAILED
#    top  TEST ../../../bin/varnishtest/tests/c00009.vtc FAILED (0.258) exit=2

1 @ SunOS i86pc 5.11 1.04 32_sun12.4 uplex

*    top   0.0 TEST ../../../bin/varnishtest/tests/c00009.vtc starting
[...]
*    top   0.0 TEST Test restarts
[...]
**** v1    0.2 CLI TX|\t\t}
**** v1    0.2 CLI TX|\t\tset resp.http.method = req.method;
**** v1    0.2 CLI TX|\t\tset resp.http.url = req.url;
**** v1    0.2 CLI TX|\t\tset resp.http.proto = req.proto;
**** v1    0.2 CLI TX|\t\tset resp.http.preserveme = req.http.preserveme;
**** v1    0.2 CLI TX|\t\tset resp.http.restarts = req.restarts;
**** v1    0.2 CLI TX|\t\tset resp.http.storage = req.storage;
**** v1    0.2 CLI TX|\t\tset resp.http.ttl = req.ttl;
**** v1    0.2 CLI TX|\t\tset resp.http.esi = req.esi;
**** v1    0.2 CLI TX|\t\tset resp.http.backend_hint = req.backend_hint;
**** v1    0.2 CLI TX|\t\tset resp.http.hash-ignore-busy = req.hash_ignore_busy;
**** v1    0.2 CLI TX|\t\tset resp.http.hash-always-miss = req.hash_always_miss;
**** v1    0.2 CLI TX|\t}
**** v1    0.2 CLI TX|
**** v1    0.2 CLI TX|%XJEIFLH|)Xspa8P
***  v1    0.2 CLI RX  106
**** v1    0.2 CLI RX|Message from VCC-compiler:
**** v1    0.2 CLI RX|Security: Privilege proc_setid missing, will not change uid/gid
**** v1    0.2 CLI RX|Symbol not found.
**** v1    0.2 CLI RX|('<vcl.inline>' Line 21 Pos 9)
**** v1    0.2 CLI RX|        sub vcl_backend_fetch {
**** v1    0.2 CLI RX|--------###--------------------
**** v1    0.2 CLI RX|
**** v1    0.2 CLI RX|Running VCC-compiler failed, exited with 2
**** v1    0.2 CLI RX|VCL compilation failed
---- v1    0.2 FAIL VCL does not compile
*    top   0.2 RESETTING after ../../../bin/varnishtest/tests/c00009.vtc
**   s1    0.2 Waiting for server (3/-1)
**   s2    0.2 Waiting for server (4/-1)
**   v1    0.2 Wait
**** v1    0.2 CLI TX|panic.clear
***  v1    0.2 CLI RX  300
**** v1    0.2 CLI RX|No panic to clear
***  v1    0.2 debug|Info: manager stopping child
***  v1    0.2 debug|Info: manager dies
**** v1    0.2 STDOUT poll 0x10
***  v1    0.3 vsl|No VSL chunk found (child not started ?)
**   v1    0.3 WAIT4 pid=32566 status=0x0000 (user 0.009000 sys 0.029000)
*    top   0.3 TEST ../../../bin/varnishtest/tests/c00009.vtc FAILED
#    top  TEST ../../../bin/varnishtest/tests/c00009.vtc FAILED (0.255) exit=2

1 @ Linux x86_64 3.10.0 1.04 phk

*    top   0.0 TEST ../../../bin/varnishtest/tests/c00009.vtc starting
[...]
*    top   0.0 TEST Test restarts
[...]
**** v1    0.1 CLI TX|\t\t\treturn (restart);
**** v1    0.1 CLI TX|\t\t}
**** v1    0.1 CLI TX|\t\tset resp.http.method = req.method;
**** v1    0.1 CLI TX|\t\tset resp.http.url = req.url;
**** v1    0.1 CLI TX|\t\tset resp.http.proto = req.proto;
**** v1    0.1 CLI TX|\t\tset resp.http.preserveme = req.http.preserveme;
**** v1    0.1 CLI TX|\t\tset resp.http.restarts = req.restarts;
**** v1    0.1 CLI TX|\t\tset resp.http.storage = req.storage;
**** v1    0.1 CLI TX|\t\tset resp.http.ttl = req.ttl;
**** v1    0.1 CLI TX|\t\tset resp.http.esi = req.esi;
**** v1    0.1 CLI TX|\t\tset resp.http.backend_hint = req.backend_hint;
**** v1    0.1 CLI TX|\t\tset resp.http.hash-ignore-busy = req.hash_ignore_busy;
**** v1    0.1 CLI TX|\t\tset resp.http.hash-always-miss = req.hash_always_miss;
**** v1    0.1 CLI TX|\t}
**** v1    0.1 CLI TX|
**** v1    0.1 CLI TX|%XJEIFLH|)Xspa8P
***  v1    0.1 CLI RX  106
**** v1    0.1 CLI RX|Message from VCC-compiler:
**** v1    0.1 CLI RX|Symbol not found.
**** v1    0.1 CLI RX|('<vcl.inline>' Line 21 Pos 9)
**** v1    0.1 CLI RX|        sub vcl_backend_fetch {
**** v1    0.1 CLI RX|--------###--------------------
**** v1    0.1 CLI RX|
**** v1    0.1 CLI RX|Running VCC-compiler failed, exited with 2
**** v1    0.1 CLI RX|VCL compilation failed
---- v1    0.1 FAIL VCL does not compile
*    top   0.1 RESETTING after ../../../bin/varnishtest/tests/c00009.vtc
**   s1    0.1 Waiting for server (4/-1)
**   s2    0.1 Waiting for server (5/-1)
**   v1    0.1 Wait
**** v1    0.1 CLI TX|panic.clear
***  v1    0.2 CLI RX  300
**** v1    0.2 CLI RX|No panic to clear
***  v1    0.2 debug|Info: manager stopping child
***  v1    0.2 debug|Info: manager dies
**** v1    0.2 STDOUT poll 0x10
***  v1    0.2 vsl|No VSL chunk found (child not started ?)
**   v1    0.2 WAIT4 pid=8032 status=0x0000 (user 0.003121 sys 0.007147)
*    top   0.2 TEST ../../../bin/varnishtest/tests/c00009.vtc FAILED
#    top  TEST ../../../bin/varnishtest/tests/c00009.vtc FAILED (0.218) exit=2

1 @ FreeBSD arm 11.1-REL 1.04 phk

*    top   0.0 TEST ../../../../bin/varnishtest/tests/c00009.vtc starting
[...]
*    top   0.0 TEST Test restarts
[...]
**** v1    0.2 CLI TX|\t\tset resp.http.method = req.method;
**** v1    0.2 CLI TX|\t\tset resp.http.url = req.url;
**** v1    0.2 CLI TX|\t\tset resp.http.proto = req.proto;
**** v1    0.2 CLI TX|\t\tset resp.http.preserveme = req.http.preserveme;
**** v1    0.2 CLI TX|\t\tset resp.http.restarts = req.restarts;
**** v1    0.2 CLI TX|\t\tset resp.http.storage = req.storage;
**** v1    0.2 CLI TX|\t\tset resp.http.ttl = req.ttl;
**** v1    0.2 CLI TX|\t\tset resp.http.esi = req.esi;
**** v1    0.2 CLI TX|\t\tset resp.http.backend_hint = req.backend_hint;
**** v1    0.2 CLI TX|\t\tset resp.http.hash-ignore-busy = req.hash_ignore_busy;
**** v1    0.2 CLI TX|\t\tset resp.http.hash-always-miss = req.hash_always_miss;
**** v1    0.2 CLI TX|\t}
**** v1    0.2 CLI TX|
**** v1    0.2 CLI TX|%XJEIFLH|)Xspa8P
***  v1    0.3 vsl|No VSL chunk found (child not started ?)
***  v1    0.4 CLI RX  106
**** v1    0.4 CLI RX|Message from VCC-compiler:
**** v1    0.4 CLI RX|Symbol not found.
**** v1    0.4 CLI RX|('<vcl.inline>' Line 21 Pos 9)
**** v1    0.4 CLI RX|        sub vcl_backend_fetch {
**** v1    0.4 CLI RX|--------###--------------------
**** v1    0.4 CLI RX|
**** v1    0.4 CLI RX|Running VCC-compiler failed, exited with 2
**** v1    0.4 CLI RX|VCL compilation failed
---- v1    0.4 FAIL VCL does not compile
*    top   0.4 RESETTING after ../../../../bin/varnishtest/tests/c00009.vtc
**   s1    0.4 Waiting for server (3/-1)
**   s2    0.4 Waiting for server (4/-1)
**   v1    0.4 Wait
**** v1    0.4 CLI TX|panic.clear
***  v1    0.4 vsl|No VSL chunk found (child not started ?)
***  v1    0.5 CLI RX  300
**** v1    0.5 CLI RX|No panic to clear
***  v1    0.5 debug|Info: manager stopping child
***  v1    0.5 debug|Info: manager dies
**** v1    0.5 STDOUT poll 0x11
**   v1    0.5 WAIT4 pid=17090 status=0x0000 (user 0.017549 sys 0.096520)
*    top   0.5 TEST ../../../../bin/varnishtest/tests/c00009.vtc FAILED
#    top  TEST ../../../../bin/varnishtest/tests/c00009.vtc FAILED (0.474) exit=2
FAIL tests/c00009.vtc (exit status: 2)

1 @ SunOS i86pc 5.11 1.04 64_gcc4.7 uplex

*    top   0.0 TEST ../../../bin/varnishtest/tests/c00009.vtc starting
[...]
*    top   0.0 TEST Test restarts
[...]
**** v1    0.3 CLI TX|\t\tset resp.http.method = req.method;
**** v1    0.3 CLI TX|\t\tset resp.http.url = req.url;
**** v1    0.3 CLI TX|\t\tset resp.http.proto = req.proto;
**** v1    0.3 CLI TX|\t\tset resp.http.preserveme = req.http.preserveme;
**** v1    0.3 CLI TX|\t\tset resp.http.restarts = req.restarts;
**** v1    0.3 CLI TX|\t\tset resp.http.storage = req.storage;
**** v1    0.3 CLI TX|\t\tset resp.http.ttl = req.ttl;
**** v1    0.3 CLI TX|\t\tset resp.http.esi = req.esi;
**** v1    0.3 CLI TX|\t\tset resp.http.backend_hint = req.backend_hint;
**** v1    0.3 CLI TX|\t\tset resp.http.hash-ignore-busy = req.hash_ignore_busy;
**** v1    0.3 CLI TX|\t\tset resp.http.hash-always-miss = req.hash_always_miss;
**** v1    0.3 CLI TX|\t}
**** v1    0.3 CLI TX|
**** v1    0.3 CLI TX|%XJEIFLH|)Xspa8P
***  v1    0.3 CLI RX  106
**** v1    0.3 CLI RX|Message from VCC-compiler:
**** v1    0.3 CLI RX|Security: Privilege proc_setid missing, will not change uid/gid
**** v1    0.3 CLI RX|Symbol not found.
**** v1    0.3 CLI RX|('<vcl.inline>' Line 21 Pos 9)
**** v1    0.3 CLI RX|        sub vcl_backend_fetch {
**** v1    0.3 CLI RX|--------###--------------------
**** v1    0.3 CLI RX|
**** v1    0.3 CLI RX|Running VCC-compiler failed, exited with 2
**** v1    0.3 CLI RX|VCL compilation failed
---- v1    0.3 FAIL VCL does not compile
*    top   0.3 RESETTING after ../../../bin/varnishtest/tests/c00009.vtc
**   s1    0.3 Waiting for server (3/-1)
**   s2    0.3 Waiting for server (4/-1)
**   v1    0.3 Wait
**** v1    0.3 CLI TX|panic.clear
***  v1    0.3 CLI RX  300
**** v1    0.3 CLI RX|No panic to clear
***  v1    0.3 debug|Info: manager stopping child
***  v1    0.3 debug|Info: manager dies
***  v1    0.3 debug|
**** v1    0.3 STDOUT poll 0x10
***  v1    0.4 vsl|No VSL chunk found (child not started ?)
**   v1    0.4 WAIT4 pid=89264 status=0x0000 (user 0.014000 sys 0.048000)
*    top   0.4 TEST ../../../bin/varnishtest/tests/c00009.vtc FAILED
#    top  TEST ../../../bin/varnishtest/tests/c00009.vtc FAILED (0.405) exit=2