c00085

7251861

1 @ SunOS i86pc 5.11 1.04 64_sun12.4 uplex

*    top   0.0 TEST ../../../bin/varnishtest/tests/c00085.vtc starting
[...]
*    top   0.0 TEST relaxed date parsing
[...]
**** v1    0.1 CLI RX|Type 'start' to launch worker process.
**** v1    0.1 CLI TX|vcl.inline vcl1 << %XJEIFLH|)Xspa8P
**** v1    0.1 CLI TX|vcl 4.1;
**** v1    0.1 CLI TX|backend s1 { .host = "127.0.0.1"; .port = "51407"; }
**** v1    0.1 CLI TX|
**** v1    0.1 CLI TX|
**** v1    0.1 CLI TX|\timport std;
**** v1    0.1 CLI TX|
**** v1    0.1 CLI TX|\tsub vcl_backend_response {
**** v1    0.1 CLI TX|\t\tset beresp.http.ttl = beresp.ttl;
**** v1    0.1 CLI TX|\t\tset beresp.http.lm = std.time(beresp.http.last-modified, now);
**** v1    0.1 CLI TX|\t}
**** v1    0.1 CLI TX|
**** v1    0.1 CLI TX|%XJEIFLH|)Xspa8P
***  v1    0.2 CLI RX  106
**** v1    0.2 CLI RX|Message from VCC-compiler:
**** v1    0.2 CLI RX|Security: Privilege proc_setid missing, will not change uid/gid
**** v1    0.2 CLI RX|Could not load VMOD std
**** v1    0.2 CLI RX|\tFile name: /tmp/vtest.64_sun12.4/varnish-cache/varnish-trunk/_build/lib/libvmod_std/.libs/libvmod_std.so
**** v1    0.2 CLI RX|\tdlerror: ld.so.1: varnishd: fatal: relocation error: file /tmp/vtest.64_sun12.4/varnish-cache/varnish-trunk/_build/lib/libvmod_std/.libs/libvmod_std.so: symbol vmod_issyntax: referenced symbol not found
**** v1    0.2 CLI RX|('<vcl.inline>' Line 5 Pos 16)
**** v1    0.2 CLI RX|        import std;
**** v1    0.2 CLI RX|---------------###-
**** v1    0.2 CLI RX|
**** v1    0.2 CLI RX|Running VCC-compiler failed, exited with 2
**** v1    0.2 CLI RX|VCL compilation failed
---- v1    0.2 FAIL VCL does not compile
*    top   0.2 RESETTING after ../../../bin/varnishtest/tests/c00085.vtc
**   s1    0.2 Waiting for server (3/-1)
**   v1    0.2 Wait
**** v1    0.2 CLI TX|panic.clear
***  v1    0.2 CLI RX  300
**** v1    0.2 CLI RX|No panic to clear
***  v1    0.2 debug|Info: manager stopping child
***  v1    0.2 debug|Info: manager dies
**** v1    0.2 STDOUT poll 0x10
**   v1    0.2 R 21946 Status: 0000 (u 0.009000 s 0.028000)
***  v1    0.2 vsl|No VSL chunk found (child not started ?)
*    top   0.2 TEST ../../../bin/varnishtest/tests/c00085.vtc FAILED
#    top  TEST ../../../bin/varnishtest/tests/c00085.vtc FAILED (0.249) exit=2

1 @ SunOS i86pc 5.11 1.04 32_sun12.4 uplex

*    top   0.0 TEST ../../../bin/varnishtest/tests/c00085.vtc starting
[...]
*    top   0.0 TEST relaxed date parsing
[...]
**** v1    0.1 CLI RX|Type 'start' to launch worker process.
**** v1    0.1 CLI TX|vcl.inline vcl1 << %XJEIFLH|)Xspa8P
**** v1    0.1 CLI TX|vcl 4.1;
**** v1    0.1 CLI TX|backend s1 { .host = "127.0.0.1"; .port = "44475"; }
**** v1    0.1 CLI TX|
**** v1    0.1 CLI TX|
**** v1    0.1 CLI TX|\timport std;
**** v1    0.1 CLI TX|
**** v1    0.1 CLI TX|\tsub vcl_backend_response {
**** v1    0.1 CLI TX|\t\tset beresp.http.ttl = beresp.ttl;
**** v1    0.1 CLI TX|\t\tset beresp.http.lm = std.time(beresp.http.last-modified, now);
**** v1    0.1 CLI TX|\t}
**** v1    0.1 CLI TX|
**** v1    0.1 CLI TX|%XJEIFLH|)Xspa8P
***  v1    0.1 CLI RX  106
**** v1    0.1 CLI RX|Message from VCC-compiler:
**** v1    0.1 CLI RX|Security: Privilege proc_setid missing, will not change uid/gid
**** v1    0.1 CLI RX|Could not load VMOD std
**** v1    0.1 CLI RX|\tFile name: /tmp/vtest.32_sun12.4/varnish-cache/varnish-trunk/_build/lib/libvmod_std/.libs/libvmod_std.so
**** v1    0.1 CLI RX|\tdlerror: ld.so.1: varnishd: fatal: relocation error: file /tmp/vtest.32_sun12.4/varnish-cache/varnish-trunk/_build/lib/libvmod_std/.libs/libvmod_std.so: symbol vmod_issyntax: referenced symbol not found
**** v1    0.1 CLI RX|('<vcl.inline>' Line 5 Pos 16)
**** v1    0.1 CLI RX|        import std;
**** v1    0.1 CLI RX|---------------###-
**** v1    0.1 CLI RX|
**** v1    0.1 CLI RX|Running VCC-compiler failed, exited with 2
**** v1    0.1 CLI RX|VCL compilation failed
---- v1    0.1 FAIL VCL does not compile
*    top   0.1 RESETTING after ../../../bin/varnishtest/tests/c00085.vtc
**   s1    0.1 Waiting for server (3/-1)
**   v1    0.1 Wait
**** v1    0.1 CLI TX|panic.clear
***  v1    0.1 CLI RX  300
**** v1    0.1 CLI RX|No panic to clear
***  v1    0.2 debug|Info: manager stopping child
***  v1    0.2 debug|Info: manager dies
**** v1    0.2 STDOUT poll 0x10
**   v1    0.2 R 22440 Status: 0000 (u 0.009000 s 0.027000)
***  v1    0.2 vsl|No VSL chunk found (child not started ?)
*    top   0.2 TEST ../../../bin/varnishtest/tests/c00085.vtc FAILED
#    top  TEST ../../../bin/varnishtest/tests/c00085.vtc FAILED (0.246) exit=2

1 @ SunOS i86pc 5.11 1.04 64_sun12.4 uplex

*    top   0.0 TEST ../../../bin/varnishtest/tests/c00085.vtc starting
[...]
*    top   0.0 TEST relaxed date parsing
[...]
**** v1    0.1 CLI RX|Type 'start' to launch worker process.
**** v1    0.1 CLI TX|vcl.inline vcl1 << %XJEIFLH|)Xspa8P
**** v1    0.1 CLI TX|vcl 4.1;
**** v1    0.1 CLI TX|backend s1 { .host = "127.0.0.1"; .port = "41230"; }
**** v1    0.1 CLI TX|
**** v1    0.1 CLI TX|
**** v1    0.1 CLI TX|\timport std;
**** v1    0.1 CLI TX|
**** v1    0.1 CLI TX|\tsub vcl_backend_response {
**** v1    0.1 CLI TX|\t\tset beresp.http.ttl = beresp.ttl;
**** v1    0.1 CLI TX|\t\tset beresp.http.lm = std.time(beresp.http.last-modified, now);
**** v1    0.1 CLI TX|\t}
**** v1    0.1 CLI TX|
**** v1    0.1 CLI TX|%XJEIFLH|)Xspa8P
***  v1    0.1 CLI RX  106
**** v1    0.1 CLI RX|Message from VCC-compiler:
**** v1    0.1 CLI RX|Security: Privilege proc_setid missing, will not change uid/gid
**** v1    0.1 CLI RX|Could not load VMOD std
**** v1    0.1 CLI RX|\tFile name: /tmp/vtest.64_sun12.4/varnish-cache/varnish-trunk/_build/lib/libvmod_std/.libs/libvmod_std.so
**** v1    0.1 CLI RX|\tdlerror: ld.so.1: varnishd: fatal: relocation error: file /tmp/vtest.64_sun12.4/varnish-cache/varnish-trunk/_build/lib/libvmod_std/.libs/libvmod_std.so: symbol vmod_issyntax: referenced symbol not found
**** v1    0.1 CLI RX|('<vcl.inline>' Line 5 Pos 16)
**** v1    0.1 CLI RX|        import std;
**** v1    0.1 CLI RX|---------------###-
**** v1    0.1 CLI RX|
**** v1    0.1 CLI RX|Running VCC-compiler failed, exited with 2
**** v1    0.1 CLI RX|VCL compilation failed
---- v1    0.2 FAIL VCL does not compile
*    top   0.2 RESETTING after ../../../bin/varnishtest/tests/c00085.vtc
**   s1    0.2 Waiting for server (3/-1)
**   v1    0.2 Wait
**** v1    0.2 CLI TX|panic.clear
***  v1    0.2 CLI RX  300
**** v1    0.2 CLI RX|No panic to clear
***  v1    0.2 debug|Info: manager stopping child
***  v1    0.2 debug|Info: manager dies
**** v1    0.2 STDOUT poll 0x10
**   v1    0.2 R 96264 Status: 0000 (u 0.008000 s 0.027000)
***  v1    0.2 vsl|No VSL chunk found (child not started ?)
*    top   0.2 TEST ../../../bin/varnishtest/tests/c00085.vtc FAILED
#    top  TEST ../../../bin/varnishtest/tests/c00085.vtc FAILED (0.247) exit=2

1 @ SunOS i86pc 5.11 1.04 64_sun12.4 uplex

*    top   0.0 TEST ../../../bin/varnishtest/tests/c00085.vtc starting
[...]
*    top   0.0 TEST relaxed date parsing
[...]
**** v1    0.1 CLI RX|Type 'start' to launch worker process.
**** v1    0.1 CLI TX|vcl.inline vcl1 << %XJEIFLH|)Xspa8P
**** v1    0.1 CLI TX|vcl 4.1;
**** v1    0.1 CLI TX|backend s1 { .host = "127.0.0.1"; .port = "32778"; }
**** v1    0.1 CLI TX|
**** v1    0.1 CLI TX|
**** v1    0.1 CLI TX|\timport std;
**** v1    0.1 CLI TX|
**** v1    0.1 CLI TX|\tsub vcl_backend_response {
**** v1    0.1 CLI TX|\t\tset beresp.http.ttl = beresp.ttl;
**** v1    0.1 CLI TX|\t\tset beresp.http.lm = std.time(beresp.http.last-modified, now);
**** v1    0.1 CLI TX|\t}
**** v1    0.1 CLI TX|
**** v1    0.1 CLI TX|%XJEIFLH|)Xspa8P
***  v1    0.2 CLI RX  106
**** v1    0.2 CLI RX|Message from VCC-compiler:
**** v1    0.2 CLI RX|Security: Privilege proc_setid missing, will not change uid/gid
**** v1    0.2 CLI RX|Could not load VMOD std
**** v1    0.2 CLI RX|\tFile name: /tmp/vtest.64_sun12.4/varnish-cache/varnish-trunk/_build/lib/libvmod_std/.libs/libvmod_std.so
**** v1    0.2 CLI RX|\tdlerror: ld.so.1: varnishd: fatal: relocation error: file /tmp/vtest.64_sun12.4/varnish-cache/varnish-trunk/_build/lib/libvmod_std/.libs/libvmod_std.so: symbol vmod_issyntax: referenced symbol not found
**** v1    0.2 CLI RX|('<vcl.inline>' Line 5 Pos 16)
**** v1    0.2 CLI RX|        import std;
**** v1    0.2 CLI RX|---------------###-
**** v1    0.2 CLI RX|
**** v1    0.2 CLI RX|Running VCC-compiler failed, exited with 2
**** v1    0.2 CLI RX|VCL compilation failed
---- v1    0.2 FAIL VCL does not compile
*    top   0.2 RESETTING after ../../../bin/varnishtest/tests/c00085.vtc
**   s1    0.2 Waiting for server (3/-1)
**   v1    0.2 Wait
**** v1    0.2 CLI TX|panic.clear
***  v1    0.2 CLI RX  300
**** v1    0.2 CLI RX|No panic to clear
***  v1    0.2 debug|Info: manager stopping child
***  v1    0.2 debug|Info: manager dies
**** v1    0.2 STDOUT poll 0x10
**   v1    0.2 R 21468 Status: 0000 (u 0.009000 s 0.028000)
***  v1    0.2 vsl|No VSL chunk found (child not started ?)
*    top   0.2 TEST ../../../bin/varnishtest/tests/c00085.vtc FAILED
#    top  TEST ../../../bin/varnishtest/tests/c00085.vtc FAILED (0.251) exit=2

1 @ SunOS i86pc 5.11 1.04 32_sun12.4 uplex

*    top   0.0 TEST ../../../bin/varnishtest/tests/c00085.vtc starting
[...]
*    top   0.0 TEST relaxed date parsing
[...]
**** v1    0.1 CLI RX|Type 'start' to launch worker process.
**** v1    0.1 CLI TX|vcl.inline vcl1 << %XJEIFLH|)Xspa8P
**** v1    0.1 CLI TX|vcl 4.1;
**** v1    0.1 CLI TX|backend s1 { .host = "127.0.0.1"; .port = "36780"; }
**** v1    0.1 CLI TX|
**** v1    0.1 CLI TX|
**** v1    0.1 CLI TX|\timport std;
**** v1    0.1 CLI TX|
**** v1    0.1 CLI TX|\tsub vcl_backend_response {
**** v1    0.1 CLI TX|\t\tset beresp.http.ttl = beresp.ttl;
**** v1    0.1 CLI TX|\t\tset beresp.http.lm = std.time(beresp.http.last-modified, now);
**** v1    0.1 CLI TX|\t}
**** v1    0.1 CLI TX|
**** v1    0.1 CLI TX|%XJEIFLH|)Xspa8P
***  v1    0.1 CLI RX  106
**** v1    0.1 CLI RX|Message from VCC-compiler:
**** v1    0.1 CLI RX|Security: Privilege proc_setid missing, will not change uid/gid
**** v1    0.1 CLI RX|Could not load VMOD std
**** v1    0.1 CLI RX|\tFile name: /tmp/vtest.32_sun12.4/varnish-cache/varnish-trunk/_build/lib/libvmod_std/.libs/libvmod_std.so
**** v1    0.1 CLI RX|\tdlerror: ld.so.1: varnishd: fatal: relocation error: file /tmp/vtest.32_sun12.4/varnish-cache/varnish-trunk/_build/lib/libvmod_std/.libs/libvmod_std.so: symbol vmod_issyntax: referenced symbol not found
**** v1    0.1 CLI RX|('<vcl.inline>' Line 5 Pos 16)
**** v1    0.1 CLI RX|        import std;
**** v1    0.1 CLI RX|---------------###-
**** v1    0.1 CLI RX|
**** v1    0.1 CLI RX|Running VCC-compiler failed, exited with 2
**** v1    0.1 CLI RX|VCL compilation failed
---- v1    0.1 FAIL VCL does not compile
*    top   0.1 RESETTING after ../../../bin/varnishtest/tests/c00085.vtc
**   s1    0.1 Waiting for server (3/-1)
**   v1    0.1 Wait
**** v1    0.1 CLI TX|panic.clear
***  v1    0.1 CLI RX  300
**** v1    0.1 CLI RX|No panic to clear
***  v1    0.2 debug|Info: manager stopping child
***  v1    0.2 debug|Info: manager dies
**** v1    0.2 STDOUT poll 0x10
**   v1    0.2 R 25907 Status: 0000 (u 0.009000 s 0.026000)
***  v1    0.2 vsl|No VSL chunk found (child not started ?)
*    top   0.2 TEST ../../../bin/varnishtest/tests/c00085.vtc FAILED
#    top  TEST ../../../bin/varnishtest/tests/c00085.vtc FAILED (0.245) exit=2

1 @ SunOS i86pc 5.11 1.04 32_sun12.4 uplex

*    top   0.0 TEST ../../../bin/varnishtest/tests/c00085.vtc starting
[...]
*    top   0.0 TEST relaxed date parsing
[...]
**** v1    0.2 CLI RX|Type 'start' to launch worker process.
**** v1    0.2 CLI TX|vcl.inline vcl1 << %XJEIFLH|)Xspa8P
**** v1    0.2 CLI TX|vcl 4.1;
**** v1    0.2 CLI TX|backend s1 { .host = "127.0.0.1"; .port = "43202"; }
**** v1    0.2 CLI TX|
**** v1    0.2 CLI TX|
**** v1    0.2 CLI TX|\timport std;
**** v1    0.2 CLI TX|
**** v1    0.2 CLI TX|\tsub vcl_backend_response {
**** v1    0.2 CLI TX|\t\tset beresp.http.ttl = beresp.ttl;
**** v1    0.2 CLI TX|\t\tset beresp.http.lm = std.time(beresp.http.last-modified, now);
**** v1    0.2 CLI TX|\t}
**** v1    0.2 CLI TX|
**** v1    0.2 CLI TX|%XJEIFLH|)Xspa8P
***  v1    0.2 CLI RX  106
**** v1    0.2 CLI RX|Message from VCC-compiler:
**** v1    0.2 CLI RX|Security: Privilege proc_setid missing, will not change uid/gid
**** v1    0.2 CLI RX|Could not load VMOD std
**** v1    0.2 CLI RX|\tFile name: /tmp/vtest.32_sun12.4/varnish-cache/varnish-trunk/_build/lib/libvmod_std/.libs/libvmod_std.so
**** v1    0.2 CLI RX|\tdlerror: ld.so.1: varnishd: fatal: relocation error: file /tmp/vtest.32_sun12.4/varnish-cache/varnish-trunk/_build/lib/libvmod_std/.libs/libvmod_std.so: symbol vmod_issyntax: referenced symbol not found
**** v1    0.2 CLI RX|('<vcl.inline>' Line 5 Pos 16)
**** v1    0.2 CLI RX|        import std;
**** v1    0.2 CLI RX|---------------###-
**** v1    0.2 CLI RX|
**** v1    0.2 CLI RX|Running VCC-compiler failed, exited with 2
**** v1    0.2 CLI RX|VCL compilation failed
---- v1    0.2 FAIL VCL does not compile
*    top   0.2 RESETTING after ../../../bin/varnishtest/tests/c00085.vtc
**   s1    0.2 Waiting for server (3/-1)
**   v1    0.2 Wait
**** v1    0.2 CLI TX|panic.clear
***  v1    0.2 CLI RX  300
**** v1    0.2 CLI RX|No panic to clear
***  v1    0.2 debug|Info: manager stopping child
***  v1    0.2 debug|Info: manager dies
**** v1    0.2 STDOUT poll 0x10
**   v1    0.2 R 82252 Status: 0000 (u 0.012000 s 0.037000)
***  v1    0.3 vsl|No VSL chunk found (child not started ?)
*    top   0.3 TEST ../../../bin/varnishtest/tests/c00085.vtc FAILED
#    top  TEST ../../../bin/varnishtest/tests/c00085.vtc FAILED (0.262) exit=2

1 @ SunOS i86pc 5.11 1.04 32_sun12.4 uplex

*    top   0.0 TEST ../../../bin/varnishtest/tests/c00085.vtc starting
[...]
*    top   0.0 TEST relaxed date parsing
[...]
**** v1    0.1 CLI RX|Type 'start' to launch worker process.
**** v1    0.1 CLI TX|vcl.inline vcl1 << %XJEIFLH|)Xspa8P
**** v1    0.1 CLI TX|vcl 4.1;
**** v1    0.1 CLI TX|backend s1 { .host = "127.0.0.1"; .port = "36183"; }
**** v1    0.1 CLI TX|
**** v1    0.1 CLI TX|
**** v1    0.1 CLI TX|\timport std;
**** v1    0.1 CLI TX|
**** v1    0.1 CLI TX|\tsub vcl_backend_response {
**** v1    0.1 CLI TX|\t\tset beresp.http.ttl = beresp.ttl;
**** v1    0.1 CLI TX|\t\tset beresp.http.lm = std.time(beresp.http.last-modified, now);
**** v1    0.1 CLI TX|\t}
**** v1    0.1 CLI TX|
**** v1    0.1 CLI TX|%XJEIFLH|)Xspa8P
***  v1    0.1 CLI RX  106
**** v1    0.1 CLI RX|Message from VCC-compiler:
**** v1    0.1 CLI RX|Security: Privilege proc_setid missing, will not change uid/gid
**** v1    0.1 CLI RX|Could not load VMOD std
**** v1    0.1 CLI RX|\tFile name: /tmp/vtest.32_sun12.4/varnish-cache/varnish-trunk/_build/lib/libvmod_std/.libs/libvmod_std.so
**** v1    0.1 CLI RX|\tdlerror: ld.so.1: varnishd: fatal: relocation error: file /tmp/vtest.32_sun12.4/varnish-cache/varnish-trunk/_build/lib/libvmod_std/.libs/libvmod_std.so: symbol vmod_issyntax: referenced symbol not found
**** v1    0.1 CLI RX|('<vcl.inline>' Line 5 Pos 16)
**** v1    0.1 CLI RX|        import std;
**** v1    0.1 CLI RX|---------------###-
**** v1    0.1 CLI RX|
**** v1    0.1 CLI RX|Running VCC-compiler failed, exited with 2
**** v1    0.1 CLI RX|VCL compilation failed
---- v1    0.1 FAIL VCL does not compile
*    top   0.1 RESETTING after ../../../bin/varnishtest/tests/c00085.vtc
**   s1    0.1 Waiting for server (3/-1)
**   v1    0.1 Wait
**** v1    0.1 CLI TX|panic.clear
***  v1    0.1 CLI RX  300
**** v1    0.1 CLI RX|No panic to clear
***  v1    0.1 debug|Info: manager stopping child
***  v1    0.1 debug|Info: manager dies
**** v1    0.1 STDOUT poll 0x10
**   v1    0.1 R 805 Status: 0000 (u 0.009000 s 0.026000)
***  v1    0.2 vsl|No VSL chunk found (child not started ?)
*    top   0.2 TEST ../../../bin/varnishtest/tests/c00085.vtc FAILED
#    top  TEST ../../../bin/varnishtest/tests/c00085.vtc FAILED (0.244) exit=2

1 @ SunOS i86pc 5.11 1.04 64_sun12.4 uplex

*    top   0.0 TEST ../../../bin/varnishtest/tests/c00085.vtc starting
[...]
*    top   0.0 TEST relaxed date parsing
[...]
**** v1    0.2 CLI RX|Type 'start' to launch worker process.
**** v1    0.2 CLI TX|vcl.inline vcl1 << %XJEIFLH|)Xspa8P
**** v1    0.2 CLI TX|vcl 4.1;
**** v1    0.2 CLI TX|backend s1 { .host = "127.0.0.1"; .port = "58587"; }
**** v1    0.2 CLI TX|
**** v1    0.2 CLI TX|
**** v1    0.2 CLI TX|\timport std;
**** v1    0.2 CLI TX|
**** v1    0.2 CLI TX|\tsub vcl_backend_response {
**** v1    0.2 CLI TX|\t\tset beresp.http.ttl = beresp.ttl;
**** v1    0.2 CLI TX|\t\tset beresp.http.lm = std.time(beresp.http.last-modified, now);
**** v1    0.2 CLI TX|\t}
**** v1    0.2 CLI TX|
**** v1    0.2 CLI TX|%XJEIFLH|)Xspa8P
***  v1    0.2 CLI RX  106
**** v1    0.2 CLI RX|Message from VCC-compiler:
**** v1    0.2 CLI RX|Security: Privilege proc_setid missing, will not change uid/gid
**** v1    0.2 CLI RX|Could not load VMOD std
**** v1    0.2 CLI RX|\tFile name: /tmp/vtest.64_sun12.4/varnish-cache/varnish-trunk/_build/lib/libvmod_std/.libs/libvmod_std.so
**** v1    0.2 CLI RX|\tdlerror: ld.so.1: varnishd: fatal: relocation error: file /tmp/vtest.64_sun12.4/varnish-cache/varnish-trunk/_build/lib/libvmod_std/.libs/libvmod_std.so: symbol vmod_issyntax: referenced symbol not found
**** v1    0.2 CLI RX|('<vcl.inline>' Line 5 Pos 16)
**** v1    0.2 CLI RX|        import std;
**** v1    0.2 CLI RX|---------------###-
**** v1    0.2 CLI RX|
**** v1    0.2 CLI RX|Running VCC-compiler failed, exited with 2
**** v1    0.2 CLI RX|VCL compilation failed
---- v1    0.2 FAIL VCL does not compile
*    top   0.2 RESETTING after ../../../bin/varnishtest/tests/c00085.vtc
**   s1    0.2 Waiting for server (3/-1)
**   v1    0.2 Wait
**** v1    0.2 CLI TX|panic.clear
***  v1    0.2 CLI RX  300
**** v1    0.2 CLI RX|No panic to clear
***  v1    0.2 debug|Info: manager stopping child
***  v1    0.2 debug|Info: manager dies
**** v1    0.2 STDOUT poll 0x10
**   v1    0.2 R 79114 Status: 0000 (u 0.013000 s 0.041000)
***  v1    0.3 vsl|No VSL chunk found (child not started ?)
*    top   0.3 TEST ../../../bin/varnishtest/tests/c00085.vtc FAILED
#    top  TEST ../../../bin/varnishtest/tests/c00085.vtc FAILED (0.271) exit=2