d00003

90757fc

1 @ SunOS 5.11 i86pc 1.04 64_sun12.4 uplex

*    top   0.0 TEST ../../../bin/varnishtest/tests/d00003.vtc starting
[...]
*    top   0.0 TEST Test hash director
[...]
**** v1    0.1 CLI TX|\t\t} else if (req.url == "/ip") {
**** v1    0.1 CLI TX|\t\t\tset req.backend_hint = h1.backend(std.ip("127.0.0.1", client.ip));
**** v1    0.1 CLI TX|\t\t} else {
**** v1    0.1 CLI TX|\t\t\tset req.backend_hint = h1.backend(req.url);
**** v1    0.1 CLI TX|\t\t}
**** v1    0.1 CLI TX|\t\treturn (pass);
**** v1    0.1 CLI TX|\t}
**** v1    0.1 CLI TX|
**** v1    0.1 CLI TX|%XJEIFLH|)Xspa8P
***  v1    0.2 CLI RX  106
**** v1    0.2 CLI RX|Message from VCC-compiler:
**** v1    0.2 CLI RX|Security: Privilege proc_setid missing, will not change uid/gid
**** v1    0.2 CLI RX|Malformed VMOD directors
**** v1    0.2 CLI RX|\tFile name: /tmp/vtest.64_sun12.4/varnish-cache/varnish-trunk/_build/lib/libvmod_directors/.libs/libvmod_directors.so
**** v1    0.2 CLI RX|\t(no Vmod_Data symbol)
**** v1    0.2 CLI RX|('<vcl.inline>' Line 7 Pos 16)
**** v1    0.2 CLI RX|        import directors;
**** v1    0.2 CLI RX|---------------#########-
**** v1    0.2 CLI RX|
**** v1    0.2 CLI RX|Running VCC-compiler failed, exited with 2
**** v1    0.2 CLI RX|VCL compilation failed
---- v1    0.2 FAIL VCL does not compile
*    top   0.2 RESETTING after ../../../bin/varnishtest/tests/d00003.vtc
**   s1    0.2 Waiting for server (3/-1)
**** s1    0.2 macro undef s1_addr
**** s1    0.2 macro undef s1_port
**** s1    0.2 macro undef s1_sock
**   s2    0.2 Waiting for server (4/-1)
**** s2    0.2 macro undef s2_addr
**** s2    0.2 macro undef s2_port
**** s2    0.2 macro undef s2_sock
**   v1    0.2 Wait
**** v1    0.2 CLI TX|panic.clear
***  v1    0.2 CLI RX  300
**** v1    0.2 CLI RX|No panic to clear
**** v1    0.2 STDOUT poll 0x10
**   v1    0.2 R 3291 Status: 0000 (u 0.009000 s 0.030000)
***  v1    0.2 vsl|No VSL chunk found (child not started ?)
*    top   0.2 TEST ../../../bin/varnishtest/tests/d00003.vtc FAILED
#    top  TEST ../../../bin/varnishtest/tests/d00003.vtc FAILED (0.250) exit=2

1 @ SunOS 5.11 i86pc 1.04 32_gcc4.7 uplex

*    top   0.0 TEST ../../../bin/varnishtest/tests/d00003.vtc starting
[...]
*    top   0.0 TEST Test hash director
[...]
**** v1    0.1 CLI TX|\t\t} else if (req.url == "/ip") {
**** v1    0.1 CLI TX|\t\t\tset req.backend_hint = h1.backend(std.ip("127.0.0.1", client.ip));
**** v1    0.1 CLI TX|\t\t} else {
**** v1    0.1 CLI TX|\t\t\tset req.backend_hint = h1.backend(req.url);
**** v1    0.1 CLI TX|\t\t}
**** v1    0.1 CLI TX|\t\treturn (pass);
**** v1    0.1 CLI TX|\t}
**** v1    0.1 CLI TX|
**** v1    0.1 CLI TX|%XJEIFLH|)Xspa8P
***  v1    0.1 CLI RX  106
**** v1    0.1 CLI RX|Message from VCC-compiler:
**** v1    0.1 CLI RX|Security: Privilege proc_setid missing, will not change uid/gid
**** v1    0.1 CLI RX|Malformed VMOD directors
**** v1    0.1 CLI RX|\tFile name: /tmp/vtest.32_gcc4.7/varnish-cache/varnish-trunk/_build/lib/libvmod_directors/.libs/libvmod_directors.so
**** v1    0.1 CLI RX|\t(no Vmod_Data symbol)
**** v1    0.1 CLI RX|('<vcl.inline>' Line 7 Pos 16)
**** v1    0.1 CLI RX|        import directors;
**** v1    0.1 CLI RX|---------------#########-
**** v1    0.1 CLI RX|
**** v1    0.1 CLI RX|Running VCC-compiler failed, exited with 2
**** v1    0.1 CLI RX|VCL compilation failed
---- v1    0.1 FAIL VCL does not compile
*    top   0.1 RESETTING after ../../../bin/varnishtest/tests/d00003.vtc
**   s1    0.1 Waiting for server (3/-1)
**** s1    0.1 macro undef s1_addr
**** s1    0.1 macro undef s1_port
**** s1    0.1 macro undef s1_sock
**   s2    0.1 Waiting for server (4/-1)
**** s2    0.1 macro undef s2_addr
**** s2    0.1 macro undef s2_port
**** s2    0.1 macro undef s2_sock
**   v1    0.1 Wait
**** v1    0.1 CLI TX|panic.clear
***  v1    0.1 CLI RX  300
**** v1    0.1 CLI RX|No panic to clear
**** v1    0.1 STDOUT poll 0x10
**   v1    0.1 R 25161 Status: 0000 (u 0.007000 s 0.025000)
***  v1    0.2 vsl|No VSL chunk found (child not started ?)
*    top   0.2 TEST ../../../bin/varnishtest/tests/d00003.vtc FAILED
#    top  TEST ../../../bin/varnishtest/tests/d00003.vtc FAILED (0.244) exit=2

1 @ SunOS 5.11 i86pc 1.04 64_gcc4.7 uplex

*    top   0.0 TEST ../../../bin/varnishtest/tests/d00003.vtc starting
[...]
*    top   0.0 TEST Test hash director
[...]
**** v1    0.1 CLI TX|\t\t} else if (req.url == "/ip") {
**** v1    0.1 CLI TX|\t\t\tset req.backend_hint = h1.backend(std.ip("127.0.0.1", client.ip));
**** v1    0.1 CLI TX|\t\t} else {
**** v1    0.1 CLI TX|\t\t\tset req.backend_hint = h1.backend(req.url);
**** v1    0.1 CLI TX|\t\t}
**** v1    0.1 CLI TX|\t\treturn (pass);
**** v1    0.1 CLI TX|\t}
**** v1    0.1 CLI TX|
**** v1    0.1 CLI TX|%XJEIFLH|)Xspa8P
***  v1    0.2 CLI RX  106
**** v1    0.2 CLI RX|Message from VCC-compiler:
**** v1    0.2 CLI RX|Security: Privilege proc_setid missing, will not change uid/gid
**** v1    0.2 CLI RX|Malformed VMOD directors
**** v1    0.2 CLI RX|\tFile name: /tmp/vtest.64_gcc4.7/varnish-cache/varnish-trunk/_build/lib/libvmod_directors/.libs/libvmod_directors.so
**** v1    0.2 CLI RX|\t(no Vmod_Data symbol)
**** v1    0.2 CLI RX|('<vcl.inline>' Line 7 Pos 16)
**** v1    0.2 CLI RX|        import directors;
**** v1    0.2 CLI RX|---------------#########-
**** v1    0.2 CLI RX|
**** v1    0.2 CLI RX|Running VCC-compiler failed, exited with 2
**** v1    0.2 CLI RX|VCL compilation failed
---- v1    0.2 FAIL VCL does not compile
*    top   0.2 RESETTING after ../../../bin/varnishtest/tests/d00003.vtc
**   s1    0.2 Waiting for server (3/-1)
**** s1    0.2 macro undef s1_addr
**** s1    0.2 macro undef s1_port
**** s1    0.2 macro undef s1_sock
**   s2    0.2 Waiting for server (4/-1)
**** s2    0.2 macro undef s2_addr
**** s2    0.2 macro undef s2_port
**** s2    0.2 macro undef s2_sock
**   v1    0.2 Wait
**** v1    0.2 CLI TX|panic.clear
***  v1    0.2 CLI RX  300
**** v1    0.2 CLI RX|No panic to clear
**** v1    0.2 STDOUT poll 0x10
**   v1    0.2 R 98788 Status: 0000 (u 0.008000 s 0.030000)
***  v1    0.2 vsl|No VSL chunk found (child not started ?)
*    top   0.2 TEST ../../../bin/varnishtest/tests/d00003.vtc FAILED
#    top  TEST ../../../bin/varnishtest/tests/d00003.vtc FAILED (0.250) exit=2

1 @ SunOS 5.11 i86pc 1.04 32_sun12.4 uplex

*    top   0.0 TEST ../../../bin/varnishtest/tests/d00003.vtc starting
[...]
*    top   0.0 TEST Test hash director
[...]
**** v1    0.1 CLI TX|\t\t} else if (req.url == "/ip") {
**** v1    0.1 CLI TX|\t\t\tset req.backend_hint = h1.backend(std.ip("127.0.0.1", client.ip));
**** v1    0.1 CLI TX|\t\t} else {
**** v1    0.1 CLI TX|\t\t\tset req.backend_hint = h1.backend(req.url);
**** v1    0.1 CLI TX|\t\t}
**** v1    0.1 CLI TX|\t\treturn (pass);
**** v1    0.1 CLI TX|\t}
**** v1    0.1 CLI TX|
**** v1    0.1 CLI TX|%XJEIFLH|)Xspa8P
***  v1    0.1 CLI RX  106
**** v1    0.1 CLI RX|Message from VCC-compiler:
**** v1    0.1 CLI RX|Security: Privilege proc_setid missing, will not change uid/gid
**** v1    0.1 CLI RX|Malformed VMOD directors
**** v1    0.1 CLI RX|\tFile name: /tmp/vtest.32_sun12.4/varnish-cache/varnish-trunk/_build/lib/libvmod_directors/.libs/libvmod_directors.so
**** v1    0.1 CLI RX|\t(no Vmod_Data symbol)
**** v1    0.1 CLI RX|('<vcl.inline>' Line 7 Pos 16)
**** v1    0.1 CLI RX|        import directors;
**** v1    0.1 CLI RX|---------------#########-
**** v1    0.1 CLI RX|
**** v1    0.1 CLI RX|Running VCC-compiler failed, exited with 2
**** v1    0.1 CLI RX|VCL compilation failed
---- v1    0.1 FAIL VCL does not compile
*    top   0.1 RESETTING after ../../../bin/varnishtest/tests/d00003.vtc
**   s1    0.1 Waiting for server (3/-1)
**** s1    0.1 macro undef s1_addr
**** s1    0.1 macro undef s1_port
**** s1    0.1 macro undef s1_sock
**   s2    0.1 Waiting for server (4/-1)
**** s2    0.1 macro undef s2_addr
**** s2    0.1 macro undef s2_port
**** s2    0.1 macro undef s2_sock
**   v1    0.1 Wait
**** v1    0.1 CLI TX|panic.clear
***  v1    0.1 CLI RX  300
**** v1    0.1 CLI RX|No panic to clear
**** v1    0.1 STDOUT poll 0x10
**   v1    0.1 R 21128 Status: 0000 (u 0.007000 s 0.025000)
***  v1    0.2 vsl|No VSL chunk found (child not started ?)
*    top   0.2 TEST ../../../bin/varnishtest/tests/d00003.vtc FAILED
#    top  TEST ../../../bin/varnishtest/tests/d00003.vtc FAILED (0.243) exit=2

1 @ SunOS 5.11 i86pc 1.04 32_gcc4.7 uplex

*    top   0.0 TEST ../../../bin/varnishtest/tests/d00003.vtc starting
[...]
*    top   0.0 TEST Test hash director
[...]
**** v1    0.1 CLI TX|\t\t} else if (req.url == "/ip") {
**** v1    0.1 CLI TX|\t\t\tset req.backend_hint = h1.backend(std.ip("127.0.0.1", client.ip));
**** v1    0.1 CLI TX|\t\t} else {
**** v1    0.1 CLI TX|\t\t\tset req.backend_hint = h1.backend(req.url);
**** v1    0.1 CLI TX|\t\t}
**** v1    0.1 CLI TX|\t\treturn (pass);
**** v1    0.1 CLI TX|\t}
**** v1    0.1 CLI TX|
**** v1    0.1 CLI TX|%XJEIFLH|)Xspa8P
***  v1    0.1 CLI RX  106
**** v1    0.1 CLI RX|Message from VCC-compiler:
**** v1    0.1 CLI RX|Security: Privilege proc_setid missing, will not change uid/gid
**** v1    0.1 CLI RX|Malformed VMOD directors
**** v1    0.1 CLI RX|\tFile name: /tmp/vtest.32_gcc4.7/varnish-cache/varnish-trunk/_build/lib/libvmod_directors/.libs/libvmod_directors.so
**** v1    0.1 CLI RX|\t(no Vmod_Data symbol)
**** v1    0.1 CLI RX|('<vcl.inline>' Line 7 Pos 16)
**** v1    0.1 CLI RX|        import directors;
**** v1    0.1 CLI RX|---------------#########-
**** v1    0.1 CLI RX|
**** v1    0.1 CLI RX|Running VCC-compiler failed, exited with 2
**** v1    0.1 CLI RX|VCL compilation failed
---- v1    0.1 FAIL VCL does not compile
*    top   0.1 RESETTING after ../../../bin/varnishtest/tests/d00003.vtc
**   s1    0.1 Waiting for server (3/-1)
**** s1    0.1 macro undef s1_addr
**** s1    0.1 macro undef s1_port
**** s1    0.1 macro undef s1_sock
**   s2    0.1 Waiting for server (4/-1)
**** s2    0.1 macro undef s2_addr
**** s2    0.1 macro undef s2_port
**** s2    0.1 macro undef s2_sock
**   v1    0.1 Wait
**** v1    0.1 CLI TX|panic.clear
***  v1    0.1 CLI RX  300
**** v1    0.1 CLI RX|No panic to clear
**** v1    0.1 STDOUT poll 0x10
**   v1    0.1 R 16122 Status: 0000 (u 0.007000 s 0.025000)
***  v1    0.2 vsl|No VSL chunk found (child not started ?)
*    top   0.2 TEST ../../../bin/varnishtest/tests/d00003.vtc FAILED
#    top  TEST ../../../bin/varnishtest/tests/d00003.vtc FAILED (0.243) exit=2

1 @ SunOS 5.11 i86pc 1.04 64_gcc4.7 uplex

*    top   0.0 TEST ../../../bin/varnishtest/tests/d00003.vtc starting
[...]
*    top   0.0 TEST Test hash director
[...]
**** v1    0.1 CLI TX|\t\t} else if (req.url == "/ip") {
**** v1    0.1 CLI TX|\t\t\tset req.backend_hint = h1.backend(std.ip("127.0.0.1", client.ip));
**** v1    0.1 CLI TX|\t\t} else {
**** v1    0.1 CLI TX|\t\t\tset req.backend_hint = h1.backend(req.url);
**** v1    0.1 CLI TX|\t\t}
**** v1    0.1 CLI TX|\t\treturn (pass);
**** v1    0.1 CLI TX|\t}
**** v1    0.1 CLI TX|
**** v1    0.1 CLI TX|%XJEIFLH|)Xspa8P
***  v1    0.2 CLI RX  106
**** v1    0.2 CLI RX|Message from VCC-compiler:
**** v1    0.2 CLI RX|Security: Privilege proc_setid missing, will not change uid/gid
**** v1    0.2 CLI RX|Malformed VMOD directors
**** v1    0.2 CLI RX|\tFile name: /tmp/vtest.64_gcc4.7/varnish-cache/varnish-trunk/_build/lib/libvmod_directors/.libs/libvmod_directors.so
**** v1    0.2 CLI RX|\t(no Vmod_Data symbol)
**** v1    0.2 CLI RX|('<vcl.inline>' Line 7 Pos 16)
**** v1    0.2 CLI RX|        import directors;
**** v1    0.2 CLI RX|---------------#########-
**** v1    0.2 CLI RX|
**** v1    0.2 CLI RX|Running VCC-compiler failed, exited with 2
**** v1    0.2 CLI RX|VCL compilation failed
---- v1    0.2 FAIL VCL does not compile
*    top   0.2 RESETTING after ../../../bin/varnishtest/tests/d00003.vtc
**   s1    0.2 Waiting for server (3/-1)
**** s1    0.2 macro undef s1_addr
**** s1    0.2 macro undef s1_port
**** s1    0.2 macro undef s1_sock
**   s2    0.2 Waiting for server (4/-1)
**** s2    0.2 macro undef s2_addr
**** s2    0.2 macro undef s2_port
**** s2    0.2 macro undef s2_sock
**   v1    0.2 Wait
**** v1    0.2 CLI TX|panic.clear
***  v1    0.2 CLI RX  300
**** v1    0.2 CLI RX|No panic to clear
**** v1    0.2 STDOUT poll 0x10
**   v1    0.2 R 98155 Status: 0000 (u 0.008000 s 0.030000)
***  v1    0.2 vsl|No VSL chunk found (child not started ?)
*    top   0.2 TEST ../../../bin/varnishtest/tests/d00003.vtc FAILED
#    top  TEST ../../../bin/varnishtest/tests/d00003.vtc FAILED (0.249) exit=2

1 @ SunOS 5.11 i86pc 1.04 32_sun12.4 uplex

*    top   0.0 TEST ../../../bin/varnishtest/tests/d00003.vtc starting
[...]
*    top   0.0 TEST Test hash director
[...]
**** v1    0.1 CLI TX|\t\t} else if (req.url == "/ip") {
**** v1    0.1 CLI TX|\t\t\tset req.backend_hint = h1.backend(std.ip("127.0.0.1", client.ip));
**** v1    0.1 CLI TX|\t\t} else {
**** v1    0.1 CLI TX|\t\t\tset req.backend_hint = h1.backend(req.url);
**** v1    0.1 CLI TX|\t\t}
**** v1    0.1 CLI TX|\t\treturn (pass);
**** v1    0.1 CLI TX|\t}
**** v1    0.1 CLI TX|
**** v1    0.1 CLI TX|%XJEIFLH|)Xspa8P
***  v1    0.1 CLI RX  106
**** v1    0.1 CLI RX|Message from VCC-compiler:
**** v1    0.1 CLI RX|Security: Privilege proc_setid missing, will not change uid/gid
**** v1    0.1 CLI RX|Malformed VMOD directors
**** v1    0.1 CLI RX|\tFile name: /tmp/vtest.32_sun12.4/varnish-cache/varnish-trunk/_build/lib/libvmod_directors/.libs/libvmod_directors.so
**** v1    0.1 CLI RX|\t(no Vmod_Data symbol)
**** v1    0.1 CLI RX|('<vcl.inline>' Line 7 Pos 16)
**** v1    0.1 CLI RX|        import directors;
**** v1    0.1 CLI RX|---------------#########-
**** v1    0.1 CLI RX|
**** v1    0.1 CLI RX|Running VCC-compiler failed, exited with 2
**** v1    0.1 CLI RX|VCL compilation failed
---- v1    0.1 FAIL VCL does not compile
*    top   0.1 RESETTING after ../../../bin/varnishtest/tests/d00003.vtc
**   s1    0.1 Waiting for server (3/-1)
**** s1    0.1 macro undef s1_addr
**** s1    0.1 macro undef s1_port
**** s1    0.1 macro undef s1_sock
**   s2    0.1 Waiting for server (4/-1)
**** s2    0.1 macro undef s2_addr
**** s2    0.1 macro undef s2_port
**** s2    0.1 macro undef s2_sock
**   v1    0.1 Wait
**** v1    0.1 CLI TX|panic.clear
***  v1    0.1 CLI RX  300
**** v1    0.1 CLI RX|No panic to clear
**** v1    0.1 STDOUT poll 0x10
**   v1    0.1 R 59141 Status: 0000 (u 0.006000 s 0.024000)
***  v1    0.2 vsl|No VSL chunk found (child not started ?)
*    top   0.2 TEST ../../../bin/varnishtest/tests/d00003.vtc FAILED
#    top  TEST ../../../bin/varnishtest/tests/d00003.vtc FAILED (0.242) exit=2

1 @ SunOS 5.11 i86pc 1.04 32_gcc4.7 uplex

*    top   0.0 TEST ../../../bin/varnishtest/tests/d00003.vtc starting
[...]
*    top   0.0 TEST Test hash director
[...]
**** v1    0.1 CLI TX|\t\t} else if (req.url == "/ip") {
**** v1    0.1 CLI TX|\t\t\tset req.backend_hint = h1.backend(std.ip("127.0.0.1", client.ip));
**** v1    0.1 CLI TX|\t\t} else {
**** v1    0.1 CLI TX|\t\t\tset req.backend_hint = h1.backend(req.url);
**** v1    0.1 CLI TX|\t\t}
**** v1    0.1 CLI TX|\t\treturn (pass);
**** v1    0.1 CLI TX|\t}
**** v1    0.1 CLI TX|
**** v1    0.1 CLI TX|%XJEIFLH|)Xspa8P
***  v1    0.1 CLI RX  106
**** v1    0.1 CLI RX|Message from VCC-compiler:
**** v1    0.1 CLI RX|Security: Privilege proc_setid missing, will not change uid/gid
**** v1    0.1 CLI RX|Malformed VMOD directors
**** v1    0.1 CLI RX|\tFile name: /tmp/vtest.32_gcc4.7/varnish-cache/varnish-trunk/_build/lib/libvmod_directors/.libs/libvmod_directors.so
**** v1    0.1 CLI RX|\t(no Vmod_Data symbol)
**** v1    0.1 CLI RX|('<vcl.inline>' Line 7 Pos 16)
**** v1    0.1 CLI RX|        import directors;
**** v1    0.1 CLI RX|---------------#########-
**** v1    0.1 CLI RX|
**** v1    0.1 CLI RX|Running VCC-compiler failed, exited with 2
**** v1    0.1 CLI RX|VCL compilation failed
---- v1    0.1 FAIL VCL does not compile
*    top   0.1 RESETTING after ../../../bin/varnishtest/tests/d00003.vtc
**   s1    0.1 Waiting for server (3/-1)
**** s1    0.1 macro undef s1_addr
**** s1    0.1 macro undef s1_port
**** s1    0.1 macro undef s1_sock
**   s2    0.1 Waiting for server (4/-1)
**** s2    0.1 macro undef s2_addr
**** s2    0.1 macro undef s2_port
**** s2    0.1 macro undef s2_sock
**   v1    0.1 Wait
**** v1    0.1 CLI TX|panic.clear
***  v1    0.1 CLI RX  300
**** v1    0.1 CLI RX|No panic to clear
**** v1    0.1 STDOUT poll 0x10
**   v1    0.1 R 19336 Status: 0000 (u 0.006000 s 0.025000)
***  v1    0.2 vsl|No VSL chunk found (child not started ?)
*    top   0.2 TEST ../../../bin/varnishtest/tests/d00003.vtc FAILED
#    top  TEST ../../../bin/varnishtest/tests/d00003.vtc FAILED (0.243) exit=2

1 @ SunOS 5.11 i86pc 1.04 64_sun12.4 uplex

*    top   0.0 TEST ../../../bin/varnishtest/tests/d00003.vtc starting
[...]
*    top   0.0 TEST Test hash director
[...]
**** v1    0.1 CLI TX|\t\t} else if (req.url == "/ip") {
**** v1    0.1 CLI TX|\t\t\tset req.backend_hint = h1.backend(std.ip("127.0.0.1", client.ip));
**** v1    0.1 CLI TX|\t\t} else {
**** v1    0.1 CLI TX|\t\t\tset req.backend_hint = h1.backend(req.url);
**** v1    0.1 CLI TX|\t\t}
**** v1    0.1 CLI TX|\t\treturn (pass);
**** v1    0.1 CLI TX|\t}
**** v1    0.1 CLI TX|
**** v1    0.1 CLI TX|%XJEIFLH|)Xspa8P
***  v1    0.2 CLI RX  106
**** v1    0.2 CLI RX|Message from VCC-compiler:
**** v1    0.2 CLI RX|Security: Privilege proc_setid missing, will not change uid/gid
**** v1    0.2 CLI RX|Malformed VMOD directors
**** v1    0.2 CLI RX|\tFile name: /tmp/vtest.64_sun12.4/varnish-cache/varnish-trunk/_build/lib/libvmod_directors/.libs/libvmod_directors.so
**** v1    0.2 CLI RX|\t(no Vmod_Data symbol)
**** v1    0.2 CLI RX|('<vcl.inline>' Line 7 Pos 16)
**** v1    0.2 CLI RX|        import directors;
**** v1    0.2 CLI RX|---------------#########-
**** v1    0.2 CLI RX|
**** v1    0.2 CLI RX|Running VCC-compiler failed, exited with 2
**** v1    0.2 CLI RX|VCL compilation failed
---- v1    0.2 FAIL VCL does not compile
*    top   0.2 RESETTING after ../../../bin/varnishtest/tests/d00003.vtc
**   s1    0.2 Waiting for server (3/-1)
**** s1    0.2 macro undef s1_addr
**** s1    0.2 macro undef s1_port
**** s1    0.2 macro undef s1_sock
**   s2    0.2 Waiting for server (4/-1)
**** s2    0.2 macro undef s2_addr
**** s2    0.2 macro undef s2_port
**** s2    0.2 macro undef s2_sock
**   v1    0.2 Wait
**** v1    0.2 CLI TX|panic.clear
***  v1    0.2 CLI RX  300
**** v1    0.2 CLI RX|No panic to clear
**** v1    0.2 STDOUT poll 0x10
**   v1    0.2 R 79493 Status: 0000 (u 0.008000 s 0.030000)
***  v1    0.2 vsl|No VSL chunk found (child not started ?)
*    top   0.2 TEST ../../../bin/varnishtest/tests/d00003.vtc FAILED
#    top  TEST ../../../bin/varnishtest/tests/d00003.vtc FAILED (0.250) exit=2

1 @ SunOS 5.11 i86pc 1.04 64_sun12.4 uplex

*    top   0.0 TEST ../../../bin/varnishtest/tests/d00003.vtc starting
[...]
*    top   0.0 TEST Test hash director
[...]
**** v1    0.1 CLI TX|\t\t} else if (req.url == "/ip") {
**** v1    0.1 CLI TX|\t\t\tset req.backend_hint = h1.backend(std.ip("127.0.0.1", client.ip));
**** v1    0.1 CLI TX|\t\t} else {
**** v1    0.1 CLI TX|\t\t\tset req.backend_hint = h1.backend(req.url);
**** v1    0.1 CLI TX|\t\t}
**** v1    0.1 CLI TX|\t\treturn (pass);
**** v1    0.1 CLI TX|\t}
**** v1    0.1 CLI TX|
**** v1    0.1 CLI TX|%XJEIFLH|)Xspa8P
***  v1    0.2 CLI RX  106
**** v1    0.2 CLI RX|Message from VCC-compiler:
**** v1    0.2 CLI RX|Security: Privilege proc_setid missing, will not change uid/gid
**** v1    0.2 CLI RX|Malformed VMOD directors
**** v1    0.2 CLI RX|\tFile name: /tmp/vtest.64_sun12.4/varnish-cache/varnish-trunk/_build/lib/libvmod_directors/.libs/libvmod_directors.so
**** v1    0.2 CLI RX|\t(no Vmod_Data symbol)
**** v1    0.2 CLI RX|('<vcl.inline>' Line 7 Pos 16)
**** v1    0.2 CLI RX|        import directors;
**** v1    0.2 CLI RX|---------------#########-
**** v1    0.2 CLI RX|
**** v1    0.2 CLI RX|Running VCC-compiler failed, exited with 2
**** v1    0.2 CLI RX|VCL compilation failed
---- v1    0.2 FAIL VCL does not compile
*    top   0.2 RESETTING after ../../../bin/varnishtest/tests/d00003.vtc
**   s1    0.2 Waiting for server (3/-1)
**** s1    0.2 macro undef s1_addr
**** s1    0.2 macro undef s1_port
**** s1    0.2 macro undef s1_sock
**   s2    0.2 Waiting for server (4/-1)
**** s2    0.2 macro undef s2_addr
**** s2    0.2 macro undef s2_port
**** s2    0.2 macro undef s2_sock
**   v1    0.2 Wait
**** v1    0.2 CLI TX|panic.clear
***  v1    0.2 CLI RX  300
**** v1    0.2 CLI RX|No panic to clear
**** v1    0.2 STDOUT poll 0x10
**   v1    0.2 R 1707 Status: 0000 (u 0.008000 s 0.028000)
***  v1    0.2 vsl|No VSL chunk found (child not started ?)
*    top   0.2 TEST ../../../bin/varnishtest/tests/d00003.vtc FAILED
#    top  TEST ../../../bin/varnishtest/tests/d00003.vtc FAILED (0.248) exit=2

1 @ SunOS 5.11 i86pc 1.04 32_sun12.4 uplex

*    top   0.0 TEST ../../../bin/varnishtest/tests/d00003.vtc starting
[...]
*    top   0.0 TEST Test hash director
[...]
**** v1    0.1 CLI TX|\t\t} else if (req.url == "/ip") {
**** v1    0.1 CLI TX|\t\t\tset req.backend_hint = h1.backend(std.ip("127.0.0.1", client.ip));
**** v1    0.1 CLI TX|\t\t} else {
**** v1    0.1 CLI TX|\t\t\tset req.backend_hint = h1.backend(req.url);
**** v1    0.1 CLI TX|\t\t}
**** v1    0.1 CLI TX|\t\treturn (pass);
**** v1    0.1 CLI TX|\t}
**** v1    0.1 CLI TX|
**** v1    0.1 CLI TX|%XJEIFLH|)Xspa8P
***  v1    0.1 CLI RX  106
**** v1    0.1 CLI RX|Message from VCC-compiler:
**** v1    0.1 CLI RX|Security: Privilege proc_setid missing, will not change uid/gid
**** v1    0.1 CLI RX|Malformed VMOD directors
**** v1    0.1 CLI RX|\tFile name: /tmp/vtest.32_sun12.4/varnish-cache/varnish-trunk/_build/lib/libvmod_directors/.libs/libvmod_directors.so
**** v1    0.1 CLI RX|\t(no Vmod_Data symbol)
**** v1    0.1 CLI RX|('<vcl.inline>' Line 7 Pos 16)
**** v1    0.1 CLI RX|        import directors;
**** v1    0.1 CLI RX|---------------#########-
**** v1    0.1 CLI RX|
**** v1    0.1 CLI RX|Running VCC-compiler failed, exited with 2
**** v1    0.1 CLI RX|VCL compilation failed
---- v1    0.1 FAIL VCL does not compile
*    top   0.1 RESETTING after ../../../bin/varnishtest/tests/d00003.vtc
**   s1    0.1 Waiting for server (3/-1)
**** s1    0.1 macro undef s1_addr
**** s1    0.1 macro undef s1_port
**** s1    0.1 macro undef s1_sock
**   s2    0.1 Waiting for server (4/-1)
**** s2    0.1 macro undef s2_addr
**** s2    0.1 macro undef s2_port
**** s2    0.1 macro undef s2_sock
**   v1    0.1 Wait
**** v1    0.1 CLI TX|panic.clear
***  v1    0.1 CLI RX  300
**** v1    0.1 CLI RX|No panic to clear
**** v1    0.1 STDOUT poll 0x10
**   v1    0.1 R 19900 Status: 0000 (u 0.006000 s 0.025000)
***  v1    0.2 vsl|No VSL chunk found (child not started ?)
*    top   0.2 TEST ../../../bin/varnishtest/tests/d00003.vtc FAILED
#    top  TEST ../../../bin/varnishtest/tests/d00003.vtc FAILED (0.243) exit=2

1 @ SunOS 5.11 i86pc 1.04 32_gcc4.7 uplex

*    top   0.0 TEST ../../../bin/varnishtest/tests/d00003.vtc starting
[...]
*    top   0.0 TEST Test hash director
[...]
**** v1    0.2 CLI TX|\t\t} else if (req.url == "/ip") {
**** v1    0.2 CLI TX|\t\t\tset req.backend_hint = h1.backend(std.ip("127.0.0.1", client.ip));
**** v1    0.2 CLI TX|\t\t} else {
**** v1    0.2 CLI TX|\t\t\tset req.backend_hint = h1.backend(req.url);
**** v1    0.2 CLI TX|\t\t}
**** v1    0.2 CLI TX|\t\treturn (pass);
**** v1    0.2 CLI TX|\t}
**** v1    0.2 CLI TX|
**** v1    0.2 CLI TX|%XJEIFLH|)Xspa8P
***  v1    0.2 CLI RX  106
**** v1    0.2 CLI RX|Message from VCC-compiler:
**** v1    0.2 CLI RX|Security: Privilege proc_setid missing, will not change uid/gid
**** v1    0.2 CLI RX|Malformed VMOD directors
**** v1    0.2 CLI RX|\tFile name: /tmp/vtest.32_gcc4.7/varnish-cache/varnish-trunk/_build/lib/libvmod_directors/.libs/libvmod_directors.so
**** v1    0.2 CLI RX|\t(no Vmod_Data symbol)
**** v1    0.2 CLI RX|('<vcl.inline>' Line 7 Pos 16)
**** v1    0.2 CLI RX|        import directors;
**** v1    0.2 CLI RX|---------------#########-
**** v1    0.2 CLI RX|
**** v1    0.2 CLI RX|Running VCC-compiler failed, exited with 2
**** v1    0.2 CLI RX|VCL compilation failed
---- v1    0.2 FAIL VCL does not compile
*    top   0.2 RESETTING after ../../../bin/varnishtest/tests/d00003.vtc
**   s1    0.2 Waiting for server (3/-1)
**** s1    0.2 macro undef s1_addr
**** s1    0.2 macro undef s1_port
**** s1    0.2 macro undef s1_sock
**   s2    0.2 Waiting for server (4/-1)
**** s2    0.2 macro undef s2_addr
**** s2    0.2 macro undef s2_port
**** s2    0.2 macro undef s2_sock
**   v1    0.2 Wait
**** v1    0.2 CLI TX|panic.clear
***  v1    0.2 CLI RX  300
**** v1    0.2 CLI RX|No panic to clear
**** v1    0.2 STDOUT poll 0x10
**   v1    0.2 R 31785 Status: 0000 (u 0.009000 s 0.031000)
***  v1    0.3 vsl|No VSL chunk found (child not started ?)
*    top   0.3 TEST ../../../bin/varnishtest/tests/d00003.vtc FAILED
#    top  TEST ../../../bin/varnishtest/tests/d00003.vtc FAILED (0.254) exit=2

1 @ SunOS 5.11 i86pc 1.04 32_gcc4.7 uplex

*    top   0.0 TEST ../../../bin/varnishtest/tests/d00003.vtc starting
[...]
*    top   0.0 TEST Test hash director
[...]
**** v1    0.1 CLI TX|\t\t} else if (req.url == "/ip") {
**** v1    0.1 CLI TX|\t\t\tset req.backend_hint = h1.backend(std.ip("127.0.0.1", client.ip));
**** v1    0.1 CLI TX|\t\t} else {
**** v1    0.1 CLI TX|\t\t\tset req.backend_hint = h1.backend(req.url);
**** v1    0.1 CLI TX|\t\t}
**** v1    0.1 CLI TX|\t\treturn (pass);
**** v1    0.1 CLI TX|\t}
**** v1    0.1 CLI TX|
**** v1    0.1 CLI TX|%XJEIFLH|)Xspa8P
***  v1    0.1 CLI RX  106
**** v1    0.1 CLI RX|Message from VCC-compiler:
**** v1    0.1 CLI RX|Security: Privilege proc_setid missing, will not change uid/gid
**** v1    0.1 CLI RX|Malformed VMOD directors
**** v1    0.1 CLI RX|\tFile name: /tmp/vtest.32_gcc4.7/varnish-cache/varnish-trunk/_build/lib/libvmod_directors/.libs/libvmod_directors.so
**** v1    0.1 CLI RX|\t(no Vmod_Data symbol)
**** v1    0.1 CLI RX|('<vcl.inline>' Line 7 Pos 16)
**** v1    0.1 CLI RX|        import directors;
**** v1    0.1 CLI RX|---------------#########-
**** v1    0.1 CLI RX|
**** v1    0.1 CLI RX|Running VCC-compiler failed, exited with 2
**** v1    0.1 CLI RX|VCL compilation failed
---- v1    0.1 FAIL VCL does not compile
*    top   0.1 RESETTING after ../../../bin/varnishtest/tests/d00003.vtc
**   s1    0.1 Waiting for server (3/-1)
**** s1    0.1 macro undef s1_addr
**** s1    0.1 macro undef s1_port
**** s1    0.1 macro undef s1_sock
**   s2    0.1 Waiting for server (4/-1)
**** s2    0.1 macro undef s2_addr
**** s2    0.1 macro undef s2_port
**** s2    0.1 macro undef s2_sock
**   v1    0.1 Wait
**** v1    0.1 CLI TX|panic.clear
***  v1    0.1 CLI RX  300
**** v1    0.1 CLI RX|No panic to clear
**** v1    0.1 STDOUT poll 0x10
**   v1    0.1 R 14874 Status: 0000 (u 0.007000 s 0.025000)
***  v1    0.2 vsl|No VSL chunk found (child not started ?)
*    top   0.2 TEST ../../../bin/varnishtest/tests/d00003.vtc FAILED
#    top  TEST ../../../bin/varnishtest/tests/d00003.vtc FAILED (0.243) exit=2

1 @ SunOS 5.11 i86pc 1.04 64_gcc4.7 uplex

*    top   0.0 TEST ../../../bin/varnishtest/tests/d00003.vtc starting
[...]
*    top   0.0 TEST Test hash director
[...]
**** v1    0.1 CLI TX|\t\t} else if (req.url == "/ip") {
**** v1    0.1 CLI TX|\t\t\tset req.backend_hint = h1.backend(std.ip("127.0.0.1", client.ip));
**** v1    0.1 CLI TX|\t\t} else {
**** v1    0.1 CLI TX|\t\t\tset req.backend_hint = h1.backend(req.url);
**** v1    0.1 CLI TX|\t\t}
**** v1    0.1 CLI TX|\t\treturn (pass);
**** v1    0.1 CLI TX|\t}
**** v1    0.1 CLI TX|
**** v1    0.1 CLI TX|%XJEIFLH|)Xspa8P
***  v1    0.2 CLI RX  106
**** v1    0.2 CLI RX|Message from VCC-compiler:
**** v1    0.2 CLI RX|Security: Privilege proc_setid missing, will not change uid/gid
**** v1    0.2 CLI RX|Malformed VMOD directors
**** v1    0.2 CLI RX|\tFile name: /tmp/vtest.64_gcc4.7/varnish-cache/varnish-trunk/_build/lib/libvmod_directors/.libs/libvmod_directors.so
**** v1    0.2 CLI RX|\t(no Vmod_Data symbol)
**** v1    0.2 CLI RX|('<vcl.inline>' Line 7 Pos 16)
**** v1    0.2 CLI RX|        import directors;
**** v1    0.2 CLI RX|---------------#########-
**** v1    0.2 CLI RX|
**** v1    0.2 CLI RX|Running VCC-compiler failed, exited with 2
**** v1    0.2 CLI RX|VCL compilation failed
---- v1    0.2 FAIL VCL does not compile
*    top   0.2 RESETTING after ../../../bin/varnishtest/tests/d00003.vtc
**   s1    0.2 Waiting for server (3/-1)
**** s1    0.2 macro undef s1_addr
**** s1    0.2 macro undef s1_port
**** s1    0.2 macro undef s1_sock
**   s2    0.2 Waiting for server (4/-1)
**** s2    0.2 macro undef s2_addr
**** s2    0.2 macro undef s2_port
**** s2    0.2 macro undef s2_sock
**   v1    0.2 Wait
**** v1    0.2 CLI TX|panic.clear
***  v1    0.2 CLI RX  300
**** v1    0.2 CLI RX|No panic to clear
**** v1    0.2 STDOUT poll 0x10
**   v1    0.2 R 75807 Status: 0000 (u 0.009000 s 0.031000)
***  v1    0.2 vsl|No VSL chunk found (child not started ?)
*    top   0.2 TEST ../../../bin/varnishtest/tests/d00003.vtc FAILED
#    top  TEST ../../../bin/varnishtest/tests/d00003.vtc FAILED (0.251) exit=2

1 @ SunOS 5.11 i86pc 1.04 64_sun12.4 uplex

*    top   0.0 TEST ../../../bin/varnishtest/tests/d00003.vtc starting
[...]
*    top   0.0 TEST Test hash director
[...]
**** v1    0.1 CLI TX|\t\t} else if (req.url == "/ip") {
**** v1    0.1 CLI TX|\t\t\tset req.backend_hint = h1.backend(std.ip("127.0.0.1", client.ip));
**** v1    0.1 CLI TX|\t\t} else {
**** v1    0.1 CLI TX|\t\t\tset req.backend_hint = h1.backend(req.url);
**** v1    0.1 CLI TX|\t\t}
**** v1    0.1 CLI TX|\t\treturn (pass);
**** v1    0.1 CLI TX|\t}
**** v1    0.1 CLI TX|
**** v1    0.1 CLI TX|%XJEIFLH|)Xspa8P
***  v1    0.2 CLI RX  106
**** v1    0.2 CLI RX|Message from VCC-compiler:
**** v1    0.2 CLI RX|Security: Privilege proc_setid missing, will not change uid/gid
**** v1    0.2 CLI RX|Malformed VMOD directors
**** v1    0.2 CLI RX|\tFile name: /tmp/vtest.64_sun12.4/varnish-cache/varnish-trunk/_build/lib/libvmod_directors/.libs/libvmod_directors.so
**** v1    0.2 CLI RX|\t(no Vmod_Data symbol)
**** v1    0.2 CLI RX|('<vcl.inline>' Line 7 Pos 16)
**** v1    0.2 CLI RX|        import directors;
**** v1    0.2 CLI RX|---------------#########-
**** v1    0.2 CLI RX|
**** v1    0.2 CLI RX|Running VCC-compiler failed, exited with 2
**** v1    0.2 CLI RX|VCL compilation failed
---- v1    0.2 FAIL VCL does not compile
*    top   0.2 RESETTING after ../../../bin/varnishtest/tests/d00003.vtc
**   s1    0.2 Waiting for server (3/-1)
**** s1    0.2 macro undef s1_addr
**** s1    0.2 macro undef s1_port
**** s1    0.2 macro undef s1_sock
**   s2    0.2 Waiting for server (4/-1)
**** s2    0.2 macro undef s2_addr
**** s2    0.2 macro undef s2_port
**** s2    0.2 macro undef s2_sock
**   v1    0.2 Wait
**** v1    0.2 CLI TX|panic.clear
***  v1    0.2 CLI RX  300
**** v1    0.2 CLI RX|No panic to clear
**** v1    0.2 STDOUT poll 0x10
**   v1    0.2 R 6521 Status: 0000 (u 0.009000 s 0.029000)
***  v1    0.2 vsl|No VSL chunk found (child not started ?)
*    top   0.2 TEST ../../../bin/varnishtest/tests/d00003.vtc FAILED
#    top  TEST ../../../bin/varnishtest/tests/d00003.vtc FAILED (0.250) exit=2

1 @ SunOS 5.11 i86pc 1.04 64_sun12.4 uplex

*    top   0.0 TEST ../../../bin/varnishtest/tests/d00003.vtc starting
[...]
*    top   0.0 TEST Test hash director
[...]
**** v1    0.1 CLI TX|\t\t} else if (req.url == "/ip") {
**** v1    0.1 CLI TX|\t\t\tset req.backend_hint = h1.backend(std.ip("127.0.0.1", client.ip));
**** v1    0.1 CLI TX|\t\t} else {
**** v1    0.1 CLI TX|\t\t\tset req.backend_hint = h1.backend(req.url);
**** v1    0.1 CLI TX|\t\t}
**** v1    0.1 CLI TX|\t\treturn (pass);
**** v1    0.1 CLI TX|\t}
**** v1    0.1 CLI TX|
**** v1    0.1 CLI TX|%XJEIFLH|)Xspa8P
***  v1    0.2 CLI RX  106
**** v1    0.2 CLI RX|Message from VCC-compiler:
**** v1    0.2 CLI RX|Security: Privilege proc_setid missing, will not change uid/gid
**** v1    0.2 CLI RX|Malformed VMOD directors
**** v1    0.2 CLI RX|\tFile name: /tmp/vtest.64_sun12.4/varnish-cache/varnish-trunk/_build/lib/libvmod_directors/.libs/libvmod_directors.so
**** v1    0.2 CLI RX|\t(no Vmod_Data symbol)
**** v1    0.2 CLI RX|('<vcl.inline>' Line 7 Pos 16)
**** v1    0.2 CLI RX|        import directors;
**** v1    0.2 CLI RX|---------------#########-
**** v1    0.2 CLI RX|
**** v1    0.2 CLI RX|Running VCC-compiler failed, exited with 2
**** v1    0.2 CLI RX|VCL compilation failed
---- v1    0.2 FAIL VCL does not compile
*    top   0.2 RESETTING after ../../../bin/varnishtest/tests/d00003.vtc
**   s1    0.2 Waiting for server (3/-1)
**** s1    0.2 macro undef s1_addr
**** s1    0.2 macro undef s1_port
**** s1    0.2 macro undef s1_sock
**   s2    0.2 Waiting for server (4/-1)
**** s2    0.2 macro undef s2_addr
**** s2    0.2 macro undef s2_port
**** s2    0.2 macro undef s2_sock
**   v1    0.2 Wait
**** v1    0.2 CLI TX|panic.clear
***  v1    0.2 CLI RX  300
**** v1    0.2 CLI RX|No panic to clear
**** v1    0.2 STDOUT poll 0x10
**   v1    0.2 R 72542 Status: 0000 (u 0.008000 s 0.031000)
***  v1    0.2 vsl|No VSL chunk found (child not started ?)
*    top   0.2 TEST ../../../bin/varnishtest/tests/d00003.vtc FAILED
#    top  TEST ../../../bin/varnishtest/tests/d00003.vtc FAILED (0.252) exit=2

1 @ SunOS 5.11 i86pc 1.04 64_gcc4.7 uplex

*    top   0.0 TEST ../../../bin/varnishtest/tests/d00003.vtc starting
[...]
*    top   0.0 TEST Test hash director
[...]
**** v1    0.1 CLI TX|\t\t} else if (req.url == "/ip") {
**** v1    0.1 CLI TX|\t\t\tset req.backend_hint = h1.backend(std.ip("127.0.0.1", client.ip));
**** v1    0.1 CLI TX|\t\t} else {
**** v1    0.1 CLI TX|\t\t\tset req.backend_hint = h1.backend(req.url);
**** v1    0.1 CLI TX|\t\t}
**** v1    0.1 CLI TX|\t\treturn (pass);
**** v1    0.1 CLI TX|\t}
**** v1    0.1 CLI TX|
**** v1    0.1 CLI TX|%XJEIFLH|)Xspa8P
***  v1    0.2 CLI RX  106
**** v1    0.2 CLI RX|Message from VCC-compiler:
**** v1    0.2 CLI RX|Security: Privilege proc_setid missing, will not change uid/gid
**** v1    0.2 CLI RX|Malformed VMOD directors
**** v1    0.2 CLI RX|\tFile name: /tmp/vtest.64_gcc4.7/varnish-cache/varnish-trunk/_build/lib/libvmod_directors/.libs/libvmod_directors.so
**** v1    0.2 CLI RX|\t(no Vmod_Data symbol)
**** v1    0.2 CLI RX|('<vcl.inline>' Line 7 Pos 16)
**** v1    0.2 CLI RX|        import directors;
**** v1    0.2 CLI RX|---------------#########-
**** v1    0.2 CLI RX|
**** v1    0.2 CLI RX|Running VCC-compiler failed, exited with 2
**** v1    0.2 CLI RX|VCL compilation failed
---- v1    0.2 FAIL VCL does not compile
*    top   0.2 RESETTING after ../../../bin/varnishtest/tests/d00003.vtc
**   s1    0.2 Waiting for server (3/-1)
**** s1    0.2 macro undef s1_addr
**** s1    0.2 macro undef s1_port
**** s1    0.2 macro undef s1_sock
**   s2    0.2 Waiting for server (4/-1)
**** s2    0.2 macro undef s2_addr
**** s2    0.2 macro undef s2_port
**** s2    0.2 macro undef s2_sock
**   v1    0.2 Wait
**** v1    0.2 CLI TX|panic.clear
***  v1    0.2 CLI RX  300
**** v1    0.2 CLI RX|No panic to clear
**** v1    0.2 STDOUT poll 0x10
**   v1    0.2 R 78740 Status: 0000 (u 0.008000 s 0.029000)
***  v1    0.2 vsl|No VSL chunk found (child not started ?)
*    top   0.2 TEST ../../../bin/varnishtest/tests/d00003.vtc FAILED
#    top  TEST ../../../bin/varnishtest/tests/d00003.vtc FAILED (0.247) exit=2

1 @ SunOS 5.11 i86pc 1.04 32_sun12.4 uplex

*    top   0.0 TEST ../../../bin/varnishtest/tests/d00003.vtc starting
[...]
*    top   0.0 TEST Test hash director
[...]
**** v1    0.1 CLI TX|\t\t} else if (req.url == "/ip") {
**** v1    0.1 CLI TX|\t\t\tset req.backend_hint = h1.backend(std.ip("127.0.0.1", client.ip));
**** v1    0.1 CLI TX|\t\t} else {
**** v1    0.1 CLI TX|\t\t\tset req.backend_hint = h1.backend(req.url);
**** v1    0.1 CLI TX|\t\t}
**** v1    0.1 CLI TX|\t\treturn (pass);
**** v1    0.1 CLI TX|\t}
**** v1    0.1 CLI TX|
**** v1    0.1 CLI TX|%XJEIFLH|)Xspa8P
***  v1    0.1 CLI RX  106
**** v1    0.1 CLI RX|Message from VCC-compiler:
**** v1    0.1 CLI RX|Security: Privilege proc_setid missing, will not change uid/gid
**** v1    0.1 CLI RX|Malformed VMOD directors
**** v1    0.1 CLI RX|\tFile name: /tmp/vtest.32_sun12.4/varnish-cache/varnish-trunk/_build/lib/libvmod_directors/.libs/libvmod_directors.so
**** v1    0.1 CLI RX|\t(no Vmod_Data symbol)
**** v1    0.1 CLI RX|('<vcl.inline>' Line 7 Pos 16)
**** v1    0.1 CLI RX|        import directors;
**** v1    0.1 CLI RX|---------------#########-
**** v1    0.1 CLI RX|
**** v1    0.1 CLI RX|Running VCC-compiler failed, exited with 2
**** v1    0.1 CLI RX|VCL compilation failed
---- v1    0.1 FAIL VCL does not compile
*    top   0.1 RESETTING after ../../../bin/varnishtest/tests/d00003.vtc
**   s1    0.1 Waiting for server (3/-1)
**** s1    0.1 macro undef s1_addr
**** s1    0.1 macro undef s1_port
**** s1    0.1 macro undef s1_sock
**   s2    0.1 Waiting for server (4/-1)
**** s2    0.1 macro undef s2_addr
**** s2    0.1 macro undef s2_port
**** s2    0.1 macro undef s2_sock
**   v1    0.1 Wait
**** v1    0.1 CLI TX|panic.clear
***  v1    0.1 CLI RX  300
**** v1    0.1 CLI RX|No panic to clear
**** v1    0.1 STDOUT poll 0x10
**   v1    0.1 R 60615 Status: 0000 (u 0.006000 s 0.025000)
***  v1    0.2 vsl|No VSL chunk found (child not started ?)
*    top   0.2 TEST ../../../bin/varnishtest/tests/d00003.vtc FAILED
#    top  TEST ../../../bin/varnishtest/tests/d00003.vtc FAILED (0.243) exit=2

1 @ SunOS 5.11 i86pc 1.04 64_gcc4.7 uplex

*    top   0.0 TEST ../../../bin/varnishtest/tests/d00003.vtc starting
[...]
*    top   0.0 TEST Test hash director
[...]
**** v1    0.1 CLI TX|\t\t} else if (req.url == "/ip") {
**** v1    0.1 CLI TX|\t\t\tset req.backend_hint = h1.backend(std.ip("127.0.0.1", client.ip));
**** v1    0.1 CLI TX|\t\t} else {
**** v1    0.1 CLI TX|\t\t\tset req.backend_hint = h1.backend(req.url);
**** v1    0.1 CLI TX|\t\t}
**** v1    0.1 CLI TX|\t\treturn (pass);
**** v1    0.1 CLI TX|\t}
**** v1    0.1 CLI TX|
**** v1    0.1 CLI TX|%XJEIFLH|)Xspa8P
***  v1    0.2 CLI RX  106
**** v1    0.2 CLI RX|Message from VCC-compiler:
**** v1    0.2 CLI RX|Security: Privilege proc_setid missing, will not change uid/gid
**** v1    0.2 CLI RX|Malformed VMOD directors
**** v1    0.2 CLI RX|\tFile name: /tmp/vtest.64_gcc4.7/varnish-cache/varnish-trunk/_build/lib/libvmod_directors/.libs/libvmod_directors.so
**** v1    0.2 CLI RX|\t(no Vmod_Data symbol)
**** v1    0.2 CLI RX|('<vcl.inline>' Line 7 Pos 16)
**** v1    0.2 CLI RX|        import directors;
**** v1    0.2 CLI RX|---------------#########-
**** v1    0.2 CLI RX|
**** v1    0.2 CLI RX|Running VCC-compiler failed, exited with 2
**** v1    0.2 CLI RX|VCL compilation failed
---- v1    0.2 FAIL VCL does not compile
*    top   0.2 RESETTING after ../../../bin/varnishtest/tests/d00003.vtc
**   s1    0.2 Waiting for server (3/-1)
**** s1    0.2 macro undef s1_addr
**** s1    0.2 macro undef s1_port
**** s1    0.2 macro undef s1_sock
**   s2    0.2 Waiting for server (4/-1)
**** s2    0.2 macro undef s2_addr
**** s2    0.2 macro undef s2_port
**** s2    0.2 macro undef s2_sock
**   v1    0.2 Wait
**** v1    0.2 CLI TX|panic.clear
***  v1    0.2 CLI RX  300
**** v1    0.2 CLI RX|No panic to clear
**** v1    0.2 STDOUT poll 0x10
**   v1    0.2 R 99692 Status: 0000 (u 0.009000 s 0.029000)
***  v1    0.2 vsl|No VSL chunk found (child not started ?)
*    top   0.2 TEST ../../../bin/varnishtest/tests/d00003.vtc FAILED
#    top  TEST ../../../bin/varnishtest/tests/d00003.vtc FAILED (0.248) exit=2

1 @ SunOS 5.11 i86pc 1.04 32_sun12.4 uplex

*    top   0.0 TEST ../../../bin/varnishtest/tests/d00003.vtc starting
[...]
*    top   0.0 TEST Test hash director
[...]
**** v1    0.1 CLI TX|\t\t} else if (req.url == "/ip") {
**** v1    0.1 CLI TX|\t\t\tset req.backend_hint = h1.backend(std.ip("127.0.0.1", client.ip));
**** v1    0.1 CLI TX|\t\t} else {
**** v1    0.1 CLI TX|\t\t\tset req.backend_hint = h1.backend(req.url);
**** v1    0.1 CLI TX|\t\t}
**** v1    0.1 CLI TX|\t\treturn (pass);
**** v1    0.1 CLI TX|\t}
**** v1    0.1 CLI TX|
**** v1    0.1 CLI TX|%XJEIFLH|)Xspa8P
***  v1    0.1 CLI RX  106
**** v1    0.1 CLI RX|Message from VCC-compiler:
**** v1    0.1 CLI RX|Security: Privilege proc_setid missing, will not change uid/gid
**** v1    0.1 CLI RX|Malformed VMOD directors
**** v1    0.1 CLI RX|\tFile name: /tmp/vtest.32_sun12.4/varnish-cache/varnish-trunk/_build/lib/libvmod_directors/.libs/libvmod_directors.so
**** v1    0.1 CLI RX|\t(no Vmod_Data symbol)
**** v1    0.1 CLI RX|('<vcl.inline>' Line 7 Pos 16)
**** v1    0.1 CLI RX|        import directors;
**** v1    0.1 CLI RX|---------------#########-
**** v1    0.1 CLI RX|
**** v1    0.1 CLI RX|Running VCC-compiler failed, exited with 2
**** v1    0.1 CLI RX|VCL compilation failed
---- v1    0.1 FAIL VCL does not compile
*    top   0.1 RESETTING after ../../../bin/varnishtest/tests/d00003.vtc
**   s1    0.1 Waiting for server (3/-1)
**** s1    0.1 macro undef s1_addr
**** s1    0.1 macro undef s1_port
**** s1    0.1 macro undef s1_sock
**   s2    0.1 Waiting for server (4/-1)
**** s2    0.1 macro undef s2_addr
**** s2    0.1 macro undef s2_port
**** s2    0.1 macro undef s2_sock
**   v1    0.1 Wait
**** v1    0.1 CLI TX|panic.clear
***  v1    0.1 CLI RX  300
**** v1    0.1 CLI RX|No panic to clear
**** v1    0.1 STDOUT poll 0x10
**   v1    0.2 R 23263 Status: 0000 (u 0.008000 s 0.027000)
***  v1    0.2 vsl|No VSL chunk found (child not started ?)
*    top   0.2 TEST ../../../bin/varnishtest/tests/d00003.vtc FAILED
#    top  TEST ../../../bin/varnishtest/tests/d00003.vtc FAILED (0.246) exit=2

1 @ SunOS 5.11 i86pc 1.04 32_sun12.4 uplex

*    top   0.0 TEST ../../../bin/varnishtest/tests/d00003.vtc starting
[...]
*    top   0.0 TEST Test hash director
[...]
**** v1    0.1 CLI TX|\t\t} else if (req.url == "/ip") {
**** v1    0.1 CLI TX|\t\t\tset req.backend_hint = h1.backend(std.ip("127.0.0.1", client.ip));
**** v1    0.1 CLI TX|\t\t} else {
**** v1    0.1 CLI TX|\t\t\tset req.backend_hint = h1.backend(req.url);
**** v1    0.1 CLI TX|\t\t}
**** v1    0.1 CLI TX|\t\treturn (pass);
**** v1    0.1 CLI TX|\t}
**** v1    0.1 CLI TX|
**** v1    0.1 CLI TX|%XJEIFLH|)Xspa8P
***  v1    0.2 CLI RX  106
**** v1    0.2 CLI RX|Message from VCC-compiler:
**** v1    0.2 CLI RX|Security: Privilege proc_setid missing, will not change uid/gid
**** v1    0.2 CLI RX|Malformed VMOD directors
**** v1    0.2 CLI RX|\tFile name: /tmp/vtest.32_sun12.4/varnish-cache/varnish-trunk/_build/lib/libvmod_directors/.libs/libvmod_directors.so
**** v1    0.2 CLI RX|\t(no Vmod_Data symbol)
**** v1    0.2 CLI RX|('<vcl.inline>' Line 7 Pos 16)
**** v1    0.2 CLI RX|        import directors;
**** v1    0.2 CLI RX|---------------#########-
**** v1    0.2 CLI RX|
**** v1    0.2 CLI RX|Running VCC-compiler failed, exited with 2
**** v1    0.2 CLI RX|VCL compilation failed
---- v1    0.2 FAIL VCL does not compile
*    top   0.2 RESETTING after ../../../bin/varnishtest/tests/d00003.vtc
**   s1    0.2 Waiting for server (3/-1)
**** s1    0.2 macro undef s1_addr
**** s1    0.2 macro undef s1_port
**** s1    0.2 macro undef s1_sock
**   s2    0.2 Waiting for server (4/-1)
**** s2    0.2 macro undef s2_addr
**** s2    0.2 macro undef s2_port
**** s2    0.2 macro undef s2_sock
**   v1    0.2 Wait
**** v1    0.2 CLI TX|panic.clear
***  v1    0.2 CLI RX  300
**** v1    0.2 CLI RX|No panic to clear
**** v1    0.2 STDOUT poll 0x10
**   v1    0.2 R 91333 Status: 0000 (u 0.008000 s 0.028000)
***  v1    0.2 vsl|No VSL chunk found (child not started ?)
*    top   0.2 TEST ../../../bin/varnishtest/tests/d00003.vtc FAILED
#    top  TEST ../../../bin/varnishtest/tests/d00003.vtc FAILED (0.247) exit=2

1 @ SunOS 5.11 i86pc 1.04 64_gcc4.7 uplex

*    top   0.0 TEST ../../../bin/varnishtest/tests/d00003.vtc starting
[...]
*    top   0.0 TEST Test hash director
[...]
**** v1    0.1 CLI TX|\t\t} else if (req.url == "/ip") {
**** v1    0.1 CLI TX|\t\t\tset req.backend_hint = h1.backend(std.ip("127.0.0.1", client.ip));
**** v1    0.1 CLI TX|\t\t} else {
**** v1    0.1 CLI TX|\t\t\tset req.backend_hint = h1.backend(req.url);
**** v1    0.1 CLI TX|\t\t}
**** v1    0.1 CLI TX|\t\treturn (pass);
**** v1    0.1 CLI TX|\t}
**** v1    0.1 CLI TX|
**** v1    0.1 CLI TX|%XJEIFLH|)Xspa8P
***  v1    0.2 CLI RX  106
**** v1    0.2 CLI RX|Message from VCC-compiler:
**** v1    0.2 CLI RX|Security: Privilege proc_setid missing, will not change uid/gid
**** v1    0.2 CLI RX|Malformed VMOD directors
**** v1    0.2 CLI RX|\tFile name: /tmp/vtest.64_gcc4.7/varnish-cache/varnish-trunk/_build/lib/libvmod_directors/.libs/libvmod_directors.so
**** v1    0.2 CLI RX|\t(no Vmod_Data symbol)
**** v1    0.2 CLI RX|('<vcl.inline>' Line 7 Pos 16)
**** v1    0.2 CLI RX|        import directors;
**** v1    0.2 CLI RX|---------------#########-
**** v1    0.2 CLI RX|
**** v1    0.2 CLI RX|Running VCC-compiler failed, exited with 2
**** v1    0.2 CLI RX|VCL compilation failed
---- v1    0.2 FAIL VCL does not compile
*    top   0.2 RESETTING after ../../../bin/varnishtest/tests/d00003.vtc
**   s1    0.2 Waiting for server (3/-1)
**** s1    0.2 macro undef s1_addr
**** s1    0.2 macro undef s1_port
**** s1    0.2 macro undef s1_sock
**   s2    0.2 Waiting for server (4/-1)
**** s2    0.2 macro undef s2_addr
**** s2    0.2 macro undef s2_port
**** s2    0.2 macro undef s2_sock
**   v1    0.2 Wait
**** v1    0.2 CLI TX|panic.clear
***  v1    0.2 CLI RX  300
**** v1    0.2 CLI RX|No panic to clear
**** v1    0.2 STDOUT poll 0x10
**   v1    0.2 R 73421 Status: 0000 (u 0.009000 s 0.030000)
***  v1    0.2 vsl|No VSL chunk found (child not started ?)
*    top   0.2 TEST ../../../bin/varnishtest/tests/d00003.vtc FAILED
#    top  TEST ../../../bin/varnishtest/tests/d00003.vtc FAILED (0.248) exit=2

1 @ SunOS 5.11 i86pc 1.04 64_sun12.4 uplex

*    top   0.0 TEST ../../../bin/varnishtest/tests/d00003.vtc starting
[...]
*    top   0.0 TEST Test hash director
[...]
**** v1    0.1 CLI TX|\t\t} else if (req.url == "/ip") {
**** v1    0.1 CLI TX|\t\t\tset req.backend_hint = h1.backend(std.ip("127.0.0.1", client.ip));
**** v1    0.1 CLI TX|\t\t} else {
**** v1    0.1 CLI TX|\t\t\tset req.backend_hint = h1.backend(req.url);
**** v1    0.1 CLI TX|\t\t}
**** v1    0.1 CLI TX|\t\treturn (pass);
**** v1    0.1 CLI TX|\t}
**** v1    0.1 CLI TX|
**** v1    0.1 CLI TX|%XJEIFLH|)Xspa8P
***  v1    0.2 CLI RX  106
**** v1    0.2 CLI RX|Message from VCC-compiler:
**** v1    0.2 CLI RX|Security: Privilege proc_setid missing, will not change uid/gid
**** v1    0.2 CLI RX|Malformed VMOD directors
**** v1    0.2 CLI RX|\tFile name: /tmp/vtest.64_sun12.4/varnish-cache/varnish-trunk/_build/lib/libvmod_directors/.libs/libvmod_directors.so
**** v1    0.2 CLI RX|\t(no Vmod_Data symbol)
**** v1    0.2 CLI RX|('<vcl.inline>' Line 7 Pos 16)
**** v1    0.2 CLI RX|        import directors;
**** v1    0.2 CLI RX|---------------#########-
**** v1    0.2 CLI RX|
**** v1    0.2 CLI RX|Running VCC-compiler failed, exited with 2
**** v1    0.2 CLI RX|VCL compilation failed
---- v1    0.2 FAIL VCL does not compile
*    top   0.2 RESETTING after ../../../bin/varnishtest/tests/d00003.vtc
**   s1    0.2 Waiting for server (3/-1)
**** s1    0.2 macro undef s1_addr
**** s1    0.2 macro undef s1_port
**** s1    0.2 macro undef s1_sock
**   s2    0.2 Waiting for server (4/-1)
**** s2    0.2 macro undef s2_addr
**** s2    0.2 macro undef s2_port
**** s2    0.2 macro undef s2_sock
**   v1    0.2 Wait
**** v1    0.2 CLI TX|panic.clear
***  v1    0.2 CLI RX  300
**** v1    0.2 CLI RX|No panic to clear
**** v1    0.2 STDOUT poll 0x10
**   v1    0.2 R 74028 Status: 0000 (u 0.008000 s 0.031000)
***  v1    0.2 vsl|No VSL chunk found (child not started ?)
*    top   0.2 TEST ../../../bin/varnishtest/tests/d00003.vtc FAILED
#    top  TEST ../../../bin/varnishtest/tests/d00003.vtc FAILED (0.250) exit=2