d00030

b2d2b6f

1 @ FreeBSD arm 12.0-BET 1.04 phk

*    top   0.0 TEST ../../../../bin/varnishtest/tests/d00030.vtc starting
[...]
*    top   0.0 VTEST shard director error handling
[...]
**** v1   52.5 CLI TX|    }
**** v1   52.5 CLI TX|
**** v1   52.5 CLI TX|%XJEIFLH|)Xspa8P
**** v1   52.6 vsl|          0 CLI             - Rd ping
**** v1   52.6 vsl|          0 CLI             - Wr 200 19 PONG 1542215455 1.0
***  v1   58.0 CLI RX  300
**** v1   58.0 CLI RX|VCL compiled.
**** v1   58.0 CLI RX|VCL "vcl11" Failed initialization
**** v1   58.0 CLI RX|Message:
**** v1   58.0 CLI RX|\tshard .backend resolve=LAZY with other parameters can only be used in backend context
**** v1   58.0 CLI RX|rr: NULL backend cannot be added
**   v1   58.0 VCL compilation failed (as expected)
***  v1   58.0 Found expected string: ("resolve=LAZY with other parameters can only be used in backend context")
**   top  58.0 === varnish v1 -errvcl {resolve=NOW can not be used in vcl_init}...
**** v1   58.0 CLI TX|vcl.inline vcl12 << %XJEIFLH|)Xspa8P
**** v1   58.0 CLI TX|vcl 4.1;
**** v1   58.0 CLI TX|
**** v1   58.0 CLI TX|    import directors;
**** v1   58.0 CLI TX|    import blob;
**** v1   58.0 CLI TX|
**** v1   58.0 CLI TX|    backend dummy { .host = "127.0.0.1 40899"; }
**** v1   58.0 CLI TX|
**** v1   58.0 CLI TX|    sub vcl_init {
**** v1   58.0 CLI TX|\tnew shard = directors.shard();
**** v1   58.0 CLI TX|\tnew rr = directors.round_robin();
**** v1   58.0 CLI TX|\trr.add_backend(shard.backend(resolve=NOW));
**** v1   58.0 CLI TX|    }
**** v1   58.0 CLI TX|
**** v1   58.0 CLI TX|%XJEIFLH|)Xspa8P
**** v1   58.0 vsl|          0 CLI             - Rd vcl.load vcl11 vcl_vcl11.1542215455.947750/vgc.so 1auto
**** v1   58.0 vsl|          0 CLI             - Wr 300 163 VCL "vcl11" Failed initialization
Message:
shard .backend resolve=LAZY with other parameters can only be used in backend context
rr: NULL backend cannot be added

**** v1   58.1 vsl|          0 CLI             - Rd ping
**** v1   58.1 vsl|          0 CLI             - Wr 200 19 PONG 1542215461 1.0
#    top  TEST ../../../../bin/varnishtest/tests/d00030.vtc TIMED OUT (kill -9)
#    top  TEST ../../../../bin/varnishtest/tests/d00030.vtc FAILED (60.075) signal=9
FAIL tests/d00030.vtc (exit status: 2)

1 @ FreeBSD arm 12.0-BET 1.04 phk

*    top   0.0 TEST ../../../../bin/varnishtest/tests/d00030.vtc starting
[...]
*    top   0.0 VTEST shard director error handling
[...]
Message:
shard_param.set() p: invalid warmup argument 1.100000

**** v1   52.5 vsl|          0 CLI             - Rd ping
**** v1   52.5 vsl|          0 CLI             - Wr 200 19 PONG 1542254342 1.0
***  v1   57.0 CLI RX  300
**** v1   57.0 CLI RX|VCL compiled.
**** v1   57.0 CLI RX|VCL "vcl11" Failed initialization
**** v1   57.0 CLI RX|Message:
**** v1   57.0 CLI RX|\tshard .backend resolve=LAZY with other parameters can only be used in backend context
**** v1   57.0 CLI RX|rr: NULL backend cannot be added
**   v1   57.0 VCL compilation failed (as expected)
***  v1   57.0 Found expected string: ("resolve=LAZY with other parameters can only be used in backend context")
**   top  57.0 === varnish v1 -errvcl {resolve=NOW can not be used in vcl_init}...
**** v1   57.0 CLI TX|vcl.inline vcl12 << %XJEIFLH|)Xspa8P
**** v1   57.0 CLI TX|vcl 4.1;
**** v1   57.0 CLI TX|
**** v1   57.0 CLI TX|    import directors;
**** v1   57.0 CLI TX|    import blob;
**** v1   57.0 CLI TX|
**** v1   57.0 CLI TX|    backend dummy { .host = "127.0.0.1 10087"; }
**** v1   57.0 CLI TX|
**** v1   57.0 CLI TX|    sub vcl_init {
**** v1   57.0 CLI TX|\tnew shard = directors.shard();
**** v1   57.0 CLI TX|\tnew rr = directors.round_robin();
**** v1   57.0 CLI TX|\trr.add_backend(shard.backend(resolve=NOW));
**** v1   57.0 CLI TX|    }
**** v1   57.0 CLI TX|
**** v1   57.0 CLI TX|%XJEIFLH|)Xspa8P
**** v1   57.0 vsl|          0 CLI             - Rd vcl.load vcl11 vcl_vcl11.1542254342.905026/vgc.so 1auto
**** v1   57.0 vsl|          0 CLI             - Wr 300 163 VCL "vcl11" Failed initialization
Message:
shard .backend resolve=LAZY with other parameters can only be used in backend context
rr: NULL backend cannot be added

**** v1   57.0 vsl|          0 CLI             - Rd ping
**** v1   57.0 vsl|          0 CLI             - Wr 200 19 PONG 1542254347 1.0
#    top  TEST ../../../../bin/varnishtest/tests/d00030.vtc TIMED OUT (kill -9)
#    top  TEST ../../../../bin/varnishtest/tests/d00030.vtc FAILED (60.037) signal=9
FAIL tests/d00030.vtc (exit status: 2)

1 @ FreeBSD arm 12.0-BET 1.04 phk

*    top   0.0 TEST ../../../../bin/varnishtest/tests/d00030.vtc starting
[...]
*    top   0.0 VTEST shard director error handling
[...]
Message:
shard_param.set() p: invalid warmup argument 1.100000

**** v1   52.0 vsl|          0 CLI             - Rd ping
**** v1   52.0 vsl|          0 CLI             - Wr 200 19 PONG 1542230867 1.0
**** v1   56.9 vsl|          0 CLI             - Rd vcl.load vcl11 vcl_vcl11.1542230867.735536/vgc.so 1auto
**** v1   56.9 vsl|          0 CLI             - Wr 300 163 VCL "vcl11" Failed initialization
Message:
shard .backend resolve=LAZY with other parameters can only be used in backend context
rr: NULL backend cannot be added

***  v1   56.9 CLI RX  300
**** v1   56.9 CLI RX|VCL compiled.
**** v1   56.9 CLI RX|VCL "vcl11" Failed initialization
**** v1   56.9 CLI RX|Message:
**** v1   56.9 CLI RX|\tshard .backend resolve=LAZY with other parameters can only be used in backend context
**** v1   56.9 CLI RX|rr: NULL backend cannot be added
**   v1   56.9 VCL compilation failed (as expected)
***  v1   56.9 Found expected string: ("resolve=LAZY with other parameters can only be used in backend context")
**   top  56.9 === varnish v1 -errvcl {resolve=NOW can not be used in vcl_init}...
**** v1   56.9 CLI TX|vcl.inline vcl12 << %XJEIFLH|)Xspa8P
**** v1   56.9 CLI TX|vcl 4.1;
**** v1   56.9 CLI TX|
**** v1   56.9 CLI TX|    import directors;
**** v1   56.9 CLI TX|    import blob;
**** v1   56.9 CLI TX|
**** v1   56.9 CLI TX|    backend dummy { .host = "127.0.0.1 33622"; }
**** v1   56.9 CLI TX|
**** v1   56.9 CLI TX|    sub vcl_init {
**** v1   56.9 CLI TX|\tnew shard = directors.shard();
**** v1   56.9 CLI TX|\tnew rr = directors.round_robin();
**** v1   56.9 CLI TX|\trr.add_backend(shard.backend(resolve=NOW));
**** v1   56.9 CLI TX|    }
**** v1   56.9 CLI TX|
**** v1   56.9 CLI TX|%XJEIFLH|)Xspa8P
**** v1   57.0 vsl|          0 CLI             - Rd ping
**** v1   57.0 vsl|          0 CLI             - Wr 200 19 PONG 1542230872 1.0
#    top  TEST ../../../../bin/varnishtest/tests/d00030.vtc TIMED OUT (kill -9)
#    top  TEST ../../../../bin/varnishtest/tests/d00030.vtc FAILED (60.040) signal=9
FAIL tests/d00030.vtc (exit status: 2)

1 @ FreeBSD arm 12.0-BET 1.04 phk

*    top   0.0 TEST ../../../../bin/varnishtest/tests/d00030.vtc starting
[...]
*    top   0.0 VTEST shard director error handling
[...]
Message:
shard_param.set() p: invalid warmup argument 1.100000

**** v1   54.1 vsl|          0 CLI             - Rd ping
**** v1   54.1 vsl|          0 CLI             - Wr 200 19 PONG 1542223156 1.0
***  v1   58.9 CLI RX  300
**** v1   58.9 CLI RX|VCL compiled.
**** v1   58.9 CLI RX|VCL "vcl11" Failed initialization
**** v1   58.9 CLI RX|Message:
**** v1   58.9 CLI RX|\tshard .backend resolve=LAZY with other parameters can only be used in backend context
**** v1   58.9 CLI RX|rr: NULL backend cannot be added
**   v1   58.9 VCL compilation failed (as expected)
***  v1   58.9 Found expected string: ("resolve=LAZY with other parameters can only be used in backend context")
**   top  58.9 === varnish v1 -errvcl {resolve=NOW can not be used in vcl_init}...
**** v1   58.9 CLI TX|vcl.inline vcl12 << %XJEIFLH|)Xspa8P
**** v1   58.9 CLI TX|vcl 4.1;
**** v1   58.9 CLI TX|
**** v1   58.9 CLI TX|    import directors;
**** v1   58.9 CLI TX|    import blob;
**** v1   58.9 CLI TX|
**** v1   58.9 CLI TX|    backend dummy { .host = "127.0.0.1 52897"; }
**** v1   58.9 CLI TX|
**** v1   58.9 CLI TX|    sub vcl_init {
**** v1   58.9 CLI TX|\tnew shard = directors.shard();
**** v1   58.9 CLI TX|\tnew rr = directors.round_robin();
**** v1   58.9 CLI TX|\trr.add_backend(shard.backend(resolve=NOW));
**** v1   58.9 CLI TX|    }
**** v1   58.9 CLI TX|
**** v1   58.9 CLI TX|%XJEIFLH|)Xspa8P
**** v1   59.0 vsl|          0 CLI             - Rd vcl.load vcl11 vcl_vcl11.1542223156.843202/vgc.so 1auto
**** v1   59.0 vsl|          0 CLI             - Wr 300 163 VCL "vcl11" Failed initialization
Message:
shard .backend resolve=LAZY with other parameters can only be used in backend context
rr: NULL backend cannot be added

**** v1   59.0 vsl|          0 CLI             - Rd ping
**** v1   59.0 vsl|          0 CLI             - Wr 200 19 PONG 1542223161 1.0
#    top  TEST ../../../../bin/varnishtest/tests/d00030.vtc TIMED OUT (kill -9)
#    top  TEST ../../../../bin/varnishtest/tests/d00030.vtc FAILED (60.033) signal=9
FAIL tests/d00030.vtc (exit status: 2)

1 @ FreeBSD arm 12.0-BET 1.04 phk

*    top   0.1 TEST ../../../../bin/varnishtest/tests/d00030.vtc starting
[...]
*    top   0.1 VTEST shard director error handling
[...]
Message:
shard_param.set() p: invalid warmup argument 1.100000

**** v1   54.4 vsl|          0 CLI             - Rd ping
**** v1   54.4 vsl|          0 CLI             - Wr 200 19 PONG 1542246295 1.0
***  v1   59.5 CLI RX  300
**** v1   59.5 CLI RX|VCL compiled.
**** v1   59.5 CLI RX|VCL "vcl11" Failed initialization
**** v1   59.5 CLI RX|Message:
**** v1   59.5 CLI RX|\tshard .backend resolve=LAZY with other parameters can only be used in backend context
**** v1   59.5 CLI RX|rr: NULL backend cannot be added
**   v1   59.5 VCL compilation failed (as expected)
***  v1   59.5 Found expected string: ("resolve=LAZY with other parameters can only be used in backend context")
**   top  59.5 === varnish v1 -errvcl {resolve=NOW can not be used in vcl_init}...
**** v1   59.5 CLI TX|vcl.inline vcl12 << %XJEIFLH|)Xspa8P
**** v1   59.5 CLI TX|vcl 4.1;
**** v1   59.5 CLI TX|
**** v1   59.5 CLI TX|    import directors;
**** v1   59.5 CLI TX|    import blob;
**** v1   59.5 CLI TX|
**** v1   59.5 CLI TX|    backend dummy { .host = "127.0.0.1 39860"; }
**** v1   59.5 CLI TX|
**** v1   59.5 CLI TX|    sub vcl_init {
**** v1   59.5 CLI TX|\tnew shard = directors.shard();
**** v1   59.5 CLI TX|\tnew rr = directors.round_robin();
**** v1   59.5 CLI TX|\trr.add_backend(shard.backend(resolve=NOW));
**** v1   59.5 CLI TX|    }
**** v1   59.5 CLI TX|
**** v1   59.5 CLI TX|%XJEIFLH|)Xspa8P
**** v1   59.5 vsl|          0 CLI             - Rd vcl.load vcl11 vcl_vcl11.1542246295.816550/vgc.so 1auto
**** v1   59.5 vsl|          0 CLI             - Wr 300 163 VCL "vcl11" Failed initialization
Message:
shard .backend resolve=LAZY with other parameters can only be used in backend context
rr: NULL backend cannot be added

**** v1   59.5 vsl|          0 CLI             - Rd ping
**** v1   59.5 vsl|          0 CLI             - Wr 200 19 PONG 1542246300 1.0
#    top  TEST ../../../../bin/varnishtest/tests/d00030.vtc TIMED OUT (kill -9)
#    top  TEST ../../../../bin/varnishtest/tests/d00030.vtc FAILED (60.192) signal=9
FAIL tests/d00030.vtc (exit status: 2)

1 @ FreeBSD arm 12.0-BET 1.04 phk

*    top   0.0 TEST ../../../../bin/varnishtest/tests/d00030.vtc starting
[...]
*    top   0.0 VTEST shard director error handling
[...]
**** v1   51.6 CLI TX|    }
**** v1   51.6 CLI TX|
**** v1   51.6 CLI TX|%XJEIFLH|)Xspa8P
**** v1   51.7 vsl|          0 CLI             - Rd ping
**** v1   51.7 vsl|          0 CLI             - Wr 200 19 PONG 1542238583 1.0
**** v1   56.6 vsl|          0 CLI             - Rd vcl.load vcl11 vcl_vcl11.1542238583.114152/vgc.so 1auto
***  v1   56.7 CLI RX  300
**** v1   56.7 CLI RX|VCL compiled.
**** v1   56.7 CLI RX|VCL "vcl11" Failed initialization
**** v1   56.7 CLI RX|Message:
**** v1   56.7 CLI RX|\tshard .backend resolve=LAZY with other parameters can only be used in backend context
**** v1   56.7 CLI RX|rr: NULL backend cannot be added
**   v1   56.7 VCL compilation failed (as expected)
***  v1   56.7 Found expected string: ("resolve=LAZY with other parameters can only be used in backend context")
**   top  56.7 === varnish v1 -errvcl {resolve=NOW can not be used in vcl_init}...
**** v1   56.7 CLI TX|vcl.inline vcl12 << %XJEIFLH|)Xspa8P
**** v1   56.7 CLI TX|vcl 4.1;
**** v1   56.7 CLI TX|
**** v1   56.7 CLI TX|    import directors;
**** v1   56.7 CLI TX|    import blob;
**** v1   56.7 CLI TX|
**** v1   56.7 CLI TX|    backend dummy { .host = "127.0.0.1 13025"; }
**** v1   56.7 CLI TX|
**** v1   56.7 CLI TX|    sub vcl_init {
**** v1   56.7 CLI TX|\tnew shard = directors.shard();
**** v1   56.7 CLI TX|\tnew rr = directors.round_robin();
**** v1   56.7 CLI TX|\trr.add_backend(shard.backend(resolve=NOW));
**** v1   56.7 CLI TX|    }
**** v1   56.7 CLI TX|
**** v1   56.7 CLI TX|%XJEIFLH|)Xspa8P
**** v1   56.7 vsl|          0 CLI             - Wr 300 163 VCL "vcl11" Failed initialization
Message:
shard .backend resolve=LAZY with other parameters can only be used in backend context
rr: NULL backend cannot be added

**** v1   56.7 vsl|          0 CLI             - Rd ping
**** v1   56.7 vsl|          0 CLI             - Wr 200 19 PONG 1542238588 1.0
#    top  TEST ../../../../bin/varnishtest/tests/d00030.vtc TIMED OUT (kill -9)
#    top  TEST ../../../../bin/varnishtest/tests/d00030.vtc FAILED (60.036) signal=9
FAIL tests/d00030.vtc (exit status: 2)

1 @ FreeBSD arm 12.0-BET 1.04 phk

*    top   0.0 TEST ../../../../bin/varnishtest/tests/d00030.vtc starting
[...]
*    top   0.0 VTEST shard director error handling
[...]
**** v1   50.9 CLI TX|    }
**** v1   50.9 CLI TX|
**** v1   50.9 CLI TX|%XJEIFLH|)Xspa8P
**** v1   51.0 vsl|          0 CLI             - Rd ping
**** v1   51.0 vsl|          0 CLI             - Wr 200 19 PONG 1542207748 1.0
***  v1   55.1 CLI RX  300
**** v1   55.1 CLI RX|VCL compiled.
**** v1   55.1 CLI RX|VCL "vcl11" Failed initialization
**** v1   55.1 CLI RX|Message:
**** v1   55.1 CLI RX|\tshard .backend resolve=LAZY with other parameters can only be used in backend context
**** v1   55.1 CLI RX|rr: NULL backend cannot be added
**   v1   55.1 VCL compilation failed (as expected)
***  v1   55.1 Found expected string: ("resolve=LAZY with other parameters can only be used in backend context")
**   top  55.1 === varnish v1 -errvcl {resolve=NOW can not be used in vcl_init}...
**** v1   55.1 CLI TX|vcl.inline vcl12 << %XJEIFLH|)Xspa8P
**** v1   55.1 CLI TX|vcl 4.1;
**** v1   55.1 CLI TX|
**** v1   55.1 CLI TX|    import directors;
**** v1   55.1 CLI TX|    import blob;
**** v1   55.1 CLI TX|
**** v1   55.1 CLI TX|    backend dummy { .host = "127.0.0.1 60006"; }
**** v1   55.1 CLI TX|
**** v1   55.1 CLI TX|    sub vcl_init {
**** v1   55.1 CLI TX|\tnew shard = directors.shard();
**** v1   55.1 CLI TX|\tnew rr = directors.round_robin();
**** v1   55.1 CLI TX|\trr.add_backend(shard.backend(resolve=NOW));
**** v1   55.1 CLI TX|    }
**** v1   55.1 CLI TX|
**** v1   55.1 CLI TX|%XJEIFLH|)Xspa8P
**** v1   55.2 vsl|          0 CLI             - Rd vcl.load vcl11 vcl_vcl11.1542207748.145722/vgc.so 1auto
**** v1   55.2 vsl|          0 CLI             - Wr 300 163 VCL "vcl11" Failed initialization
Message:
shard .backend resolve=LAZY with other parameters can only be used in backend context
rr: NULL backend cannot be added

**** v1   55.2 vsl|          0 CLI             - Rd ping
**** v1   55.2 vsl|          0 CLI             - Wr 200 19 PONG 1542207752 1.0
#    top  TEST ../../../../bin/varnishtest/tests/d00030.vtc TIMED OUT (kill -9)
#    top  TEST ../../../../bin/varnishtest/tests/d00030.vtc FAILED (60.030) signal=9
FAIL tests/d00030.vtc (exit status: 2)

1 @ FreeBSD arm 12.0-BET 1.04 phk

*    top   0.0 TEST ../../../../bin/varnishtest/tests/d00030.vtc starting
[...]
*    top   0.0 VTEST shard director error handling
[...]
Message:
shard_param.set() p: invalid warmup argument 1.100000

**** v1   53.4 vsl|          0 CLI             - Rd ping
**** v1   53.4 vsl|          0 CLI             - Wr 200 19 PONG 1542262075 1.0
**** v1   58.7 vsl|          0 CLI             - Rd vcl.load vcl11 vcl_vcl11.1542262075.846439/vgc.so 1auto
**** v1   58.7 vsl|          0 CLI             - Wr 300 163 VCL "vcl11" Failed initialization
Message:
shard .backend resolve=LAZY with other parameters can only be used in backend context
rr: NULL backend cannot be added

***  v1   58.7 CLI RX  300
**** v1   58.7 CLI RX|VCL compiled.
**** v1   58.7 CLI RX|VCL "vcl11" Failed initialization
**** v1   58.7 CLI RX|Message:
**** v1   58.7 CLI RX|\tshard .backend resolve=LAZY with other parameters can only be used in backend context
**** v1   58.7 CLI RX|rr: NULL backend cannot be added
**   v1   58.7 VCL compilation failed (as expected)
***  v1   58.7 Found expected string: ("resolve=LAZY with other parameters can only be used in backend context")
**   top  58.7 === varnish v1 -errvcl {resolve=NOW can not be used in vcl_init}...
**** v1   58.7 CLI TX|vcl.inline vcl12 << %XJEIFLH|)Xspa8P
**** v1   58.7 CLI TX|vcl 4.1;
**** v1   58.7 CLI TX|
**** v1   58.7 CLI TX|    import directors;
**** v1   58.7 CLI TX|    import blob;
**** v1   58.7 CLI TX|
**** v1   58.7 CLI TX|    backend dummy { .host = "127.0.0.1 42052"; }
**** v1   58.7 CLI TX|
**** v1   58.7 CLI TX|    sub vcl_init {
**** v1   58.7 CLI TX|\tnew shard = directors.shard();
**** v1   58.7 CLI TX|\tnew rr = directors.round_robin();
**** v1   58.7 CLI TX|\trr.add_backend(shard.backend(resolve=NOW));
**** v1   58.7 CLI TX|    }
**** v1   58.7 CLI TX|
**** v1   58.7 CLI TX|%XJEIFLH|)Xspa8P
**** v1   58.8 vsl|          0 CLI             - Rd ping
**** v1   58.8 vsl|          0 CLI             - Wr 200 19 PONG 1542262081 1.0
#    top  TEST ../../../../bin/varnishtest/tests/d00030.vtc TIMED OUT (kill -9)
#    top  TEST ../../../../bin/varnishtest/tests/d00030.vtc FAILED (60.042) signal=9
FAIL tests/d00030.vtc (exit status: 2)

77d4c56

1 @ FreeBSD arm 12.0-BET 1.04 phk

*    top   0.0 TEST ../../../../bin/varnishtest/tests/d00030.vtc starting
[...]
*    top   0.0 VTEST shard director error handling
[...]
**** v1   52.7 CLI TX|    }
**** v1   52.7 CLI TX|
**** v1   52.7 CLI TX|%XJEIFLH|)Xspa8P
**** v1   52.8 vsl|          0 CLI             - Rd ping
**** v1   52.8 vsl|          0 CLI             - Wr 200 19 PONG 1542200107 1.0
**** v1   57.8 vsl|          0 CLI             - Rd vcl.load vcl11 vcl_vcl11.1542200107.595235/vgc.so 1auto
***  v1   57.9 CLI RX  300
**** v1   57.9 CLI RX|VCL compiled.
**** v1   57.9 CLI RX|VCL "vcl11" Failed initialization
**** v1   57.9 CLI RX|Message:
**** v1   57.9 CLI RX|\tshard .backend resolve=LAZY with other parameters can only be used in backend context
**** v1   57.9 CLI RX|rr: NULL backend cannot be added
**   v1   57.9 VCL compilation failed (as expected)
***  v1   57.9 Found expected string: ("resolve=LAZY with other parameters can only be used in backend context")
**   top  57.9 === varnish v1 -errvcl {resolve=NOW can not be used in vcl_init}...
**** v1   57.9 CLI TX|vcl.inline vcl12 << %XJEIFLH|)Xspa8P
**** v1   57.9 CLI TX|vcl 4.1;
**** v1   57.9 CLI TX|
**** v1   57.9 CLI TX|    import directors;
**** v1   57.9 CLI TX|    import blob;
**** v1   57.9 CLI TX|
**** v1   57.9 CLI TX|    backend dummy { .host = "127.0.0.1 34262"; }
**** v1   57.9 CLI TX|
**** v1   57.9 CLI TX|    sub vcl_init {
**** v1   57.9 CLI TX|\tnew shard = directors.shard();
**** v1   57.9 CLI TX|\tnew rr = directors.round_robin();
**** v1   57.9 CLI TX|\trr.add_backend(shard.backend(resolve=NOW));
**** v1   57.9 CLI TX|    }
**** v1   57.9 CLI TX|
**** v1   57.9 CLI TX|%XJEIFLH|)Xspa8P
**** v1   57.9 vsl|          0 CLI             - Wr 300 163 VCL "vcl11" Failed initialization
Message:
shard .backend resolve=LAZY with other parameters can only be used in backend context
rr: NULL backend cannot be added

**** v1   57.9 vsl|          0 CLI             - Rd ping
**** v1   57.9 vsl|          0 CLI             - Wr 200 19 PONG 1542200112 1.0
#    top  TEST ../../../../bin/varnishtest/tests/d00030.vtc TIMED OUT (kill -9)
#    top  TEST ../../../../bin/varnishtest/tests/d00030.vtc FAILED (60.036) signal=9
FAIL tests/d00030.vtc (exit status: 2)