distcheck

c5adaa3

FAIL: tests/r02964.vtc

1 @ FreeBSD amd64 12.0-REL 1.04 phk

PASS: tests/r02705.vtc
--- tests/r02763.log ---
PASS: tests/r02763.vtc
--- tests/r02775.log ---
--- tests/r02702.log ---
PASS: tests/r02702.vtc
--- tests/r02831.log ---
--- tests/r02775.log ---
PASS: tests/r02775.vtc
--- tests/r02839.log ---
PASS: tests/r02839.vtc
--- tests/r02849.log ---
--- tests/r02831.log ---
PASS: tests/r02831.vtc
--- tests/r02880.log ---
PASS: tests/r02880.vtc
--- tests/r02887.log ---
--- tests/r02849.log ---
PASS: tests/r02849.vtc
--- tests/r02923.log ---
--- tests/r02887.log ---
PASS: tests/r02887.vtc
--- tests/r02934.log ---
PASS: tests/r02934.vtc
--- tests/r02937.log ---
PASS: tests/r02937.vtc
--- tests/r02946.log ---
--- tests/r02923.log ---
PASS: tests/r02923.vtc
--- tests/r02964.log ---
FAIL: tests/r02964.vtc
--- tests/r02976.log ---
--- tests/r02946.log ---
PASS: tests/r02946.vtc
--- tests/r03003.log ---
PASS: tests/r03003.vtc
--- tests/r03006.log ---
--- tests/r02976.log ---
PASS: tests/r02976.vtc
--- tests/r03009.log ---

make[5]: *** [libvcc_a-vcc_parse.o] Error 2

2 @ SunOS i86pc 5.11 1.04 32_sun12.4 uplex

2 @ SunOS i86pc 5.11 1.04 64_sun12.4 uplex

CC       vsl2rst.o
CC       vsl_glob_test-vsl_glob_test.o
CCLD     vsl2rst
CCLD     libvarnishapi.la
CCLD     vsl_glob_test
make[5]: Leaving directory '/tmp/vtest.32_sun12.4/varnish-cache/lib/libvarnishapi'
make[4]: Leaving directory '/tmp/vtest.32_sun12.4/varnish-cache/lib/libvarnishapi'
Making all in libvcc
make[4]: Entering directory '/tmp/vtest.32_sun12.4/varnish-cache/lib/libvcc'
mkdir -p ../../include/tbl
/opt/local/bin/python3.4 ../../lib/libvcc/generate.py \
../.. ../..
make  all-am
make[5]: Entering directory '/tmp/vtest.32_sun12.4/varnish-cache/lib/libvcc'
CC       libvcc_a-vcc_acl.o
CC       libvcc_a-vcc_action.o
CC       libvcc_a-vcc_backend.o
CC       libvcc_a-vcc_backend_util.o
CC       libvcc_a-vcc_compile.o
CC       libvcc_a-vcc_expr.o
mkdir -p ../../include/tbl
/opt/local/bin/python3.4 ../../lib/libvcc/generate.py \
../.. ../..
CC       libvcc_a-vcc_parse.o
CC       libvcc_a-vcc_storage.o
"vcc_compile.h", line 192: undefined symbol: VCL_RET_MAX
"vcc_compile.h", line 192: can not declare variably modified type at file scope
CC       libvcc_a-vcc_symb.o
cc: acomp failed for vcc_parse.c
Makefile:669: recipe for target 'libvcc_a-vcc_parse.o' failed
make[5]: *** [libvcc_a-vcc_parse.o] Error 2
make[5]: *** Waiting for unfinished jobs....
make[5]: Leaving directory '/tmp/vtest.32_sun12.4/varnish-cache/lib/libvcc'
Makefile:431: recipe for target 'all' failed
make[4]: *** [all] Error 2
make[4]: Leaving directory '/tmp/vtest.32_sun12.4/varnish-cache/lib/libvcc'
Makefile:412: recipe for target 'all-recursive' failed
make[3]: *** [all-recursive] Error 1
make[3]: Leaving directory '/tmp/vtest.32_sun12.4/varnish-cache/lib'
Makefile:549: recipe for target 'all-recursive' failed

FAIL: tests/s00010.vtc

17 @ FreeBSD arm64 12.0-REL 1.04 RPI3b phk

PASS: tests/s00005.vtc
--- tests/s00008.log ---
--- tests/s00007.log ---
PASS: tests/s00007.vtc
--- tests/s00009.log ---
--- tests/s00008.log ---
PASS: tests/s00008.vtc
--- tests/s00010.log ---
--- tests/s00009.log ---
PASS: tests/s00009.vtc
--- tests/s00011.log ---
PASS: tests/s00011.vtc
--- tests/s00012.log ---
PASS: tests/s00012.vtc
--- tests/t02000.log ---
PASS: tests/t02000.vtc
--- tests/t02001.log ---
PASS: tests/t02001.vtc
--- tests/t02002.log ---
PASS: tests/t02002.vtc
--- tests/t02003.log ---
PASS: tests/t02003.vtc
--- tests/t02004.log ---
PASS: tests/t02004.vtc
--- tests/t02005.log ---
PASS: tests/t02005.vtc
--- tests/t02006.log ---
PASS: tests/t02006.vtc
--- tests/t02007.log ---
--- tests/s00010.log ---
FAIL: tests/s00010.vtc
--- tests/t02008.log ---
PASS: tests/t02008.vtc
--- tests/t02009.log ---
--- tests/t02007.log ---
PASS: tests/t02007.vtc
--- tests/t02010.log ---
--- tests/t02009.log ---
PASS: tests/t02009.vtc
--- tests/t02011.log ---

FAIL: tests/t02015.vtc

1 @ FreeBSD i386 12.0-REL 1.04 phk

--- tests/t02005.log ---
--- tests/t02003.log ---
PASS: tests/t02003.vtc
--- tests/t02006.log ---
--- tests/t02005.log ---
PASS: tests/t02005.vtc
--- tests/t02007.log ---
--- tests/t02006.log ---
PASS: tests/t02006.vtc
--- tests/t02008.log ---
PASS: tests/t02008.vtc
--- tests/t02009.log ---
--- tests/t02007.log ---
PASS: tests/t02007.vtc
--- tests/t02010.log ---
--- tests/t02009.log ---
PASS: tests/t02009.vtc
--- tests/t02011.log ---
--- tests/t02010.log ---
PASS: tests/t02010.vtc
--- tests/t02012.log ---
--- tests/t02011.log ---
PASS: tests/t02011.vtc
--- tests/t02012.log ---
PASS: tests/t02012.vtc
--- tests/t02013.log ---
--- tests/t02014.log ---
--- tests/t02013.log ---
PASS: tests/t02013.vtc
--- tests/t02015.log ---
FAIL: tests/t02015.vtc
--- tests/t02016.log ---
--- tests/t02014.log ---
PASS: tests/t02014.vtc
--- tests/u00000.log ---
PASS: tests/u00000.vtc
--- tests/u00003.log ---
--- tests/t02016.log ---
PASS: tests/t02016.vtc
--- tests/u00004.log ---

FAIL: tests/r01804.vtc

1 @ Debian x86_64 buster/sid 1.04 clang uplex

PASS: tests/r02387.vtc
PASS: tests/r02406.vtc
PASS: tests/r02413.vtc
PASS: tests/r02339.vtc
PASS: tests/r02395.vtc
PASS: tests/r02429.vtc
PASS: tests/r02422.vtc
PASS: tests/r02451.vtc
PASS: tests/r02432.vtc
PASS: tests/r02471.vtc
PASS: tests/r02488.vtc
PASS: tests/r02433.vtc
PASS: tests/r02494.vtc
PASS: tests/r02530.vtc
PASS: tests/r02527.vtc
PASS: tests/r02418.vtc
PASS: tests/r02554.vtc
PASS: tests/r02589.vtc
PASS: tests/r02617.vtc
PASS: tests/r02539.vtc
PASS: tests/r02555.vtc
PASS: tests/r02618.vtc
PASS: tests/r02633.vtc
PASS: tests/r02645.vtc
PASS: tests/r02647.vtc
PASS: tests/r02646.vtc
PASS: tests/r02679.vtc
PASS: tests/r02649.vtc
PASS: tests/r02700.vtc
PASS: tests/r02690.vtc
FAIL: tests/r01804.vtc
PASS: tests/r02686.vtc
PASS: tests/r02705.vtc
PASS: tests/r02763.vtc
PASS: tests/r02775.vtc
PASS: tests/r02880.vtc
PASS: tests/r02839.vtc
PASS: tests/r02849.vtc
PASS: tests/r02831.vtc
PASS: tests/r02887.vtc

FAIL: tests/b00035.vtc

1 @ SunOS i86pc 5.11 1.04 32_gcc4.7 uplex

PASS: tests/b00006.vtc
PASS: tests/b00005.vtc
PASS: tests/b00007.vtc
PASS: tests/b00008.vtc
PASS: tests/b00004.vtc
PASS: tests/b00009.vtc
PASS: tests/b00010.vtc
PASS: tests/b00011.vtc
PASS: tests/b00012.vtc
PASS: tests/b00013.vtc
PASS: tests/b00017.vtc
PASS: tests/b00014.vtc
PASS: tests/b00016.vtc
PASS: tests/b00015.vtc
PASS: tests/b00019.vtc
PASS: tests/b00020.vtc
PASS: tests/b00022.vtc
PASS: tests/b00018.vtc
PASS: tests/b00024.vtc
PASS: tests/b00025.vtc
PASS: tests/b00023.vtc
PASS: tests/b00027.vtc
PASS: tests/b00028.vtc
PASS: tests/b00026.vtc
PASS: tests/b00021.vtc
PASS: tests/b00031.vtc
PASS: tests/b00034.vtc
PASS: tests/b00032.vtc
PASS: tests/b00029.vtc
PASS: tests/b00033.vtc
FAIL: tests/b00035.vtc
PASS: tests/b00036.vtc
PASS: tests/b00030.vtc
PASS: tests/b00037.vtc
PASS: tests/b00038.vtc
PASS: tests/b00040.vtc
PASS: tests/b00042.vtc
PASS: tests/b00043.vtc
PASS: tests/b00044.vtc
PASS: tests/b00045.vtc

FAIL: tests/s00004.vtc

1 @ Linux x86_64 4.20.13 1.04 gcc uplex

PASS: tests/t02015.vtc
PASS: tests/t02014.vtc
PASS: tests/u00000.vtc
PASS: tests/u00004.vtc
PASS: tests/t02016.vtc
PASS: tests/u00003.vtc
PASS: tests/u00007.vtc
PASS: tests/u00005.vtc
PASS: tests/u00008.vtc
PASS: tests/u00011.vtc
PASS: tests/u00006.vtc
PASS: tests/u00012.vtc
PASS: tests/u00009.vtc
PASS: tests/u00010.vtc
PASS: tests/u00013.vtc
PASS: tests/v00000.vtc
PASS: tests/v00001.vtc
PASS: tests/u00014.vtc
PASS: tests/v00005.vtc
PASS: tests/v00002.vtc
PASS: tests/v00004.vtc
PASS: tests/v00008.vtc
PASS: tests/v00011.vtc
PASS: tests/v00012.vtc
PASS: tests/v00010.vtc
PASS: tests/v00013.vtc
PASS: tests/v00015.vtc
SKIP: tests/v00016.vtc
PASS: tests/v00014.vtc
PASS: tests/v00017.vtc
FAIL: tests/s00004.vtc
PASS: tests/v00019.vtc
PASS: tests/v00018.vtc
PASS: tests/v00021.vtc
PASS: tests/v00024.vtc
PASS: tests/v00020.vtc
PASS: tests/v00027.vtc
PASS: tests/v00006.vtc
PASS: tests/v00031.vtc
PASS: tests/v00032.vtc

FAIL: tests/d00017.vtc

1 @ SunOS i86pc 5.11 1.04 64_sun12.4 uplex

PASS: tests/c00089.vtc
PASS: tests/c00091.vtc
PASS: tests/c00090.vtc
PASS: tests/c00088.vtc
PASS: tests/c00083.vtc
PASS: tests/c00092.vtc
PASS: tests/c00093.vtc
PASS: tests/c00097.vtc
PASS: tests/c00095.vtc
PASS: tests/c00098.vtc
PASS: tests/c00099.vtc
PASS: tests/d00000.vtc
PASS: tests/c00080.vtc
PASS: tests/d00001.vtc
PASS: tests/c00094.vtc
PASS: tests/d00003.vtc
PASS: tests/d00002.vtc
PASS: tests/d00004.vtc
PASS: tests/d00005.vtc
PASS: tests/d00006.vtc
PASS: tests/d00007.vtc
PASS: tests/d00009.vtc
PASS: tests/d00010.vtc
PASS: tests/d00008.vtc
PASS: tests/d00014.vtc
PASS: tests/d00015.vtc
PASS: tests/d00011.vtc
PASS: tests/d00012.vtc
PASS: tests/d00013.vtc
PASS: tests/d00016.vtc
FAIL: tests/d00017.vtc
PASS: tests/d00018.vtc
PASS: tests/d00019.vtc
PASS: tests/d00020.vtc
PASS: tests/d00021.vtc
PASS: tests/d00022.vtc
PASS: tests/d00023.vtc
PASS: tests/d00025.vtc
PASS: tests/d00026.vtc
PASS: tests/d00027.vtc

make[5]: *** [libvcc_a-vcc_symb.o] Error 2

1 @ SunOS i86pc 5.11 1.04 64_sun12.4 uplex

make[5]: Entering directory '/tmp/vtest.64_sun12.4/varnish-cache/lib/libvcc'
CC       libvcc_a-vcc_acl.o
CC       libvcc_a-vcc_action.o
CC       libvcc_a-vcc_backend.o
CC       libvcc_a-vcc_backend_util.o
CC       libvcc_a-vcc_compile.o
CC       libvcc_a-vcc_expr.o
mkdir -p ../../include/tbl
/opt/local/bin/python3.4 ../../lib/libvcc/generate.py \
../.. ../..
CC       libvcc_a-vcc_parse.o
CC       libvcc_a-vcc_storage.o
CC       libvcc_a-vcc_symb.o
"vcc_symb.c", line 59: undefined symbol: ACL
"vcc_symb.c", line 59: improper pointer/integer combination: op "==" (E_BAD_PTR_INT_COMBINATION)
"vcc_symb.c", line 60: undefined symbol: BACKEND
"vcc_symb.c", line 60: improper pointer/integer combination: op "==" (E_BAD_PTR_INT_COMBINATION)
"vcc_symb.c", line 61: undefined symbol: PROBE
"vcc_symb.c", line 61: improper pointer/integer combination: op "==" (E_BAD_PTR_INT_COMBINATION)
"vcc_symb.c", line 62: undefined symbol: STEVEDORE
"vcc_symb.c", line 62: improper pointer/integer combination: op "==" (E_BAD_PTR_INT_COMBINATION)
"vcc_symb.c", line 63: undefined symbol: SUB
"vcc_symb.c", line 63: improper pointer/integer combination: op "==" (E_BAD_PTR_INT_COMBINATION)
"vcc_symb.c", line 64: undefined symbol: INSTANCE
"vcc_symb.c", line 64: improper pointer/integer combination: op "==" (E_BAD_PTR_INT_COMBINATION)
"vcc_symb.c", line 188: undefined symbol: VOID
"vcc_symb.c", line 188: improper pointer/integer combination: op "=" (E_BAD_PTR_INT_COMBINATION)
CC       libvcc_a-vcc_token.o
cc: acomp failed for vcc_symb.c
Makefile:697: recipe for target 'libvcc_a-vcc_symb.o' failed
make[5]: *** [libvcc_a-vcc_symb.o] Error 2
make[5]: *** Waiting for unfinished jobs....
make[5]: Leaving directory '/tmp/vtest.64_sun12.4/varnish-cache/lib/libvcc'
Makefile:431: recipe for target 'all' failed
make[4]: *** [all] Error 2
make[4]: Leaving directory '/tmp/vtest.64_sun12.4/varnish-cache/lib/libvcc'
Makefile:412: recipe for target 'all-recursive' failed
make[3]: *** [all-recursive] Error 1
make[3]: Leaving directory '/tmp/vtest.64_sun12.4/varnish-cache/lib'
Makefile:549: recipe for target 'all-recursive' failed

FAIL: tests/g00005.vtc

1 @ FreeBSD i386 12.0-REL 1.04 phk

--- tests/e00031.log ---
--- tests/e00028.log ---
PASS: tests/e00028.vtc
--- tests/e00032.log ---
--- tests/e00031.log ---
PASS: tests/e00031.vtc
--- tests/e00032.log ---
PASS: tests/e00032.vtc
--- tests/e00033.log ---
--- tests/f00001.log ---
PASS: tests/f00001.vtc
--- tests/g00000.log ---
--- tests/e00033.log ---
PASS: tests/e00033.vtc
--- tests/g00001.log ---
--- tests/g00000.log ---
PASS: tests/g00000.vtc
--- tests/g00002.log ---
--- tests/g00001.log ---
PASS: tests/g00001.vtc
--- tests/g00003.log ---
PASS: tests/g00003.vtc
--- tests/g00004.log ---
--- tests/g00002.log ---
PASS: tests/g00002.vtc
--- tests/g00005.log ---
--- tests/g00004.log ---
PASS: tests/g00004.vtc
--- tests/g00006.log ---
--- tests/g00005.log ---
FAIL: tests/g00005.vtc
--- tests/g00007.log ---
--- tests/g00006.log ---
PASS: tests/g00006.vtc
--- tests/g00008.log ---
--- tests/g00007.log ---
PASS: tests/g00007.vtc
--- tests/h00001.log ---
SKIP: tests/h00001.vtc
--- tests/h00002.log ---

FAIL: tests/c00057.vtc

1 @ Linux x86_64 4.20.13 1.04 gcc uplex

PASS: tests/c00022.vtc
PASS: tests/c00021.vtc
PASS: tests/c00023.vtc
PASS: tests/c00024.vtc
PASS: tests/c00025.vtc
PASS: tests/c00026.vtc
PASS: tests/c00027.vtc
PASS: tests/c00028.vtc
PASS: tests/c00031.vtc
PASS: tests/c00036.vtc
PASS: tests/c00037.vtc
PASS: tests/c00038.vtc
PASS: tests/c00039.vtc
PASS: tests/c00035.vtc
PASS: tests/c00040.vtc
PASS: tests/c00043.vtc
PASS: tests/c00034.vtc
PASS: tests/c00044.vtc
PASS: tests/c00045.vtc
PASS: tests/c00041.vtc
PASS: tests/c00046.vtc
PASS: tests/c00047.vtc
PASS: tests/c00051.vtc
PASS: tests/c00048.vtc
PASS: tests/c00053.vtc
PASS: tests/c00052.vtc
PASS: tests/c00054.vtc
PASS: tests/c00055.vtc
PASS: tests/c00056.vtc
PASS: tests/c00058.vtc
FAIL: tests/c00057.vtc
PASS: tests/c00050.vtc
PASS: tests/c00059.vtc
PASS: tests/c00061.vtc
PASS: tests/c00062.vtc
PASS: tests/c00049.vtc
PASS: tests/c00064.vtc
PASS: tests/c00060.vtc
PASS: tests/c00065.vtc
PASS: tests/c00066.vtc

FAIL: tests/r02946.vtc

1 @ SunOS i86pc 5.11 1.04 64_gcc4.7 uplex

PASS: tests/r02617.vtc
PASS: tests/r02555.vtc
PASS: tests/r02618.vtc
PASS: tests/r02633.vtc
PASS: tests/r02647.vtc
PASS: tests/r02645.vtc
PASS: tests/r02679.vtc
PASS: tests/r02646.vtc
PASS: tests/r02690.vtc
PASS: tests/r02649.vtc
PASS: tests/r02700.vtc
PASS: tests/r02705.vtc
PASS: tests/r02775.vtc
PASS: tests/r02763.vtc
PASS: tests/r02686.vtc
PASS: tests/r02880.vtc
PASS: tests/r02839.vtc
PASS: tests/r02849.vtc
PASS: tests/r02831.vtc
PASS: tests/r02887.vtc
PASS: tests/r02702.vtc
PASS: tests/r02934.vtc
PASS: tests/r02937.vtc
PASS: tests/r02964.vtc
PASS: tests/r03003.vtc
PASS: tests/r03009.vtc
PASS: tests/r02923.vtc
PASS: tests/r03006.vtc
PASS: tests/r02976.vtc
PASS: tests/s00001.vtc
FAIL: tests/r02946.vtc
PASS: tests/s00000.vtc
PASS: tests/s00003.vtc
PASS: tests/s00006.vtc
PASS: tests/s00002.vtc
PASS: tests/s00004.vtc
SKIP: tests/s00010.vtc
PASS: tests/s00005.vtc
SKIP: tests/s00012.vtc
PASS: tests/s00007.vtc

FAIL: tests/s00006.vtc

1 @ FreeBSD amd64 12.0-REL 1.04 phk

--- tests/r02964.log ---
PASS: tests/r02964.vtc
--- tests/r02976.log ---
--- tests/r02946.log ---
PASS: tests/r02946.vtc
--- tests/r03003.log ---
PASS: tests/r03003.vtc
--- tests/r03006.log ---
--- tests/r02976.log ---
PASS: tests/r02976.vtc
--- tests/r03009.log ---
--- tests/r03006.log ---
PASS: tests/r03006.vtc
--- tests/s00000.log ---
--- tests/r03009.log ---
PASS: tests/r03009.vtc
--- tests/s00001.log ---
PASS: tests/s00001.vtc
--- tests/s00002.log ---
--- tests/s00000.log ---
PASS: tests/s00000.vtc
--- tests/s00003.log ---
PASS: tests/s00003.vtc
--- tests/s00004.log ---
--- tests/s00002.log ---
PASS: tests/s00002.vtc
--- tests/s00005.log ---
--- tests/s00004.log ---
PASS: tests/s00004.vtc
--- tests/s00006.log ---
FAIL: tests/s00006.vtc
--- tests/s00007.log ---
--- tests/s00005.log ---
PASS: tests/s00005.vtc
--- tests/s00008.log ---
--- tests/s00007.log ---
PASS: tests/s00007.vtc
--- tests/s00009.log ---
--- tests/s00008.log ---
PASS: tests/s00008.vtc

e31cc25

FAIL: tests/g00005.vtc

1 @ Linux x86_64 4.20.13 1.04 gcc uplex

PASS: tests/e00024.vtc
PASS: tests/e00025.vtc
PASS: tests/e00026.vtc
PASS: tests/e00027.vtc
PASS: tests/e00028.vtc
PASS: tests/e00030.vtc
PASS: tests/e00031.vtc
PASS: tests/e00032.vtc
PASS: tests/e00033.vtc
PASS: tests/f00001.vtc
PASS: tests/g00000.vtc
PASS: tests/g00001.vtc
PASS: tests/g00002.vtc
PASS: tests/g00004.vtc
PASS: tests/g00003.vtc
PASS: tests/g00007.vtc
PASS: tests/g00008.vtc
SKIP: tests/h00001.vtc
SKIP: tests/h00002.vtc
SKIP: tests/h00003.vtc
SKIP: tests/h00004.vtc
SKIP: tests/h00005.vtc
SKIP: tests/j00000.vtc
SKIP: tests/j00001.vtc
SKIP: tests/j00003.vtc
SKIP: tests/j00004.vtc
PASS: tests/g00006.vtc
PASS: tests/l00000.vtc
PASS: tests/l00001.vtc
PASS: tests/d00024.vtc
FAIL: tests/g00005.vtc
PASS: tests/l00002.vtc
PASS: tests/l00003.vtc
PASS: tests/l00004.vtc
PASS: tests/l00005.vtc
PASS: tests/m00000.vtc
PASS: tests/m00002.vtc
PASS: tests/m00003.vtc
PASS: tests/m00001.vtc
PASS: tests/m00004.vtc

FAIL: tests/b00035.vtc

1 @ SunOS i86pc 5.11 1.04 32_gcc4.7 uplex

PASS: tests/b00005.vtc
PASS: tests/b00006.vtc
PASS: tests/b00007.vtc
PASS: tests/b00008.vtc
PASS: tests/b00010.vtc
PASS: tests/b00009.vtc
PASS: tests/b00011.vtc
PASS: tests/b00012.vtc
PASS: tests/b00004.vtc
PASS: tests/b00013.vtc
PASS: tests/b00017.vtc
PASS: tests/b00014.vtc
PASS: tests/b00016.vtc
PASS: tests/b00015.vtc
PASS: tests/b00019.vtc
PASS: tests/b00020.vtc
PASS: tests/b00022.vtc
PASS: tests/b00018.vtc
PASS: tests/b00024.vtc
PASS: tests/b00025.vtc
PASS: tests/b00023.vtc
PASS: tests/b00027.vtc
PASS: tests/b00028.vtc
PASS: tests/b00026.vtc
PASS: tests/b00031.vtc
PASS: tests/b00021.vtc
PASS: tests/b00032.vtc
PASS: tests/b00034.vtc
PASS: tests/b00029.vtc
PASS: tests/b00033.vtc
FAIL: tests/b00035.vtc
PASS: tests/b00036.vtc
PASS: tests/b00030.vtc
PASS: tests/b00037.vtc
PASS: tests/b00038.vtc
PASS: tests/b00042.vtc
PASS: tests/b00040.vtc
PASS: tests/b00043.vtc
PASS: tests/b00044.vtc
PASS: tests/b00045.vtc

FAIL: tests/s00010.vtc

8 @ FreeBSD arm64 12.0-REL 1.04 RPI3b phk

PASS: tests/s00005.vtc
--- tests/s00008.log ---
--- tests/s00007.log ---
PASS: tests/s00007.vtc
--- tests/s00009.log ---
--- tests/s00008.log ---
PASS: tests/s00008.vtc
--- tests/s00010.log ---
--- tests/s00009.log ---
PASS: tests/s00009.vtc
--- tests/s00011.log ---
PASS: tests/s00011.vtc
--- tests/s00012.log ---
PASS: tests/s00012.vtc
--- tests/t02000.log ---
PASS: tests/t02000.vtc
--- tests/t02001.log ---
PASS: tests/t02001.vtc
--- tests/t02002.log ---
PASS: tests/t02002.vtc
--- tests/t02003.log ---
PASS: tests/t02003.vtc
--- tests/t02004.log ---
PASS: tests/t02004.vtc
--- tests/t02005.log ---
PASS: tests/t02005.vtc
--- tests/t02006.log ---
PASS: tests/t02006.vtc
--- tests/t02007.log ---
--- tests/s00010.log ---
FAIL: tests/s00010.vtc
--- tests/t02008.log ---
PASS: tests/t02008.vtc
--- tests/t02009.log ---
--- tests/t02007.log ---
PASS: tests/t02007.vtc
--- tests/t02010.log ---
--- tests/t02009.log ---
PASS: tests/t02009.vtc
--- tests/t02011.log ---

make[5]: *** [libvcc_a-vcc_parse.o] Error 2

1 @ SunOS i86pc 5.11 1.04 64_sun12.4 uplex

make[5]: Entering directory '/tmp/vtest.64_sun12.4/varnish-cache/lib/libvcc'
CC       libvcc_a-vcc_action.o
CC       libvcc_a-vcc_acl.o
CC       libvcc_a-vcc_backend.o
CC       libvcc_a-vcc_backend_util.o
CC       libvcc_a-vcc_compile.o
CC       libvcc_a-vcc_expr.o
mkdir -p ../../include/tbl
/opt/local/bin/python3.4 ../../lib/libvcc/generate.py \
../.. ../..
CC       libvcc_a-vcc_parse.o
CC       libvcc_a-vcc_storage.o
"vcc_parse.c", line 93: undefined symbol: ID
"vcc_parse.c", line 165: undefined symbol: CSRC
CC       libvcc_a-vcc_symb.o
"vcc_parse.c", line 165: non-constant case expression
"vcc_parse.c", line 177: undefined symbol: EOI
"vcc_parse.c", line 177: non-constant case expression
"vcc_parse.c", line 182: undefined symbol: ID
"vcc_parse.c", line 182: non-constant case expression
"vcc_parse.c", line 295: undefined symbol: FNUM
"vcc_parse.c", line 369: undefined symbol: ID
"vcc_parse.c", line 382: undefined symbol: EOI
"vcc_parse.c", line 385: undefined symbol: CSRC
"vcc_parse.c", line 385: non-constant case expression
"vcc_parse.c", line 397: non-constant case expression
"vcc_parse.c", line 399: undefined symbol: ID
"vcc_parse.c", line 399: non-constant case expression
cc: acomp failed for vcc_parse.c
Makefile:669: recipe for target 'libvcc_a-vcc_parse.o' failed
make[5]: *** [libvcc_a-vcc_parse.o] Error 2
make[5]: *** Waiting for unfinished jobs....
make[5]: Leaving directory '/tmp/vtest.64_sun12.4/varnish-cache/lib/libvcc'
Makefile:431: recipe for target 'all' failed
make[4]: *** [all] Error 2
make[4]: Leaving directory '/tmp/vtest.64_sun12.4/varnish-cache/lib/libvcc'
Makefile:412: recipe for target 'all-recursive' failed
make[3]: *** [all-recursive] Error 1
make[3]: Leaving directory '/tmp/vtest.64_sun12.4/varnish-cache/lib'
Makefile:549: recipe for target 'all-recursive' failed

FAIL: tests/g00006.vtc

1 @ SunOS i86pc 5.11 1.04 64_gcc4.7 uplex

PASS: tests/e00019.vtc
PASS: tests/e00021.vtc
PASS: tests/e00022.vtc
PASS: tests/e00023.vtc
PASS: tests/e00024.vtc
PASS: tests/e00025.vtc
PASS: tests/e00026.vtc
PASS: tests/e00027.vtc
PASS: tests/e00028.vtc
PASS: tests/e00030.vtc
PASS: tests/e00031.vtc
PASS: tests/e00032.vtc
PASS: tests/f00001.vtc
PASS: tests/e00033.vtc
PASS: tests/g00000.vtc
PASS: tests/g00001.vtc
PASS: tests/g00002.vtc
PASS: tests/g00004.vtc
PASS: tests/g00003.vtc
PASS: tests/g00007.vtc
SKIP: tests/h00001.vtc
PASS: tests/g00008.vtc
SKIP: tests/h00002.vtc
SKIP: tests/h00003.vtc
SKIP: tests/h00004.vtc
SKIP: tests/h00005.vtc
SKIP: tests/j00001.vtc
SKIP: tests/j00000.vtc
SKIP: tests/j00003.vtc
SKIP: tests/j00004.vtc
FAIL: tests/g00006.vtc
PASS: tests/d00024.vtc
PASS: tests/l00000.vtc
PASS: tests/l00001.vtc
PASS: tests/l00002.vtc
PASS: tests/l00003.vtc
PASS: tests/g00005.vtc
PASS: tests/l00004.vtc
PASS: tests/l00005.vtc
PASS: tests/m00000.vtc

FAIL: tests/c00091.vtc

1 @ Debian x86_64 buster/sid 1.04 clang uplex

PASS: tests/c00050.vtc
PASS: tests/c00059.vtc
PASS: tests/c00061.vtc
PASS: tests/c00062.vtc
PASS: tests/c00049.vtc
PASS: tests/c00064.vtc
PASS: tests/c00060.vtc
PASS: tests/c00065.vtc
PASS: tests/c00066.vtc
PASS: tests/c00068.vtc
PASS: tests/c00067.vtc
PASS: tests/c00070.vtc
PASS: tests/c00069.vtc
PASS: tests/c00071.vtc
PASS: tests/c00073.vtc
PASS: tests/c00074.vtc
PASS: tests/c00072.vtc
PASS: tests/c00075.vtc
PASS: tests/c00078.vtc
PASS: tests/c00063.vtc
PASS: tests/c00076.vtc
PASS: tests/c00079.vtc
PASS: tests/c00077.vtc
PASS: tests/c00082.vtc
PASS: tests/c00085.vtc
SKIP: tests/c00086.vtc
PASS: tests/c00081.vtc
PASS: tests/c00084.vtc
PASS: tests/c00089.vtc
PASS: tests/c00087.vtc
FAIL: tests/c00091.vtc
PASS: tests/c00083.vtc
PASS: tests/c00088.vtc
PASS: tests/c00090.vtc
PASS: tests/c00092.vtc
PASS: tests/c00093.vtc
PASS: tests/c00097.vtc
PASS: tests/c00095.vtc
PASS: tests/c00098.vtc
PASS: tests/c00099.vtc

make[5]: *** [libvcc_a-vcc_parse.o] Error 1

1 @ SunOS i86pc 5.11 1.04 32_gcc4.7 uplex

CC       libvarnishapi_la-vxp_parse.lo
CC       vsl2rst.o
CC       vsl_glob_test-vsl_glob_test.o
CCLD     vsl2rst
CCLD     libvarnishapi.la
CCLD     vsl_glob_test
make[5]: Leaving directory '/tmp/vtest.32_gcc4.7/varnish-cache/lib/libvarnishapi'
make[4]: Leaving directory '/tmp/vtest.32_gcc4.7/varnish-cache/lib/libvarnishapi'
Making all in libvcc
make[4]: Entering directory '/tmp/vtest.32_gcc4.7/varnish-cache/lib/libvcc'
mkdir -p ../../include/tbl
/opt/local/bin/python3.4 ../../lib/libvcc/generate.py \
../.. ../..
make  all-am
make[5]: Entering directory '/tmp/vtest.32_gcc4.7/varnish-cache/lib/libvcc'
CC       libvcc_a-vcc_acl.o
CC       libvcc_a-vcc_action.o
CC       libvcc_a-vcc_backend.o
CC       libvcc_a-vcc_backend_util.o
CC       libvcc_a-vcc_compile.o
CC       libvcc_a-vcc_expr.o
mkdir -p ../../include/tbl
/opt/local/bin/python3.4 ../../lib/libvcc/generate.py \
../.. ../..
CC       libvcc_a-vcc_parse.o
CC       libvcc_a-vcc_storage.o
CC       libvcc_a-vcc_symb.o
In file included from vcc_parse.c:34:0:
vcc_compile.h:192:28: error: 'VCL_RET_MAX' undeclared here (not in a function)
Makefile:667: recipe for target 'libvcc_a-vcc_parse.o' failed
make[5]: *** [libvcc_a-vcc_parse.o] Error 1
make[5]: *** Waiting for unfinished jobs....
make[5]: Leaving directory '/tmp/vtest.32_gcc4.7/varnish-cache/lib/libvcc'
Makefile:431: recipe for target 'all' failed
make[4]: *** [all] Error 2
make[4]: Leaving directory '/tmp/vtest.32_gcc4.7/varnish-cache/lib/libvcc'
Makefile:412: recipe for target 'all-recursive' failed
make[3]: *** [all-recursive] Error 1
make[3]: Leaving directory '/tmp/vtest.32_gcc4.7/varnish-cache/lib'
Makefile:549: recipe for target 'all-recursive' failed

f457cea

FAIL: tests/r02105.vtc

1 @ SunOS i86pc 5.11 1.04 64_sun12.4 uplex

PASS: tests/r01818.vtc
PASS: tests/r01837.vtc
PASS: tests/r01826.vtc
PASS: tests/r01821.vtc
PASS: tests/r01834.vtc
PASS: tests/r01838.vtc
PASS: tests/r01843.vtc
PASS: tests/r01847.vtc
PASS: tests/r01856.vtc
PASS: tests/r01878.vtc
PASS: tests/r01881.vtc
PASS: tests/r01857.vtc
PASS: tests/r01858.vtc
PASS: tests/r01879.vtc
PASS: tests/r01890.vtc
PASS: tests/r01914.vtc
PASS: tests/r01918.vtc
PASS: tests/r01924.vtc
PASS: tests/r01941.vtc
PASS: tests/r01955.vtc
PASS: tests/r01927.vtc
PASS: tests/r01953.vtc
PASS: tests/r01990.vtc
PASS: tests/r01956.vtc
PASS: tests/r02036.vtc
PASS: tests/r02035.vtc
PASS: tests/r02084.vtc
PASS: tests/r02069.vtc
PASS: tests/r02135.vtc
PASS: tests/r02142.vtc
FAIL: tests/r02105.vtc
PASS: tests/r02042.vtc
PASS: tests/r02157.vtc
PASS: tests/r02175.vtc
PASS: tests/r02148.vtc
PASS: tests/r02219.vtc
PASS: tests/r02177.vtc
PASS: tests/r02262.vtc
SKIP: tests/r02275.vtc
PASS: tests/r02233.vtc

FAIL: tests/s00010.vtc

7 @ FreeBSD arm64 12.0-REL 1.04 RPI3b phk

PASS: tests/s00005.vtc
--- tests/s00008.log ---
--- tests/s00007.log ---
PASS: tests/s00007.vtc
--- tests/s00009.log ---
--- tests/s00008.log ---
PASS: tests/s00008.vtc
--- tests/s00010.log ---
--- tests/s00009.log ---
PASS: tests/s00009.vtc
--- tests/s00011.log ---
PASS: tests/s00011.vtc
--- tests/s00012.log ---
PASS: tests/s00012.vtc
--- tests/t02000.log ---
PASS: tests/t02000.vtc
--- tests/t02001.log ---
PASS: tests/t02001.vtc
--- tests/t02002.log ---
PASS: tests/t02002.vtc
--- tests/t02003.log ---
PASS: tests/t02003.vtc
--- tests/t02004.log ---
PASS: tests/t02004.vtc
--- tests/t02005.log ---
PASS: tests/t02005.vtc
--- tests/t02006.log ---
PASS: tests/t02006.vtc
--- tests/t02007.log ---
--- tests/s00010.log ---
FAIL: tests/s00010.vtc
--- tests/t02008.log ---
PASS: tests/t02008.vtc
--- tests/t02009.log ---
--- tests/t02007.log ---
PASS: tests/t02007.vtc
--- tests/t02010.log ---
--- tests/t02009.log ---
PASS: tests/t02009.vtc
--- tests/t02011.log ---

make[5]: *** [libvcc_a-vcc_symb.o] Error 1

2 @ SunOS i86pc 5.11 1.04 64_gcc4.7 uplex

/opt/local/bin/python3.4 ../../lib/libvcc/generate.py \
../.. ../..
make  all-am
make[5]: Entering directory '/tmp/vtest.64_gcc4.7/varnish-cache/lib/libvcc'
CC       libvcc_a-vcc_acl.o
CC       libvcc_a-vcc_action.o
CC       libvcc_a-vcc_backend.o
CC       libvcc_a-vcc_backend_util.o
CC       libvcc_a-vcc_compile.o
CC       libvcc_a-vcc_expr.o
mkdir -p ../../include/tbl
/opt/local/bin/python3.4 ../../lib/libvcc/generate.py \
../.. ../..
CC       libvcc_a-vcc_parse.o
CC       libvcc_a-vcc_storage.o
CC       libvcc_a-vcc_symb.o
CC       libvcc_a-vcc_token.o
CC       libvcc_a-vcc_types.o
vcc_symb.c: In function 'VCC_HandleKind':
vcc_symb.c:59:13: error: 'ACL' undeclared (first use in this function)
vcc_symb.c:59:13: note: each undeclared identifier is reported only once for each function it appears in
vcc_symb.c:60:13: error: 'BACKEND' undeclared (first use in this function)
vcc_symb.c:61:13: error: 'PROBE' undeclared (first use in this function)
vcc_symb.c:62:13: error: 'STEVEDORE' undeclared (first use in this function)
vcc_symb.c:63:13: error: 'SUB' undeclared (first use in this function)
vcc_symb.c:64:13: error: 'INSTANCE' undeclared (first use in this function)
vcc_symb.c: In function 'vcc_new_symbol':
vcc_symb.c:188:14: error: 'VOID' undeclared (first use in this function)
CC       libvcc_a-vcc_utils.o
Makefile:695: recipe for target 'libvcc_a-vcc_symb.o' failed
make[5]: *** [libvcc_a-vcc_symb.o] Error 1
make[5]: *** Waiting for unfinished jobs....
make[5]: Leaving directory '/tmp/vtest.64_gcc4.7/varnish-cache/lib/libvcc'
Makefile:431: recipe for target 'all' failed
make[4]: *** [all] Error 2
make[4]: Leaving directory '/tmp/vtest.64_gcc4.7/varnish-cache/lib/libvcc'
Makefile:412: recipe for target 'all-recursive' failed
make[3]: *** [all-recursive] Error 1
make[3]: Leaving directory '/tmp/vtest.64_gcc4.7/varnish-cache/lib'
Makefile:549: recipe for target 'all-recursive' failed

FAIL: tests/c00057.vtc

1 @ Linux x86_64 4.20.13 1.04 gcc uplex

PASS: tests/c00021.vtc
PASS: tests/c00022.vtc
PASS: tests/c00023.vtc
PASS: tests/c00024.vtc
PASS: tests/c00025.vtc
PASS: tests/c00027.vtc
PASS: tests/c00026.vtc
PASS: tests/c00028.vtc
PASS: tests/c00031.vtc
PASS: tests/c00037.vtc
PASS: tests/c00036.vtc
PASS: tests/c00038.vtc
PASS: tests/c00039.vtc
PASS: tests/c00040.vtc
PASS: tests/c00035.vtc
PASS: tests/c00043.vtc
PASS: tests/c00044.vtc
PASS: tests/c00034.vtc
PASS: tests/c00045.vtc
PASS: tests/c00041.vtc
PASS: tests/c00046.vtc
PASS: tests/c00047.vtc
PASS: tests/c00051.vtc
PASS: tests/c00048.vtc
PASS: tests/c00053.vtc
PASS: tests/c00052.vtc
PASS: tests/c00054.vtc
PASS: tests/c00055.vtc
PASS: tests/c00056.vtc
PASS: tests/c00058.vtc
FAIL: tests/c00057.vtc
PASS: tests/c00059.vtc
PASS: tests/c00050.vtc
PASS: tests/c00061.vtc
PASS: tests/c00062.vtc
PASS: tests/c00049.vtc
PASS: tests/c00064.vtc
PASS: tests/c00060.vtc
PASS: tests/c00065.vtc
PASS: tests/c00066.vtc

FAIL: tests/r00979.vtc

1 @ SunOS i86pc 5.11 1.04 32_sun12.4 uplex

PASS: tests/r00763.vtc
PASS: tests/r00769.vtc
PASS: tests/r00776.vtc
PASS: tests/r00789.vtc
PASS: tests/r00781.vtc
PASS: tests/r00832.vtc
PASS: tests/r00801.vtc
PASS: tests/r00803.vtc
PASS: tests/r00795.vtc
PASS: tests/r00806.vtc
PASS: tests/r00861.vtc
PASS: tests/r00873.vtc
PASS: tests/r00894.vtc
PASS: tests/r00896.vtc
PASS: tests/r00878.vtc
PASS: tests/r00916.vtc
PASS: tests/r00902.vtc
PASS: tests/r00911.vtc
PASS: tests/r00913.vtc
PASS: tests/r00917.vtc
PASS: tests/r00921.vtc
PASS: tests/r00915.vtc
PASS: tests/r00940.vtc
PASS: tests/r00942.vtc
PASS: tests/r00948.vtc
PASS: tests/r00941.vtc
PASS: tests/r00961.vtc
PASS: tests/r00963.vtc
PASS: tests/r00965.vtc
PASS: tests/r00972.vtc
FAIL: tests/r00979.vtc
PASS: tests/r00956.vtc
PASS: tests/r01002.vtc
PASS: tests/r00980.vtc
PASS: tests/r00984.vtc
PASS: tests/r01014.vtc
PASS: tests/r01029.vtc
PASS: tests/r00962.vtc
PASS: tests/r01030.vtc
PASS: tests/r01036.vtc

FAIL: tests/r00789.vtc

1 @ SunOS i86pc 5.11 1.04 64_sun12.4 uplex

PASS: tests/r00445.vtc
PASS: tests/r00476.vtc
PASS: tests/r00494.vtc
PASS: tests/r00495.vtc
PASS: tests/r00498.vtc
PASS: tests/r00502.vtc
PASS: tests/r00506.vtc
PASS: tests/r00524.vtc
PASS: tests/r00545.vtc
PASS: tests/r00558.vtc
PASS: tests/r00549.vtc
PASS: tests/r00561.vtc
PASS: tests/r00655.vtc
PASS: tests/r00590.vtc
PASS: tests/r00612.vtc
PASS: tests/r00641.vtc
PASS: tests/r00667.vtc
PASS: tests/r00686.vtc
PASS: tests/r00679.vtc
PASS: tests/r00694.vtc
PASS: tests/r00700.vtc
PASS: tests/r00702.vtc
PASS: tests/r00704.vtc
PASS: tests/r00722.vtc
PASS: tests/r00733.vtc
PASS: tests/r00742.vtc
PASS: tests/r00763.vtc
PASS: tests/r00769.vtc
PASS: tests/r00776.vtc
PASS: tests/r00781.vtc
FAIL: tests/r00789.vtc
PASS: tests/r00801.vtc
PASS: tests/r00832.vtc
PASS: tests/r00803.vtc
PASS: tests/r00795.vtc
PASS: tests/r00806.vtc
PASS: tests/r00873.vtc
PASS: tests/r00861.vtc
PASS: tests/r00878.vtc
PASS: tests/r00894.vtc

FAIL: tests/b00035.vtc

1 @ SunOS i86pc 5.11 1.04 32_gcc4.7 uplex

1 @ SunOS i86pc 5.11 1.04 64_gcc4.7 uplex

PASS: tests/b00005.vtc
PASS: tests/b00006.vtc
PASS: tests/b00007.vtc
PASS: tests/b00008.vtc
PASS: tests/b00010.vtc
PASS: tests/b00009.vtc
PASS: tests/b00011.vtc
PASS: tests/b00012.vtc
PASS: tests/b00004.vtc
PASS: tests/b00013.vtc
PASS: tests/b00017.vtc
PASS: tests/b00014.vtc
PASS: tests/b00016.vtc
PASS: tests/b00015.vtc
PASS: tests/b00019.vtc
PASS: tests/b00020.vtc
PASS: tests/b00022.vtc
PASS: tests/b00018.vtc
PASS: tests/b00024.vtc
PASS: tests/b00025.vtc
PASS: tests/b00023.vtc
PASS: tests/b00027.vtc
PASS: tests/b00028.vtc
PASS: tests/b00026.vtc
PASS: tests/b00031.vtc
PASS: tests/b00021.vtc
PASS: tests/b00034.vtc
PASS: tests/b00032.vtc
PASS: tests/b00029.vtc
PASS: tests/b00033.vtc
FAIL: tests/b00035.vtc
PASS: tests/b00036.vtc
PASS: tests/b00037.vtc
PASS: tests/b00030.vtc
PASS: tests/b00038.vtc
PASS: tests/b00042.vtc
PASS: tests/b00040.vtc
PASS: tests/b00043.vtc
PASS: tests/b00044.vtc
PASS: tests/b00045.vtc

FAIL: tests/r01804.vtc

1 @ Linux x86_64 4.20.13 1.04 clang uplex

1 @ Linux x86_64 4.20.13 1.04 gcc uplex

PASS: tests/r02413.vtc
PASS: tests/r02395.vtc
PASS: tests/r02429.vtc
PASS: tests/r02422.vtc
PASS: tests/r02451.vtc
PASS: tests/r02432.vtc
PASS: tests/r02471.vtc
PASS: tests/r02488.vtc
PASS: tests/r02433.vtc
PASS: tests/r02494.vtc
PASS: tests/r02530.vtc
PASS: tests/r02527.vtc
PASS: tests/r02418.vtc
PASS: tests/r02554.vtc
PASS: tests/r02589.vtc
PASS: tests/r02539.vtc
PASS: tests/r02617.vtc
PASS: tests/r02555.vtc
PASS: tests/r02618.vtc
PASS: tests/r02633.vtc
PASS: tests/r02645.vtc
PASS: tests/r02647.vtc
PASS: tests/r02646.vtc
PASS: tests/r02679.vtc
PASS: tests/r02649.vtc
PASS: tests/r02700.vtc
PASS: tests/r02690.vtc
PASS: tests/r02705.vtc
PASS: tests/r02763.vtc
PASS: tests/r02686.vtc
FAIL: tests/r01804.vtc
PASS: tests/r02775.vtc
PASS: tests/r02880.vtc
PASS: tests/r02839.vtc
PASS: tests/r02849.vtc
PASS: tests/r02831.vtc
PASS: tests/r02887.vtc
PASS: tests/r02702.vtc
PASS: tests/r02934.vtc
PASS: tests/r02937.vtc

make[5]: *** [libvcc_a-vcc_parse.o] Error 2

1 @ SunOS i86pc 5.11 1.04 64_sun12.4 uplex

make[5]: Entering directory '/tmp/vtest.64_sun12.4/varnish-cache/lib/libvcc'
CC       libvcc_a-vcc_acl.o
CC       libvcc_a-vcc_action.o
CC       libvcc_a-vcc_backend.o
CC       libvcc_a-vcc_backend_util.o
CC       libvcc_a-vcc_compile.o
CC       libvcc_a-vcc_expr.o
mkdir -p ../../include/tbl
/opt/local/bin/python3.4 ../../lib/libvcc/generate.py \
../.. ../..
CC       libvcc_a-vcc_parse.o
CC       libvcc_a-vcc_storage.o
CC       libvcc_a-vcc_symb.o
"vcc_parse.c", line 93: undefined symbol: ID
"vcc_parse.c", line 165: undefined symbol: CSRC
"vcc_parse.c", line 165: non-constant case expression
"vcc_parse.c", line 177: undefined symbol: EOI
"vcc_parse.c", line 177: non-constant case expression
"vcc_parse.c", line 182: undefined symbol: ID
"vcc_parse.c", line 182: non-constant case expression
"vcc_parse.c", line 295: undefined symbol: FNUM
"vcc_parse.c", line 369: undefined symbol: ID
"vcc_parse.c", line 382: undefined symbol: EOI
"vcc_parse.c", line 385: undefined symbol: CSRC
"vcc_parse.c", line 385: non-constant case expression
"vcc_parse.c", line 397: non-constant case expression
"vcc_parse.c", line 399: undefined symbol: ID
"vcc_parse.c", line 399: non-constant case expression
cc: acomp failed for vcc_parse.c
Makefile:669: recipe for target 'libvcc_a-vcc_parse.o' failed
make[5]: *** [libvcc_a-vcc_parse.o] Error 2
make[5]: *** Waiting for unfinished jobs....
make[5]: Leaving directory '/tmp/vtest.64_sun12.4/varnish-cache/lib/libvcc'
Makefile:431: recipe for target 'all' failed
make[4]: *** [all] Error 2
make[4]: Leaving directory '/tmp/vtest.64_sun12.4/varnish-cache/lib/libvcc'
Makefile:412: recipe for target 'all-recursive' failed
make[3]: *** [all-recursive] Error 1
make[3]: Leaving directory '/tmp/vtest.64_sun12.4/varnish-cache/lib'
Makefile:549: recipe for target 'all-recursive' failed

FAIL: tests/r02946.vtc

1 @ SunOS i86pc 5.11 1.04 64_gcc4.7 uplex

PASS: tests/r02617.vtc
PASS: tests/r02555.vtc
PASS: tests/r02633.vtc
PASS: tests/r02618.vtc
PASS: tests/r02647.vtc
PASS: tests/r02645.vtc
PASS: tests/r02679.vtc
PASS: tests/r02646.vtc
PASS: tests/r02690.vtc
PASS: tests/r02700.vtc
PASS: tests/r02649.vtc
PASS: tests/r02775.vtc
PASS: tests/r02763.vtc
PASS: tests/r02705.vtc
PASS: tests/r02686.vtc
PASS: tests/r02880.vtc
PASS: tests/r02839.vtc
PASS: tests/r02849.vtc
PASS: tests/r02831.vtc
PASS: tests/r02887.vtc
PASS: tests/r02702.vtc
PASS: tests/r02934.vtc
PASS: tests/r02937.vtc
PASS: tests/r02964.vtc
PASS: tests/r03003.vtc
PASS: tests/r03009.vtc
PASS: tests/r02923.vtc
PASS: tests/r03006.vtc
PASS: tests/r02976.vtc
PASS: tests/s00001.vtc
FAIL: tests/r02946.vtc
PASS: tests/s00000.vtc
PASS: tests/s00003.vtc
PASS: tests/s00006.vtc
PASS: tests/s00002.vtc
PASS: tests/s00004.vtc
SKIP: tests/s00010.vtc
PASS: tests/s00005.vtc
SKIP: tests/s00012.vtc
PASS: tests/s00007.vtc

make[5]: *** [libvcc_a-vcc_storage.o] Error 2

1 @ SunOS i86pc 5.11 1.04 32_sun12.4 uplex

CC       vsl2rst.o
CC       vsl_glob_test-vsl_glob_test.o
CCLD     vsl2rst
CCLD     libvarnishapi.la
CCLD     vsl_glob_test
make[5]: Leaving directory '/tmp/vtest.32_sun12.4/varnish-cache/lib/libvarnishapi'
make[4]: Leaving directory '/tmp/vtest.32_sun12.4/varnish-cache/lib/libvarnishapi'
Making all in libvcc
make[4]: Entering directory '/tmp/vtest.32_sun12.4/varnish-cache/lib/libvcc'
mkdir -p ../../include/tbl
/opt/local/bin/python3.4 ../../lib/libvcc/generate.py \
../.. ../..
make  all-am
make[5]: Entering directory '/tmp/vtest.32_sun12.4/varnish-cache/lib/libvcc'
CC       libvcc_a-vcc_acl.o
CC       libvcc_a-vcc_action.o
CC       libvcc_a-vcc_backend.o
CC       libvcc_a-vcc_compile.o
CC       libvcc_a-vcc_backend_util.o
mkdir -p ../../include/tbl
CC       libvcc_a-vcc_expr.o
/opt/local/bin/python3.4 ../../lib/libvcc/generate.py \
../.. ../..
CC       libvcc_a-vcc_parse.o
CC       libvcc_a-vcc_storage.o
CC       libvcc_a-vcc_symb.o
"vcc_storage.c", line 73: undefined symbol: STEVEDORE
"vcc_storage.c", line 73: improper pointer/integer combination: op "=" (E_BAD_PTR_INT_COMBINATION)
cc: acomp failed for vcc_storage.c
Makefile:683: recipe for target 'libvcc_a-vcc_storage.o' failed
make[5]: *** [libvcc_a-vcc_storage.o] Error 2
make[5]: *** Waiting for unfinished jobs....
make[5]: Leaving directory '/tmp/vtest.32_sun12.4/varnish-cache/lib/libvcc'
Makefile:431: recipe for target 'all' failed
make[4]: *** [all] Error 2
make[4]: Leaving directory '/tmp/vtest.32_sun12.4/varnish-cache/lib/libvcc'
Makefile:412: recipe for target 'all-recursive' failed
make[3]: *** [all-recursive] Error 1
make[3]: Leaving directory '/tmp/vtest.32_sun12.4/varnish-cache/lib'
Makefile:549: recipe for target 'all-recursive' failed

cacbaa6

FAIL: tests/s00010.vtc

2 @ FreeBSD arm64 12.0-REL 1.04 RPI3b phk

PASS: tests/s00005.vtc
--- tests/s00008.log ---
--- tests/s00007.log ---
PASS: tests/s00007.vtc
--- tests/s00009.log ---
--- tests/s00008.log ---
PASS: tests/s00008.vtc
--- tests/s00010.log ---
--- tests/s00009.log ---
PASS: tests/s00009.vtc
--- tests/s00011.log ---
PASS: tests/s00011.vtc
--- tests/s00012.log ---
PASS: tests/s00012.vtc
--- tests/t02000.log ---
PASS: tests/t02000.vtc
--- tests/t02001.log ---
PASS: tests/t02001.vtc
--- tests/t02002.log ---
PASS: tests/t02002.vtc
--- tests/t02003.log ---
PASS: tests/t02003.vtc
--- tests/t02004.log ---
PASS: tests/t02004.vtc
--- tests/t02005.log ---
PASS: tests/t02005.vtc
--- tests/t02006.log ---
PASS: tests/t02006.vtc
--- tests/t02007.log ---
--- tests/s00010.log ---
FAIL: tests/s00010.vtc
--- tests/t02008.log ---
PASS: tests/t02008.vtc
--- tests/t02009.log ---
--- tests/t02007.log ---
PASS: tests/t02007.vtc
--- tests/t02010.log ---
--- tests/t02009.log ---
PASS: tests/t02009.vtc
--- tests/t02011.log ---

652f591

make[5]: *** [libvcc_a-vcc_types.o] Error 1

1 @ SunOS i86pc 5.11 1.04 32_gcc4.7 uplex

CCLD     libvarnishapi.la
CCLD     vsl_glob_test
make[5]: Leaving directory '/tmp/vtest.32_gcc4.7/varnish-cache/lib/libvarnishapi'
make[4]: Leaving directory '/tmp/vtest.32_gcc4.7/varnish-cache/lib/libvarnishapi'
Making all in libvcc
make[4]: Entering directory '/tmp/vtest.32_gcc4.7/varnish-cache/lib/libvcc'
mkdir -p ../../include/tbl
/opt/local/bin/python3.4 ../../lib/libvcc/generate.py \
../.. ../..
make  all-am
make[5]: Entering directory '/tmp/vtest.32_gcc4.7/varnish-cache/lib/libvcc'
CC       libvcc_a-vcc_acl.o
CC       libvcc_a-vcc_action.o
CC       libvcc_a-vcc_backend.o
CC       libvcc_a-vcc_compile.o
CC       libvcc_a-vcc_backend_util.o
CC       libvcc_a-vcc_expr.o
mkdir -p ../../include/tbl
/opt/local/bin/python3.4 ../../lib/libvcc/generate.py \
../.. ../..
CC       libvcc_a-vcc_parse.o
CC       libvcc_a-vcc_storage.o
CC       libvcc_a-vcc_symb.o
CC       libvcc_a-vcc_token.o
CC       libvcc_a-vcc_types.o
vcc_types.c: In function 'VCC_Type':
vcc_types.c:183:27: error: ../../include/tbl/vcc_types.h is shorter than expected [-Werror]
vcc_types.c:179:22: error: unused parameter 'p' [-Werror=unused-parameter]
cc1: all warnings being treated as errors
Makefile:723: recipe for target 'libvcc_a-vcc_types.o' failed
make[5]: *** [libvcc_a-vcc_types.o] Error 1
make[5]: *** Waiting for unfinished jobs....
CC       libvcc_a-vcc_utils.o
make[5]: Leaving directory '/tmp/vtest.32_gcc4.7/varnish-cache/lib/libvcc'
Makefile:431: recipe for target 'all' failed
make[4]: *** [all] Error 2
make[4]: Leaving directory '/tmp/vtest.32_gcc4.7/varnish-cache/lib/libvcc'
Makefile:412: recipe for target 'all-recursive' failed
make[3]: *** [all-recursive] Error 1
make[3]: Leaving directory '/tmp/vtest.32_gcc4.7/varnish-cache/lib'

FAIL: tests/r02946.vtc

1 @ SunOS i86pc 5.11 1.04 64_gcc4.7 uplex

PASS: tests/r02617.vtc
PASS: tests/r02555.vtc
PASS: tests/r02618.vtc
PASS: tests/r02633.vtc
PASS: tests/r02647.vtc
PASS: tests/r02645.vtc
PASS: tests/r02679.vtc
PASS: tests/r02646.vtc
PASS: tests/r02690.vtc
PASS: tests/r02649.vtc
PASS: tests/r02700.vtc
PASS: tests/r02775.vtc
PASS: tests/r02763.vtc
PASS: tests/r02705.vtc
PASS: tests/r02686.vtc
PASS: tests/r02880.vtc
PASS: tests/r02839.vtc
PASS: tests/r02849.vtc
PASS: tests/r02831.vtc
PASS: tests/r02887.vtc
PASS: tests/r02702.vtc
PASS: tests/r02934.vtc
PASS: tests/r02937.vtc
PASS: tests/r02964.vtc
PASS: tests/r03003.vtc
PASS: tests/r03009.vtc
PASS: tests/r02923.vtc
PASS: tests/r03006.vtc
PASS: tests/r02976.vtc
PASS: tests/s00001.vtc
FAIL: tests/r02946.vtc
PASS: tests/s00000.vtc
PASS: tests/s00003.vtc
PASS: tests/s00006.vtc
PASS: tests/s00002.vtc
PASS: tests/s00004.vtc
SKIP: tests/s00010.vtc
PASS: tests/s00005.vtc
SKIP: tests/s00012.vtc
PASS: tests/s00007.vtc

FAIL: tests/s00010.vtc

4 @ FreeBSD arm64 12.0-REL 1.04 RPI3b phk

PASS: tests/s00005.vtc
--- tests/s00008.log ---
--- tests/s00007.log ---
PASS: tests/s00007.vtc
--- tests/s00009.log ---
--- tests/s00008.log ---
PASS: tests/s00008.vtc
--- tests/s00010.log ---
--- tests/s00009.log ---
PASS: tests/s00009.vtc
--- tests/s00011.log ---
PASS: tests/s00011.vtc
--- tests/s00012.log ---
PASS: tests/s00012.vtc
--- tests/t02000.log ---
PASS: tests/t02000.vtc
--- tests/t02001.log ---
PASS: tests/t02001.vtc
--- tests/t02002.log ---
PASS: tests/t02002.vtc
--- tests/t02003.log ---
PASS: tests/t02003.vtc
--- tests/t02004.log ---
PASS: tests/t02004.vtc
--- tests/t02005.log ---
PASS: tests/t02005.vtc
--- tests/t02006.log ---
PASS: tests/t02006.vtc
--- tests/t02007.log ---
--- tests/s00010.log ---
FAIL: tests/s00010.vtc
--- tests/t02008.log ---
PASS: tests/t02008.vtc
--- tests/t02009.log ---
--- tests/t02007.log ---
PASS: tests/t02007.vtc
--- tests/t02010.log ---
--- tests/t02009.log ---
PASS: tests/t02009.vtc
--- tests/t02011.log ---

FAIL: tests/d00017.vtc

1 @ SunOS i86pc 5.11 1.04 64_sun12.4 uplex

PASS: tests/c00089.vtc
PASS: tests/c00091.vtc
PASS: tests/c00090.vtc
PASS: tests/c00088.vtc
PASS: tests/c00083.vtc
PASS: tests/c00092.vtc
PASS: tests/c00093.vtc
PASS: tests/c00097.vtc
PASS: tests/c00098.vtc
PASS: tests/c00095.vtc
PASS: tests/c00080.vtc
PASS: tests/c00099.vtc
PASS: tests/d00000.vtc
PASS: tests/d00001.vtc
PASS: tests/d00003.vtc
PASS: tests/d00002.vtc
PASS: tests/d00004.vtc
PASS: tests/c00094.vtc
PASS: tests/d00005.vtc
PASS: tests/d00007.vtc
PASS: tests/d00006.vtc
PASS: tests/d00009.vtc
PASS: tests/d00008.vtc
PASS: tests/d00010.vtc
PASS: tests/d00014.vtc
PASS: tests/d00011.vtc
PASS: tests/d00015.vtc
PASS: tests/d00012.vtc
PASS: tests/d00013.vtc
PASS: tests/d00016.vtc
FAIL: tests/d00017.vtc
PASS: tests/d00018.vtc
PASS: tests/d00019.vtc
PASS: tests/d00020.vtc
PASS: tests/d00021.vtc
PASS: tests/d00023.vtc
PASS: tests/d00022.vtc
PASS: tests/d00025.vtc
PASS: tests/d00026.vtc
PASS: tests/d00027.vtc

762fda9

FAIL: tests/r02964.vtc

1 @ FreeBSD amd64 12.0-REL 1.04 phk

PASS: tests/r02705.vtc
--- tests/r02763.log ---
PASS: tests/r02763.vtc
--- tests/r02775.log ---
--- tests/r02702.log ---
PASS: tests/r02702.vtc
--- tests/r02831.log ---
--- tests/r02775.log ---
PASS: tests/r02775.vtc
--- tests/r02839.log ---
PASS: tests/r02839.vtc
--- tests/r02849.log ---
--- tests/r02831.log ---
PASS: tests/r02831.vtc
--- tests/r02880.log ---
PASS: tests/r02880.vtc
--- tests/r02887.log ---
--- tests/r02849.log ---
PASS: tests/r02849.vtc
--- tests/r02923.log ---
--- tests/r02887.log ---
PASS: tests/r02887.vtc
--- tests/r02934.log ---
PASS: tests/r02934.vtc
--- tests/r02937.log ---
PASS: tests/r02937.vtc
--- tests/r02946.log ---
--- tests/r02923.log ---
PASS: tests/r02923.vtc
--- tests/r02964.log ---
FAIL: tests/r02964.vtc
--- tests/r02976.log ---
--- tests/r02946.log ---
PASS: tests/r02946.vtc
--- tests/r03003.log ---
PASS: tests/r03003.vtc
--- tests/r03006.log ---
--- tests/r02976.log ---
PASS: tests/r02976.vtc
--- tests/r03009.log ---

FAIL: tests/r01818.vtc

1 @ SunOS i86pc 5.11 1.04 64_gcc4.7 uplex

PASS: tests/r01955.vtc
PASS: tests/r01990.vtc
PASS: tests/r01956.vtc
PASS: tests/r02036.vtc
PASS: tests/r02035.vtc
PASS: tests/r02069.vtc
PASS: tests/r02084.vtc
PASS: tests/r02105.vtc
PASS: tests/r02135.vtc
PASS: tests/r02042.vtc
PASS: tests/r02142.vtc
PASS: tests/r02175.vtc
PASS: tests/r02157.vtc
PASS: tests/r02177.vtc
PASS: tests/r02148.vtc
PASS: tests/r02262.vtc
PASS: tests/r02219.vtc
PASS: tests/r02233.vtc
SKIP: tests/r02275.vtc
PASS: tests/r02266.vtc
PASS: tests/r02291.vtc
PASS: tests/r02300.vtc
PASS: tests/r02258.vtc
PASS: tests/r02310.vtc
PASS: tests/r02321.vtc
PASS: tests/r02325.vtc
PASS: tests/r02319.vtc
PASS: tests/r02305.vtc
PASS: tests/r02342.vtc
PASS: tests/r02351.vtc
FAIL: tests/r01818.vtc
PASS: tests/r02367.vtc
PASS: tests/r02372.vtc
PASS: tests/r02387.vtc
PASS: tests/r02270.vtc
PASS: tests/r02406.vtc
PASS: tests/r02413.vtc
PASS: tests/r02395.vtc
PASS: tests/r02339.vtc
PASS: tests/r02422.vtc

FAIL: tests/s00010.vtc

27 @ FreeBSD arm64 12.0-REL 1.04 RPI3b phk

PASS: tests/s00005.vtc
--- tests/s00008.log ---
--- tests/s00007.log ---
PASS: tests/s00007.vtc
--- tests/s00009.log ---
--- tests/s00008.log ---
PASS: tests/s00008.vtc
--- tests/s00010.log ---
--- tests/s00009.log ---
PASS: tests/s00009.vtc
--- tests/s00011.log ---
PASS: tests/s00011.vtc
--- tests/s00012.log ---
PASS: tests/s00012.vtc
--- tests/t02000.log ---
PASS: tests/t02000.vtc
--- tests/t02001.log ---
PASS: tests/t02001.vtc
--- tests/t02002.log ---
PASS: tests/t02002.vtc
--- tests/t02003.log ---
PASS: tests/t02003.vtc
--- tests/t02004.log ---
PASS: tests/t02004.vtc
--- tests/t02005.log ---
PASS: tests/t02005.vtc
--- tests/t02006.log ---
PASS: tests/t02006.vtc
--- tests/t02007.log ---
--- tests/s00010.log ---
FAIL: tests/s00010.vtc
--- tests/t02008.log ---
PASS: tests/t02008.vtc
--- tests/t02009.log ---
--- tests/t02007.log ---
PASS: tests/t02007.vtc
--- tests/t02010.log ---
--- tests/t02009.log ---
PASS: tests/t02009.vtc
--- tests/t02011.log ---

make[5]: *** [libvcc_a-vcc_symb.o] Error 1

1 @ SunOS i86pc 5.11 1.04 64_gcc4.7 uplex

/opt/local/bin/python3.4 ../../lib/libvcc/generate.py \
../.. ../..
make  all-am
make[5]: Entering directory '/tmp/vtest.64_gcc4.7/varnish-cache/lib/libvcc'
CC       libvcc_a-vcc_acl.o
CC       libvcc_a-vcc_action.o
CC       libvcc_a-vcc_backend.o
CC       libvcc_a-vcc_backend_util.o
CC       libvcc_a-vcc_compile.o
CC       libvcc_a-vcc_expr.o
mkdir -p ../../include/tbl
/opt/local/bin/python3.4 ../../lib/libvcc/generate.py \
../.. ../..
CC       libvcc_a-vcc_parse.o
CC       libvcc_a-vcc_storage.o
CC       libvcc_a-vcc_symb.o
CC       libvcc_a-vcc_token.o
vcc_symb.c: In function 'VCC_HandleKind':
vcc_symb.c:59:13: error: 'ACL' undeclared (first use in this function)
vcc_symb.c:59:13: note: each undeclared identifier is reported only once for each function it appears in
vcc_symb.c:60:13: error: 'BACKEND' undeclared (first use in this function)
vcc_symb.c:61:13: error: 'PROBE' undeclared (first use in this function)
vcc_symb.c:62:13: error: 'STEVEDORE' undeclared (first use in this function)
vcc_symb.c:63:13: error: 'SUB' undeclared (first use in this function)
vcc_symb.c:64:13: error: 'INSTANCE' undeclared (first use in this function)
vcc_symb.c: In function 'vcc_new_symbol':
vcc_symb.c:188:14: error: 'VOID' undeclared (first use in this function)
CC       libvcc_a-vcc_types.o
CC       libvcc_a-vcc_utils.o
Makefile:695: recipe for target 'libvcc_a-vcc_symb.o' failed
make[5]: *** [libvcc_a-vcc_symb.o] Error 1
make[5]: *** Waiting for unfinished jobs....
make[5]: Leaving directory '/tmp/vtest.64_gcc4.7/varnish-cache/lib/libvcc'
Makefile:431: recipe for target 'all' failed
make[4]: *** [all] Error 2
make[4]: Leaving directory '/tmp/vtest.64_gcc4.7/varnish-cache/lib/libvcc'
Makefile:412: recipe for target 'all-recursive' failed
make[3]: *** [all-recursive] Error 1
make[3]: Leaving directory '/tmp/vtest.64_gcc4.7/varnish-cache/lib'
Makefile:551: recipe for target 'all-recursive' failed

FAIL: tests/d00021.vtc

1 @ SunOS i86pc 5.11 1.04 64_gcc4.7 uplex

PASS: tests/c00083.vtc
PASS: tests/c00092.vtc
PASS: tests/c00093.vtc
PASS: tests/c00097.vtc
PASS: tests/c00098.vtc
PASS: tests/c00095.vtc
PASS: tests/c00099.vtc
PASS: tests/d00000.vtc
PASS: tests/c00080.vtc
PASS: tests/d00001.vtc
PASS: tests/d00002.vtc
PASS: tests/c00094.vtc
PASS: tests/d00003.vtc
PASS: tests/d00004.vtc
PASS: tests/d00005.vtc
PASS: tests/d00006.vtc
PASS: tests/d00007.vtc
PASS: tests/d00009.vtc
PASS: tests/d00010.vtc
PASS: tests/d00008.vtc
PASS: tests/d00014.vtc
PASS: tests/d00015.vtc
PASS: tests/d00011.vtc
PASS: tests/d00012.vtc
PASS: tests/d00013.vtc
PASS: tests/d00016.vtc
PASS: tests/d00017.vtc
PASS: tests/d00018.vtc
PASS: tests/d00019.vtc
PASS: tests/d00020.vtc
FAIL: tests/d00021.vtc
PASS: tests/d00022.vtc
PASS: tests/d00023.vtc
PASS: tests/d00025.vtc
PASS: tests/d00026.vtc
PASS: tests/d00027.vtc
PASS: tests/d00028.vtc
PASS: tests/d00029.vtc
PASS: tests/d00031.vtc
PASS: tests/d00033.vtc

make[5]: *** [libvcc_a-vcc_storage.o] Error 1

2 @ SunOS i86pc 5.11 1.04 64_gcc4.7 uplex

CC       libvarnishapi_la-vxp_parse.lo
CC       vsl2rst.o
CC       vsl_glob_test-vsl_glob_test.o
CCLD     vsl2rst
CCLD     libvarnishapi.la
CCLD     vsl_glob_test
make[5]: Leaving directory '/tmp/vtest.64_gcc4.7/varnish-cache/lib/libvarnishapi'
make[4]: Leaving directory '/tmp/vtest.64_gcc4.7/varnish-cache/lib/libvarnishapi'
Making all in libvcc
make[4]: Entering directory '/tmp/vtest.64_gcc4.7/varnish-cache/lib/libvcc'
mkdir -p ../../include/tbl
/opt/local/bin/python3.4 ../../lib/libvcc/generate.py \
../.. ../..
make  all-am
make[5]: Entering directory '/tmp/vtest.64_gcc4.7/varnish-cache/lib/libvcc'
CC       libvcc_a-vcc_acl.o
CC       libvcc_a-vcc_action.o
CC       libvcc_a-vcc_backend.o
CC       libvcc_a-vcc_backend_util.o
CC       libvcc_a-vcc_compile.o
CC       libvcc_a-vcc_expr.o
mkdir -p ../../include/tbl
/opt/local/bin/python3.4 ../../lib/libvcc/generate.py \
../.. ../..
CC       libvcc_a-vcc_parse.o
CC       libvcc_a-vcc_storage.o
In file included from vcc_storage.c:61:0:
vcc_compile.h:192:28: error: 'VCL_RET_MAX' undeclared here (not in a function)
CC       libvcc_a-vcc_symb.o
Makefile:681: recipe for target 'libvcc_a-vcc_storage.o' failed
make[5]: *** [libvcc_a-vcc_storage.o] Error 1
make[5]: *** Waiting for unfinished jobs....
make[5]: Leaving directory '/tmp/vtest.64_gcc4.7/varnish-cache/lib/libvcc'
Makefile:431: recipe for target 'all' failed
make[4]: *** [all] Error 2
make[4]: Leaving directory '/tmp/vtest.64_gcc4.7/varnish-cache/lib/libvcc'
Makefile:412: recipe for target 'all-recursive' failed
make[3]: *** [all-recursive] Error 1
make[3]: Leaving directory '/tmp/vtest.64_gcc4.7/varnish-cache/lib'
Makefile:551: recipe for target 'all-recursive' failed

FAIL: tests/b00035.vtc

1 @ SunOS i86pc 5.11 1.04 32_gcc4.7 uplex

1 @ SunOS i86pc 5.11 1.04 32_sun12.4 uplex

1 @ SunOS i86pc 5.11 1.04 64_gcc4.7 uplex

PASS: tests/b00006.vtc
PASS: tests/b00005.vtc
PASS: tests/b00007.vtc
PASS: tests/b00008.vtc
PASS: tests/b00010.vtc
PASS: tests/b00011.vtc
PASS: tests/b00009.vtc
PASS: tests/b00004.vtc
PASS: tests/b00012.vtc
PASS: tests/b00013.vtc
PASS: tests/b00017.vtc
PASS: tests/b00014.vtc
PASS: tests/b00016.vtc
PASS: tests/b00015.vtc
PASS: tests/b00019.vtc
PASS: tests/b00020.vtc
PASS: tests/b00022.vtc
PASS: tests/b00018.vtc
PASS: tests/b00024.vtc
PASS: tests/b00025.vtc
PASS: tests/b00023.vtc
PASS: tests/b00027.vtc
PASS: tests/b00028.vtc
PASS: tests/b00026.vtc
PASS: tests/b00031.vtc
PASS: tests/b00021.vtc
PASS: tests/b00034.vtc
PASS: tests/b00032.vtc
PASS: tests/b00029.vtc
PASS: tests/b00033.vtc
FAIL: tests/b00035.vtc
PASS: tests/b00036.vtc
PASS: tests/b00030.vtc
PASS: tests/b00037.vtc
PASS: tests/b00038.vtc
PASS: tests/b00040.vtc
PASS: tests/b00042.vtc
PASS: tests/b00043.vtc
PASS: tests/b00044.vtc
PASS: tests/b00045.vtc

FAIL: tests/u00009.vtc

1 @ Linux x86_64 4.20.13 1.04 gcc uplex

PASS: tests/v00006.vtc
PASS: tests/v00031.vtc
PASS: tests/v00027.vtc
PASS: tests/v00032.vtc
PASS: tests/v00033.vtc
PASS: tests/v00025.vtc
PASS: tests/v00034.vtc
PASS: tests/v00037.vtc
PASS: tests/v00038.vtc
PASS: tests/v00040.vtc
PASS: tests/v00039.vtc
PASS: tests/v00042.vtc
PASS: tests/v00043.vtc
PASS: tests/v00041.vtc
PASS: tests/v00046.vtc
PASS: tests/v00047.vtc
PASS: tests/v00049.vtc
PASS: tests/v00050.vtc
PASS: tests/v00045.vtc
PASS: tests/v00052.vtc
PASS: tests/v00055.vtc
PASS: tests/v00051.vtc
PASS: tests/v00057.vtc
PASS: tests/v00003.vtc
PASS: tests/v00054.vtc
PASS: tests/v00056.vtc
PASS: tests/v00058.vtc
PASS: tests/v00059.vtc
PASS: tests/v00060.vtc
PASS: tests/v00062.vtc
FAIL: tests/u00009.vtc
============================================================================
Testsuite summary for Varnish trunk
============================================================================
# TOTAL: 773
# PASS:  757
# SKIP:  15
# XFAIL: 0
# FAIL:  1
# XPASS: 0

FAIL: tests/r01478.vtc

1 @ SunOS i86pc 5.11 1.04 32_sun12.4 uplex

PASS: tests/r01296.vtc
PASS: tests/r01225.vtc
PASS: tests/r01284.vtc
PASS: tests/r01266.vtc
PASS: tests/r01312.vtc
PASS: tests/r01320.vtc
PASS: tests/r01332.vtc
PASS: tests/r01333.vtc
PASS: tests/r01337.vtc
PASS: tests/r01349.vtc
PASS: tests/r01356.vtc
PASS: tests/r01355.vtc
PASS: tests/r01367.vtc
PASS: tests/r01398.vtc
PASS: tests/r01395.vtc
PASS: tests/r01391.vtc
PASS: tests/r01404.vtc
PASS: tests/r01401.vtc
PASS: tests/r01350.vtc
PASS: tests/r01417.vtc
PASS: tests/r01406.vtc
PASS: tests/r01441.vtc
PASS: tests/r01399.vtc
PASS: tests/r01419.vtc
PASS: tests/r01468.vtc
PASS: tests/r01485.vtc
PASS: tests/r01493.vtc
PASS: tests/r01442.vtc
PASS: tests/r01498.vtc
PASS: tests/r01494.vtc
FAIL: tests/r01478.vtc
PASS: tests/r01501.vtc
PASS: tests/r01504.vtc
PASS: tests/r01510.vtc
PASS: tests/r01524.vtc
PASS: tests/r01518.vtc
PASS: tests/r01512.vtc
PASS: tests/r01499.vtc
PASS: tests/r01532.vtc
PASS: tests/r01557.vtc

FAIL: tests/g00005.vtc

1 @ FreeBSD i386 12.0-REL 1.04 phk

1 @ Linux x86_64 4.20.13 1.04 clang uplex

PASS: tests/e00025.vtc
PASS: tests/e00026.vtc
PASS: tests/e00027.vtc
PASS: tests/e00028.vtc
PASS: tests/e00030.vtc
PASS: tests/e00031.vtc
PASS: tests/e00032.vtc
PASS: tests/e00033.vtc
PASS: tests/f00001.vtc
PASS: tests/g00000.vtc
PASS: tests/g00001.vtc
PASS: tests/g00002.vtc
PASS: tests/g00003.vtc
PASS: tests/g00004.vtc
PASS: tests/g00008.vtc
PASS: tests/g00007.vtc
SKIP: tests/h00001.vtc
SKIP: tests/h00002.vtc
PASS: tests/d00024.vtc
SKIP: tests/h00003.vtc
SKIP: tests/h00004.vtc
SKIP: tests/h00005.vtc
SKIP: tests/j00000.vtc
SKIP: tests/j00001.vtc
SKIP: tests/j00003.vtc
SKIP: tests/j00004.vtc
PASS: tests/g00006.vtc
PASS: tests/l00000.vtc
PASS: tests/l00002.vtc
PASS: tests/l00001.vtc
FAIL: tests/g00005.vtc
PASS: tests/l00003.vtc
PASS: tests/l00004.vtc
PASS: tests/l00005.vtc
PASS: tests/m00000.vtc
PASS: tests/m00002.vtc
PASS: tests/m00001.vtc
PASS: tests/m00003.vtc
PASS: tests/m00005.vtc
PASS: tests/m00006.vtc

FAIL: tests/d00017.vtc

1 @ SunOS i86pc 5.11 1.04 32_sun12.4 uplex

1 @ SunOS i86pc 5.11 1.04 64_gcc4.7 uplex

PASS: tests/c00089.vtc
PASS: tests/c00091.vtc
PASS: tests/c00090.vtc
PASS: tests/c00088.vtc
PASS: tests/c00083.vtc
PASS: tests/c00092.vtc
PASS: tests/c00093.vtc
PASS: tests/c00097.vtc
PASS: tests/c00095.vtc
PASS: tests/c00098.vtc
PASS: tests/c00099.vtc
PASS: tests/d00000.vtc
PASS: tests/c00080.vtc
PASS: tests/d00001.vtc
PASS: tests/d00003.vtc
PASS: tests/d00002.vtc
PASS: tests/d00004.vtc
PASS: tests/c00094.vtc
PASS: tests/d00005.vtc
PASS: tests/d00006.vtc
PASS: tests/d00007.vtc
PASS: tests/d00009.vtc
PASS: tests/d00008.vtc
PASS: tests/d00010.vtc
PASS: tests/d00014.vtc
PASS: tests/d00015.vtc
PASS: tests/d00011.vtc
PASS: tests/d00013.vtc
PASS: tests/d00012.vtc
PASS: tests/d00016.vtc
FAIL: tests/d00017.vtc
PASS: tests/d00018.vtc
PASS: tests/d00019.vtc
PASS: tests/d00020.vtc
PASS: tests/d00021.vtc
PASS: tests/d00022.vtc
PASS: tests/d00023.vtc
PASS: tests/d00025.vtc
PASS: tests/d00026.vtc
PASS: tests/d00027.vtc

FAIL: tests/r02339.vtc

1 @ SunOS i86pc 5.11 1.04 32_gcc4.7 uplex

PASS: tests/r02849.vtc
PASS: tests/r02887.vtc
PASS: tests/r02934.vtc
PASS: tests/r02937.vtc
PASS: tests/r02964.vtc
PASS: tests/r02946.vtc
PASS: tests/r03003.vtc
PASS: tests/r02923.vtc
PASS: tests/r03009.vtc
PASS: tests/r02976.vtc
PASS: tests/r03006.vtc
PASS: tests/s00001.vtc
PASS: tests/s00000.vtc
PASS: tests/s00003.vtc
PASS: tests/s00002.vtc
PASS: tests/s00006.vtc
PASS: tests/s00004.vtc
PASS: tests/s00005.vtc
SKIP: tests/s00010.vtc
PASS: tests/s00008.vtc
SKIP: tests/s00012.vtc
PASS: tests/s00007.vtc
PASS: tests/s00011.vtc
PASS: tests/s00009.vtc
PASS: tests/t02002.vtc
PASS: tests/t02001.vtc
PASS: tests/t02003.vtc
PASS: tests/t02004.vtc
PASS: tests/t02005.vtc
PASS: tests/t02000.vtc
FAIL: tests/r02339.vtc
PASS: tests/t02006.vtc
PASS: tests/t02008.vtc
PASS: tests/t02009.vtc
PASS: tests/t02010.vtc
PASS: tests/t02012.vtc
PASS: tests/t02011.vtc
PASS: tests/t02007.vtc
PASS: tests/t02015.vtc
PASS: tests/t02013.vtc

FAIL: tests/s00004.vtc

1 @ Debian x86_64 buster/sid 1.04 clang uplex

PASS: tests/t02014.vtc
PASS: tests/u00000.vtc
PASS: tests/u00004.vtc
PASS: tests/t02016.vtc
PASS: tests/u00003.vtc
PASS: tests/u00007.vtc
PASS: tests/u00005.vtc
PASS: tests/u00008.vtc
PASS: tests/u00011.vtc
PASS: tests/u00006.vtc
PASS: tests/u00012.vtc
PASS: tests/u00010.vtc
PASS: tests/u00013.vtc
PASS: tests/u00009.vtc
PASS: tests/v00000.vtc
PASS: tests/u00014.vtc
PASS: tests/v00001.vtc
PASS: tests/v00005.vtc
PASS: tests/v00002.vtc
PASS: tests/v00004.vtc
PASS: tests/v00008.vtc
PASS: tests/v00011.vtc
PASS: tests/v00010.vtc
PASS: tests/v00012.vtc
PASS: tests/v00013.vtc
PASS: tests/v00015.vtc
SKIP: tests/v00016.vtc
PASS: tests/v00017.vtc
PASS: tests/v00014.vtc
PASS: tests/v00019.vtc
FAIL: tests/s00004.vtc
PASS: tests/v00018.vtc
PASS: tests/v00021.vtc
PASS: tests/v00024.vtc
PASS: tests/v00020.vtc
PASS: tests/v00031.vtc
PASS: tests/v00027.vtc
PASS: tests/v00006.vtc
PASS: tests/v00032.vtc
PASS: tests/v00033.vtc

76c7d40

FAIL: tests/r02964.vtc

1 @ FreeBSD amd64 12.0-REL 1.04 phk

PASS: tests/r02705.vtc
--- tests/r02763.log ---
PASS: tests/r02763.vtc
--- tests/r02775.log ---
--- tests/r02702.log ---
PASS: tests/r02702.vtc
--- tests/r02831.log ---
--- tests/r02775.log ---
PASS: tests/r02775.vtc
--- tests/r02839.log ---
PASS: tests/r02839.vtc
--- tests/r02849.log ---
--- tests/r02831.log ---
PASS: tests/r02831.vtc
--- tests/r02880.log ---
PASS: tests/r02880.vtc
--- tests/r02887.log ---
--- tests/r02849.log ---
PASS: tests/r02849.vtc
--- tests/r02923.log ---
--- tests/r02887.log ---
PASS: tests/r02887.vtc
--- tests/r02934.log ---
PASS: tests/r02934.vtc
--- tests/r02937.log ---
PASS: tests/r02937.vtc
--- tests/r02946.log ---
--- tests/r02923.log ---
PASS: tests/r02923.vtc
--- tests/r02964.log ---
FAIL: tests/r02964.vtc
--- tests/r02976.log ---
--- tests/r02946.log ---
PASS: tests/r02946.vtc
--- tests/r03003.log ---
PASS: tests/r03003.vtc
--- tests/r03006.log ---
--- tests/r02976.log ---
PASS: tests/r02976.vtc
--- tests/r03009.log ---

d22dbc0

make[5]: *** [libvcc_a-vcc_types.o] Error 1

1 @ SunOS i86pc 5.11 1.04 32_gcc4.7 uplex

make[5]: Leaving directory '/tmp/vtest.32_gcc4.7/varnish-cache/lib/libvarnishapi'
make[4]: Leaving directory '/tmp/vtest.32_gcc4.7/varnish-cache/lib/libvarnishapi'
Making all in libvcc
make[4]: Entering directory '/tmp/vtest.32_gcc4.7/varnish-cache/lib/libvcc'
mkdir -p ../../include/tbl
/opt/local/bin/python3.4 ../../lib/libvcc/generate.py \
../.. ../..
make  all-am
make[5]: Entering directory '/tmp/vtest.32_gcc4.7/varnish-cache/lib/libvcc'
CC       libvcc_a-vcc_acl.o
CC       libvcc_a-vcc_action.o
CC       libvcc_a-vcc_backend.o
CC       libvcc_a-vcc_backend_util.o
CC       libvcc_a-vcc_compile.o
CC       libvcc_a-vcc_expr.o
mkdir -p ../../include/tbl
/opt/local/bin/python3.4 ../../lib/libvcc/generate.py \
../.. ../..
CC       libvcc_a-vcc_parse.o
CC       libvcc_a-vcc_storage.o
CC       libvcc_a-vcc_symb.o
CC       libvcc_a-vcc_token.o
CC       libvcc_a-vcc_types.o
vcc_types.c:69:14: error: 'REAL' undeclared here (not in a function)
vcc_types.c: In function 'VCC_Type':
vcc_types.c:182:0: error: "VCC_TYPE" redefined [-Werror]
In file included from vcc_types.c:35:0:
vcc_compile.h:110:0: note: this is the location of the previous definition
cc1: all warnings being treated as errors
Makefile:723: recipe for target 'libvcc_a-vcc_types.o' failed
make[5]: *** [libvcc_a-vcc_types.o] Error 1
make[5]: *** Waiting for unfinished jobs....
CC       libvcc_a-vcc_utils.o
make[5]: Leaving directory '/tmp/vtest.32_gcc4.7/varnish-cache/lib/libvcc'
Makefile:431: recipe for target 'all' failed
make[4]: *** [all] Error 2
make[4]: Leaving directory '/tmp/vtest.32_gcc4.7/varnish-cache/lib/libvcc'
Makefile:412: recipe for target 'all-recursive' failed
make[3]: *** [all-recursive] Error 1
make[3]: Leaving directory '/tmp/vtest.32_gcc4.7/varnish-cache/lib'

FAIL: tests/r02964.vtc

1 @ FreeBSD amd64 12.0-REL 1.04 phk

PASS: tests/r02705.vtc
--- tests/r02763.log ---
PASS: tests/r02763.vtc
--- tests/r02775.log ---
--- tests/r02702.log ---
PASS: tests/r02702.vtc
--- tests/r02831.log ---
--- tests/r02775.log ---
PASS: tests/r02775.vtc
--- tests/r02839.log ---
PASS: tests/r02839.vtc
--- tests/r02849.log ---
--- tests/r02831.log ---
PASS: tests/r02831.vtc
--- tests/r02880.log ---
PASS: tests/r02880.vtc
--- tests/r02887.log ---
--- tests/r02849.log ---
PASS: tests/r02849.vtc
--- tests/r02923.log ---
--- tests/r02887.log ---
PASS: tests/r02887.vtc
--- tests/r02934.log ---
PASS: tests/r02934.vtc
--- tests/r02937.log ---
PASS: tests/r02937.vtc
--- tests/r02946.log ---
--- tests/r02923.log ---
PASS: tests/r02923.vtc
--- tests/r02964.log ---
FAIL: tests/r02964.vtc
--- tests/r02976.log ---
--- tests/r02946.log ---
PASS: tests/r02946.vtc
--- tests/r03003.log ---
PASS: tests/r03003.vtc
--- tests/r03006.log ---
--- tests/r02976.log ---
PASS: tests/r02976.vtc
--- tests/r03009.log ---

6670257

FAIL: tests/s00010.vtc

1 @ FreeBSD arm64 12.0-REL 1.04 RPI3b phk

PASS: tests/s00005.vtc
--- tests/s00008.log ---
--- tests/s00007.log ---
PASS: tests/s00007.vtc
--- tests/s00009.log ---
--- tests/s00008.log ---
PASS: tests/s00008.vtc
--- tests/s00010.log ---
--- tests/s00009.log ---
PASS: tests/s00009.vtc
--- tests/s00011.log ---
PASS: tests/s00011.vtc
--- tests/s00012.log ---
PASS: tests/s00012.vtc
--- tests/t02000.log ---
PASS: tests/t02000.vtc
--- tests/t02001.log ---
PASS: tests/t02001.vtc
--- tests/t02002.log ---
PASS: tests/t02002.vtc
--- tests/t02003.log ---
PASS: tests/t02003.vtc
--- tests/t02004.log ---
PASS: tests/t02004.vtc
--- tests/t02005.log ---
PASS: tests/t02005.vtc
--- tests/t02006.log ---
PASS: tests/t02006.vtc
--- tests/t02007.log ---
--- tests/s00010.log ---
FAIL: tests/s00010.vtc
--- tests/t02008.log ---
PASS: tests/t02008.vtc
--- tests/t02009.log ---
--- tests/t02007.log ---
PASS: tests/t02007.vtc
--- tests/t02010.log ---
--- tests/t02009.log ---
PASS: tests/t02009.vtc
--- tests/t02011.log ---