o00000

cd44549

1 @ SunOS 5.11 i86pc 1.04 64_gcc4.7 uplex

*    top   0.0 TEST ../../../bin/varnishtest/tests/o00000.vtc starting
[...]
*    top   0.0 TEST PROXY1 protocol tests
[...]
***  c1    6.3 Connect to 127.0.0.1 53398
***  c1    6.3 connected fd 10 from 127.0.0.1 42439 to 127.0.0.1 53398
**   c1    6.3 === send "PROXY TCP4 1.2.3.4 5.6.7.8 1234 E\r\n"
**** c1    6.3 send|PROXY TCP4 1.2.3.4 5.6.7.8 1234 E\r
**   c1    6.3 === timeout 8
**   c1    6.3 === expect_close
**** c1    6.3 Expecting close (fd = 10)
**** c1    6.3 fd=10 EOF, as expected
***  c1    6.3 closing fd 10
**   c1    6.3 Ending
**   top   6.3 === delay .1
***  top   6.3 delaying 0.1 second(s)
**** v1    6.3 vsl|       1008 Begin           c sess 0 PROXY
**** v1    6.3 vsl|       1008 SessOpen        c 127.0.0.1 42439 a0 127.0.0.1 53398 1503170414.545478 19
**** v1    6.3 vsl|       1008 ProxyGarbage    c PROXY1: Cannot resolve destination address (node name or service name not known)
**** v1    6.3 vsl|       1008 SessClose       c RX_JUNK 0.000
**** v1    6.3 vsl|       1008 End             c
**   top   6.4 === client c1 {
**   c1    6.4 Starting client
**   c1    6.4 Waiting for client
***  c1    6.4 Connect to 127.0.0.1 53398
---- c1    6.4 Failed to open 127.0.0.1 53398: (null)
*    top   6.4 RESETTING after ../../../bin/varnishtest/tests/o00000.vtc
**   s1    6.4 Waiting for server (3/-1)
**** s1    6.4 macro undef s1_addr
**** s1    6.4 macro undef s1_port
**** s1    6.4 macro undef s1_sock
**   v1    6.4 Wait
***  v1    6.4 debug|Debug: Stopping Child
**** v1    6.4 vsl|          0 CLI             - Rd ping
**** v1    6.4 vsl|          0 CLI             - Wr 200 19 PONG 1503170414 1.0
**** v1    6.4 vsl|          0 CLI             - EOF on CLI connection, worker stops
***  v1    7.4 debug|Info: Child (59138) ended
***  v1    7.4 debug|Info: Child (59138) said Child dies
***  v1    7.4 debug|Debug:
***  v1    7.4 debug| Child cleanup complete
**** v1    7.4 STDOUT poll 0x10
**   v1    7.4 R 59068 Status: 0000 (u 0.159000 s 0.099000)
*    top   7.4 TEST ../../../bin/varnishtest/tests/o00000.vtc FAILED
#    top  TEST ../../../bin/varnishtest/tests/o00000.vtc FAILED (7.440) exit=2

a6850a3

1 @ SunOS 5.11 i86pc 1.04 64_sun12.4 uplex

*    top   0.0 TEST ../../../bin/varnishtest/tests/o00000.vtc starting
[...]
*    top   0.0 TEST PROXY1 protocol tests
[...]
***  c1    6.0 Connect to 127.0.0.1 41172
***  c1    6.0 connected fd 10 from 127.0.0.1 58243 to 127.0.0.1 41172
**   c1    6.0 === send "PROXY TCP4 1.2.3.4 C D E\r\n"
**** c1    6.0 send|PROXY TCP4 1.2.3.4 C D E\r
**   c1    6.0 === timeout 8
**   c1    6.0 === expect_close
**** c1    6.0 Expecting close (fd = 10)
**** c1    6.0 fd=10 EOF, as expected
***  c1    6.0 closing fd 10
**   c1    6.0 Ending
**   top   6.0 === delay .1
***  top   6.0 delaying 0.1 second(s)
**** v1    6.0 vsl|       1006 Begin           c sess 0 PROXY
**** v1    6.0 vsl|       1006 SessOpen        c 127.0.0.1 58243 a0 127.0.0.1 41172 1503112955.002247 17
**** v1    6.0 vsl|       1006 ProxyGarbage    c PROXY1: Cannot resolve source address (node name or service name not known)
**** v1    6.0 vsl|       1006 SessClose       c RX_JUNK 0.000
**** v1    6.0 vsl|       1006 End             c
**   top   6.1 === client c1 {
**   c1    6.1 Starting client
**   c1    6.1 Waiting for client
***  c1    6.1 Connect to 127.0.0.1 41172
---- c1    6.1 Failed to open 127.0.0.1 41172: (null)
*    top   6.1 RESETTING after ../../../bin/varnishtest/tests/o00000.vtc
**   s1    6.1 Waiting for server (3/-1)
**** s1    6.1 macro undef s1_addr
**** s1    6.1 macro undef s1_port
**** s1    6.1 macro undef s1_sock
**   v1    6.1 Wait
***  v1    6.1 debug|Debug: Stopping Child
**** v1    6.1 vsl|          0 CLI             - EOF on CLI connection, worker stops
***  v1    7.1 debug|Info:
***  v1    7.1 debug|
***  v1    7.1 debug|Child (81123) ended
***  v1    7.1 debug|
***  v1    7.1 debug|Info: Child (81123) said Child dies
***  v1    7.1 debug|Debug: Child cleanup complete
**** v1    7.1 STDOUT poll 0x10
**   v1    7.1 R 80964 Status: 0000 (u 0.071000 s 0.125000)
*    top   7.1 TEST ../../../bin/varnishtest/tests/o00000.vtc FAILED
#    top  TEST ../../../bin/varnishtest/tests/o00000.vtc FAILED (7.145) exit=2