r00310

8bbbdfa

1 @ Linux 3.10.0 x86_64 1.02 mblissett

*    top   0.0 TEST ../../../bin/varnishtest/tests/r00310.vtc starting
[...]
*    top   0.0 TEST Test obj.http.x-cache in vcl_hit
[...]
**** v1    0.1 CLI RX|Type 'start' to launch worker process.
**** v1    0.1 CLI TX|vcl.inline vcl1 << %XJEIFLH|)Xspa8P
**** v1    0.1 CLI TX|vcl 4.0;
**** v1    0.1 CLI TX|
**** v1    0.1 CLI TX|\tbackend foo { .host = "127.0.0.1"; }
**** v1    0.1 CLI TX|
**** v1    0.1 CLI TX|\tsub vcl_hit {
**** v1    0.1 CLI TX|\t\tset obj.http.x-cache = "hit";
**** v1    0.1 CLI TX|\t}
**** v1    0.1 CLI TX|
**** v1    0.1 CLI TX|%XJEIFLH|)Xspa8P
***  v1    0.1 CLI RX  106
**** v1    0.1 CLI RX|Message from VCC-compiler:
**** v1    0.1 CLI RX|Variable 'obj.http.x-cache' is read only.
**** v1    0.1 CLI RX|At: ('<vcl.inline>' Line 6 Pos 21)
**** v1    0.1 CLI RX|                set obj.http.x-cache = "hit";
**** v1    0.1 CLI RX|--------------------################---------
**** v1    0.1 CLI RX|
**** v1    0.1 CLI RX|Running VCC-compiler failed, exited with 2
**** v1    0.1 CLI RX|VCL compilation failed
**   v1    0.1 VCL compilation failed (as expected)
***  v1    0.1 Found expected string: ("Variable 'obj.http.x-cache' is read only.")
*    top   0.1 RESETTING after ../../../bin/varnishtest/tests/r00310.vtc
**   v1    0.1 Wait
**** v1    0.1 CLI TX|backend.list
***  v1    0.2 CLI RX  101
**** v1    0.2 CLI RX|Unknown request in manager process (child not running).
**** v1    0.2 CLI RX|Type 'help' for more info.
**   v1    0.2 Stop
**** v1    0.2 CLI TX|stop
***  v1    0.2 CLI RX  300
**** v1    0.2 CLI RX|Child in state stopped
**** v1    0.2 CLI TX|status
***  v1    0.2 CLI RX  200
**** v1    0.2 CLI RX|Child in state stopped
**** v1    0.2 STDOUT poll 0x10
**   v1    0.2 R 29445 Status: 0000 (u 0.000888 s 0.011820)
*    diag  0.0 ............................................................
#    top  TEST ../../../bin/varnishtest/tests/r00310.vtc TIMED OUT (kill -9)
#    top  TEST ../../../bin/varnishtest/tests/r00310.vtc FAILED (60.002) signal=9

1 @ Linux 3.10.0 x86_64 1.02 mblissett

*    top   0.0 TEST ../../../bin/varnishtest/tests/r00310.vtc starting
[...]
*    top   0.0 TEST Test obj.http.x-cache in vcl_hit
[...]
**** v1    0.1 CLI RX|Type 'start' to launch worker process.
**** v1    0.1 CLI TX|vcl.inline vcl1 << %XJEIFLH|)Xspa8P
**** v1    0.1 CLI TX|vcl 4.0;
**** v1    0.1 CLI TX|
**** v1    0.1 CLI TX|\tbackend foo { .host = "127.0.0.1"; }
**** v1    0.1 CLI TX|
**** v1    0.1 CLI TX|\tsub vcl_hit {
**** v1    0.1 CLI TX|\t\tset obj.http.x-cache = "hit";
**** v1    0.1 CLI TX|\t}
**** v1    0.1 CLI TX|
**** v1    0.1 CLI TX|%XJEIFLH|)Xspa8P
***  v1    0.1 CLI RX  106
**** v1    0.1 CLI RX|Message from VCC-compiler:
**** v1    0.1 CLI RX|Variable 'obj.http.x-cache' is read only.
**** v1    0.1 CLI RX|At: ('<vcl.inline>' Line 6 Pos 21)
**** v1    0.1 CLI RX|                set obj.http.x-cache = "hit";
**** v1    0.1 CLI RX|--------------------################---------
**** v1    0.1 CLI RX|
**** v1    0.1 CLI RX|Running VCC-compiler failed, exited with 2
**** v1    0.1 CLI RX|VCL compilation failed
**   v1    0.1 VCL compilation failed (as expected)
***  v1    0.1 Found expected string: ("Variable 'obj.http.x-cache' is read only.")
*    top   0.1 RESETTING after ../../../bin/varnishtest/tests/r00310.vtc
**   v1    0.1 Wait
**** v1    0.1 CLI TX|backend.list
***  v1    0.2 CLI RX  101
**** v1    0.2 CLI RX|Unknown request in manager process (child not running).
**** v1    0.2 CLI RX|Type 'help' for more info.
**   v1    0.2 Stop
**** v1    0.2 CLI TX|stop
***  v1    0.2 CLI RX  300
**** v1    0.2 CLI RX|Child in state stopped
**** v1    0.2 CLI TX|status
***  v1    0.2 CLI RX  200
**** v1    0.2 CLI RX|Child in state stopped
**** v1    0.2 STDOUT poll 0x10
**   v1    0.2 R 26332 Status: 0000 (u 0.007984 s 0.014987)
*    diag  0.0 ............................................................
#    top  TEST ../../../bin/varnishtest/tests/r00310.vtc TIMED OUT (kill -9)
#    top  TEST ../../../bin/varnishtest/tests/r00310.vtc FAILED (60.001) signal=9

1 @ SunOS 5.11 i86pc 1.04 32_gcc4.7 uplex

*    top   0.0 TEST ../../../bin/varnishtest/tests/r00310.vtc starting
[...]
*    top   0.0 TEST Test obj.http.x-cache in vcl_hit
[...]
**** v1    0.1 CLI TX|vcl.inline vcl1 << %XJEIFLH|)Xspa8P
**** v1    0.1 CLI TX|vcl 4.0;
**** v1    0.1 CLI TX|
**** v1    0.1 CLI TX|\tbackend foo { .host = "127.0.0.1"; }
**** v1    0.1 CLI TX|
**** v1    0.1 CLI TX|\tsub vcl_hit {
**** v1    0.1 CLI TX|\t\tset obj.http.x-cache = "hit";
**** v1    0.1 CLI TX|\t}
**** v1    0.1 CLI TX|
**** v1    0.1 CLI TX|%XJEIFLH|)Xspa8P
***  v1    0.1 CLI RX  106
**** v1    0.1 CLI RX|Message from VCC-compiler:
**** v1    0.1 CLI RX|Security: Privilege proc_setid missing, will not change uid/gid
**** v1    0.1 CLI RX|Variable 'obj.http.x-cache' is read only.
**** v1    0.1 CLI RX|At: ('<vcl.inline>' Line 6 Pos 21)
**** v1    0.1 CLI RX|                set obj.http.x-cache = "hit";
**** v1    0.1 CLI RX|--------------------################---------
**** v1    0.1 CLI RX|
**** v1    0.1 CLI RX|Running VCC-compiler failed, exited with 2
**** v1    0.1 CLI RX|VCL compilation failed
**   v1    0.1 VCL compilation failed (as expected)
***  v1    0.1 Found expected string: ("Variable 'obj.http.x-cache' is read only.")
*    top   0.1 RESETTING after ../../../bin/varnishtest/tests/r00310.vtc
**   v1    0.1 Wait
**** v1    0.1 CLI TX|backend.list
***  v1    0.1 CLI RX  101
**** v1    0.1 CLI RX|Unknown request in manager process (child not running).
**** v1    0.1 CLI RX|Type 'help' for more info.
**   v1    0.1 Stop
**** v1    0.1 CLI TX|stop
***  v1    0.1 CLI RX  300
**** v1    0.1 CLI RX|Child in state stopped
**** v1    0.1 CLI TX|status
***  v1    0.1 CLI RX  200
**** v1    0.1 CLI RX|Child in state stopped
**** v1    0.1 STDOUT poll 0x10
**   v1    0.1 R 35997 Status: 0000 (u 0.004000 s 0.017000)
*    diag  0.0 ............................................................
#    top  TEST ../../../bin/varnishtest/tests/r00310.vtc TIMED OUT (kill -9)
#    top  TEST ../../../bin/varnishtest/tests/r00310.vtc FAILED (60.002) signal=9

1 @ SunOS 5.11 i86pc 1.04 64_sun12.4 uplex

*    top   0.0 TEST ../../../bin/varnishtest/tests/r00310.vtc starting
[...]
*    top   0.0 TEST Test obj.http.x-cache in vcl_hit
[...]
**** v1    0.1 CLI TX|vcl.inline vcl1 << %XJEIFLH|)Xspa8P
**** v1    0.1 CLI TX|vcl 4.0;
**** v1    0.1 CLI TX|
**** v1    0.1 CLI TX|\tbackend foo { .host = "127.0.0.1"; }
**** v1    0.1 CLI TX|
**** v1    0.1 CLI TX|\tsub vcl_hit {
**** v1    0.1 CLI TX|\t\tset obj.http.x-cache = "hit";
**** v1    0.1 CLI TX|\t}
**** v1    0.1 CLI TX|
**** v1    0.1 CLI TX|%XJEIFLH|)Xspa8P
***  v1    0.1 CLI RX  106
**** v1    0.1 CLI RX|Message from VCC-compiler:
**** v1    0.1 CLI RX|Security: Privilege proc_setid missing, will not change uid/gid
**** v1    0.1 CLI RX|Variable 'obj.http.x-cache' is read only.
**** v1    0.1 CLI RX|At: ('<vcl.inline>' Line 6 Pos 21)
**** v1    0.1 CLI RX|                set obj.http.x-cache = "hit";
**** v1    0.1 CLI RX|--------------------################---------
**** v1    0.1 CLI RX|
**** v1    0.1 CLI RX|Running VCC-compiler failed, exited with 2
**** v1    0.1 CLI RX|VCL compilation failed
**   v1    0.1 VCL compilation failed (as expected)
***  v1    0.1 Found expected string: ("Variable 'obj.http.x-cache' is read only.")
*    top   0.1 RESETTING after ../../../bin/varnishtest/tests/r00310.vtc
**   v1    0.1 Wait
**** v1    0.1 CLI TX|backend.list
***  v1    0.1 CLI RX  101
**** v1    0.1 CLI RX|Unknown request in manager process (child not running).
**** v1    0.1 CLI RX|Type 'help' for more info.
**   v1    0.1 Stop
**** v1    0.1 CLI TX|stop
***  v1    0.1 CLI RX  300
**** v1    0.1 CLI RX|Child in state stopped
**** v1    0.1 CLI TX|status
***  v1    0.1 CLI RX  200
**** v1    0.1 CLI RX|Child in state stopped
**** v1    0.1 STDOUT poll 0x10
**   v1    0.1 R 77971 Status: 0000 (u 0.007000 s 0.022000)
*    diag  0.0 ............................................................
#    top  TEST ../../../bin/varnishtest/tests/r00310.vtc TIMED OUT (kill -9)
#    top  TEST ../../../bin/varnishtest/tests/r00310.vtc FAILED (60.004) signal=9

1 @ SunOS 5.11 i86pc 1.04 64_gcc4.7 uplex

*    top   0.0 TEST ../../../bin/varnishtest/tests/r00310.vtc starting
[...]
*    top   0.0 TEST Test obj.http.x-cache in vcl_hit
[...]
**** v1    0.1 CLI TX|vcl.inline vcl1 << %XJEIFLH|)Xspa8P
**** v1    0.1 CLI TX|vcl 4.0;
**** v1    0.1 CLI TX|
**** v1    0.1 CLI TX|\tbackend foo { .host = "127.0.0.1"; }
**** v1    0.1 CLI TX|
**** v1    0.1 CLI TX|\tsub vcl_hit {
**** v1    0.1 CLI TX|\t\tset obj.http.x-cache = "hit";
**** v1    0.1 CLI TX|\t}
**** v1    0.1 CLI TX|
**** v1    0.1 CLI TX|%XJEIFLH|)Xspa8P
***  v1    0.1 CLI RX  106
**** v1    0.1 CLI RX|Message from VCC-compiler:
**** v1    0.1 CLI RX|Security: Privilege proc_setid missing, will not change uid/gid
**** v1    0.1 CLI RX|Variable 'obj.http.x-cache' is read only.
**** v1    0.1 CLI RX|At: ('<vcl.inline>' Line 6 Pos 21)
**** v1    0.1 CLI RX|                set obj.http.x-cache = "hit";
**** v1    0.1 CLI RX|--------------------################---------
**** v1    0.1 CLI RX|
**** v1    0.1 CLI RX|Running VCC-compiler failed, exited with 2
**** v1    0.1 CLI RX|VCL compilation failed
**   v1    0.1 VCL compilation failed (as expected)
***  v1    0.1 Found expected string: ("Variable 'obj.http.x-cache' is read only.")
*    top   0.1 RESETTING after ../../../bin/varnishtest/tests/r00310.vtc
**   v1    0.1 Wait
**** v1    0.1 CLI TX|backend.list
***  v1    0.1 CLI RX  101
**** v1    0.1 CLI RX|Unknown request in manager process (child not running).
**** v1    0.1 CLI RX|Type 'help' for more info.
**   v1    0.1 Stop
**** v1    0.1 CLI TX|stop
***  v1    0.1 CLI RX  300
**** v1    0.1 CLI RX|Child in state stopped
**** v1    0.1 CLI TX|status
***  v1    0.1 CLI RX  200
**** v1    0.1 CLI RX|Child in state stopped
**** v1    0.1 STDOUT poll 0x10
**   v1    0.1 R 66393 Status: 0000 (u 0.007000 s 0.023000)
*    diag  0.0 ............................................................
#    top  TEST ../../../bin/varnishtest/tests/r00310.vtc TIMED OUT (kill -9)
#    top  TEST ../../../bin/varnishtest/tests/r00310.vtc FAILED (60.003) signal=9

1 @ Linux 3.10.0 x86_64 1.02 mblissett

*    top   0.0 TEST ../../../bin/varnishtest/tests/r00310.vtc starting
[...]
*    top   0.0 TEST Test obj.http.x-cache in vcl_hit
[...]
**** v1    0.1 CLI RX|Type 'start' to launch worker process.
**** v1    0.1 CLI TX|vcl.inline vcl1 << %XJEIFLH|)Xspa8P
**** v1    0.1 CLI TX|vcl 4.0;
**** v1    0.1 CLI TX|
**** v1    0.1 CLI TX|\tbackend foo { .host = "127.0.0.1"; }
**** v1    0.1 CLI TX|
**** v1    0.1 CLI TX|\tsub vcl_hit {
**** v1    0.1 CLI TX|\t\tset obj.http.x-cache = "hit";
**** v1    0.1 CLI TX|\t}
**** v1    0.1 CLI TX|
**** v1    0.1 CLI TX|%XJEIFLH|)Xspa8P
***  v1    0.1 CLI RX  106
**** v1    0.1 CLI RX|Message from VCC-compiler:
**** v1    0.1 CLI RX|Variable 'obj.http.x-cache' is read only.
**** v1    0.1 CLI RX|At: ('<vcl.inline>' Line 6 Pos 21)
**** v1    0.1 CLI RX|                set obj.http.x-cache = "hit";
**** v1    0.1 CLI RX|--------------------################---------
**** v1    0.1 CLI RX|
**** v1    0.1 CLI RX|Running VCC-compiler failed, exited with 2
**** v1    0.1 CLI RX|VCL compilation failed
**   v1    0.1 VCL compilation failed (as expected)
***  v1    0.1 Found expected string: ("Variable 'obj.http.x-cache' is read only.")
*    top   0.1 RESETTING after ../../../bin/varnishtest/tests/r00310.vtc
**   v1    0.1 Wait
**** v1    0.1 CLI TX|backend.list
***  v1    0.2 CLI RX  101
**** v1    0.2 CLI RX|Unknown request in manager process (child not running).
**** v1    0.2 CLI RX|Type 'help' for more info.
**   v1    0.2 Stop
**** v1    0.2 CLI TX|stop
***  v1    0.2 CLI RX  300
**** v1    0.2 CLI RX|Child in state stopped
**** v1    0.2 CLI TX|status
***  v1    0.2 CLI RX  200
**** v1    0.2 CLI RX|Child in state stopped
**** v1    0.2 STDOUT poll 0x10
**   v1    0.2 R 19977 Status: 0000 (u 0.005597 s 0.007914)
*    diag  0.0 ............................................................
#    top  TEST ../../../bin/varnishtest/tests/r00310.vtc TIMED OUT (kill -9)
#    top  TEST ../../../bin/varnishtest/tests/r00310.vtc FAILED (60.002) signal=9

1 @ Ubuntu LTS i686 1.04 fgs

*    top   0.0 TEST ../../../bin/varnishtest/tests/r00310.vtc starting
[...]
*    top   0.0 TEST Test obj.http.x-cache in vcl_hit
[...]
**** v1    0.1 CLI RX|Type 'start' to launch worker process.
**** v1    0.1 CLI TX|vcl.inline vcl1 << %XJEIFLH|)Xspa8P
**** v1    0.1 CLI TX|vcl 4.0;
**** v1    0.1 CLI TX|
**** v1    0.1 CLI TX|\tbackend foo { .host = "127.0.0.1"; }
**** v1    0.1 CLI TX|
**** v1    0.1 CLI TX|\tsub vcl_hit {
**** v1    0.1 CLI TX|\t\tset obj.http.x-cache = "hit";
**** v1    0.1 CLI TX|\t}
**** v1    0.1 CLI TX|
**** v1    0.1 CLI TX|%XJEIFLH|)Xspa8P
***  v1    0.1 CLI RX  106
**** v1    0.1 CLI RX|Message from VCC-compiler:
**** v1    0.1 CLI RX|Variable 'obj.http.x-cache' is read only.
**** v1    0.1 CLI RX|At: ('<vcl.inline>' Line 6 Pos 21)
**** v1    0.1 CLI RX|                set obj.http.x-cache = "hit";
**** v1    0.1 CLI RX|--------------------################---------
**** v1    0.1 CLI RX|
**** v1    0.1 CLI RX|Running VCC-compiler failed, exited with 2
**** v1    0.1 CLI RX|VCL compilation failed
**   v1    0.1 VCL compilation failed (as expected)
***  v1    0.1 Found expected string: ("Variable 'obj.http.x-cache' is read only.")
*    top   0.1 RESETTING after ../../../bin/varnishtest/tests/r00310.vtc
**   v1    0.1 Wait
**** v1    0.1 CLI TX|backend.list
***  v1    0.1 CLI RX  101
**** v1    0.1 CLI RX|Unknown request in manager process (child not running).
**** v1    0.1 CLI RX|Type 'help' for more info.
**   v1    0.1 Stop
**** v1    0.1 CLI TX|stop
***  v1    0.2 CLI RX  300
**** v1    0.2 CLI RX|Child in state stopped
**** v1    0.2 CLI TX|status
***  v1    0.2 CLI RX  200
**** v1    0.2 CLI RX|Child in state stopped
**** v1    0.2 STDOUT poll 0x10
**   v1    0.2 R 20759 Status: 0000 (u 0.000000 s 0.008000)
*    diag  0.0 ............................................................
#    top  TEST ../../../bin/varnishtest/tests/r00310.vtc TIMED OUT (kill -9)
#    top  TEST ../../../bin/varnishtest/tests/r00310.vtc FAILED (60.001) signal=9

1 @ SunOS 5.11 i86pc 1.04 64_sun12.4 uplex

*    top   0.0 TEST ../../../bin/varnishtest/tests/r00310.vtc starting
[...]
*    top   0.0 TEST Test obj.http.x-cache in vcl_hit
[...]
**** v1    0.1 CLI TX|vcl.inline vcl1 << %XJEIFLH|)Xspa8P
**** v1    0.1 CLI TX|vcl 4.0;
**** v1    0.1 CLI TX|
**** v1    0.1 CLI TX|\tbackend foo { .host = "127.0.0.1"; }
**** v1    0.1 CLI TX|
**** v1    0.1 CLI TX|\tsub vcl_hit {
**** v1    0.1 CLI TX|\t\tset obj.http.x-cache = "hit";
**** v1    0.1 CLI TX|\t}
**** v1    0.1 CLI TX|
**** v1    0.1 CLI TX|%XJEIFLH|)Xspa8P
***  v1    0.1 CLI RX  106
**** v1    0.1 CLI RX|Message from VCC-compiler:
**** v1    0.1 CLI RX|Security: Privilege proc_setid missing, will not change uid/gid
**** v1    0.1 CLI RX|Variable 'obj.http.x-cache' is read only.
**** v1    0.1 CLI RX|At: ('<vcl.inline>' Line 6 Pos 21)
**** v1    0.1 CLI RX|                set obj.http.x-cache = "hit";
**** v1    0.1 CLI RX|--------------------################---------
**** v1    0.1 CLI RX|
**** v1    0.1 CLI RX|Running VCC-compiler failed, exited with 2
**** v1    0.1 CLI RX|VCL compilation failed
**   v1    0.1 VCL compilation failed (as expected)
***  v1    0.1 Found expected string: ("Variable 'obj.http.x-cache' is read only.")
*    top   0.1 RESETTING after ../../../bin/varnishtest/tests/r00310.vtc
**   v1    0.1 Wait
**** v1    0.1 CLI TX|backend.list
***  v1    0.1 CLI RX  101
**** v1    0.1 CLI RX|Unknown request in manager process (child not running).
**** v1    0.1 CLI RX|Type 'help' for more info.
**   v1    0.1 Stop
**** v1    0.1 CLI TX|stop
***  v1    0.1 CLI RX  300
**** v1    0.1 CLI RX|Child in state stopped
**** v1    0.1 CLI TX|status
***  v1    0.1 CLI RX  200
**** v1    0.1 CLI RX|Child in state stopped
**** v1    0.1 STDOUT poll 0x10
**   v1    0.1 R 20411 Status: 0000 (u 0.007000 s 0.021000)
*    diag  0.0 ............................................................
#    top  TEST ../../../bin/varnishtest/tests/r00310.vtc TIMED OUT (kill -9)
#    top  TEST ../../../bin/varnishtest/tests/r00310.vtc FAILED (60.003) signal=9

1 @ Linux 3.10.0 x86_64 1.02 mblissett

*    top   0.0 TEST ../../../bin/varnishtest/tests/r00310.vtc starting
[...]
*    top   0.0 TEST Test obj.http.x-cache in vcl_hit
[...]
**** v1    0.1 CLI RX|Type 'start' to launch worker process.
**** v1    0.1 CLI TX|vcl.inline vcl1 << %XJEIFLH|)Xspa8P
**** v1    0.1 CLI TX|vcl 4.0;
**** v1    0.1 CLI TX|
**** v1    0.1 CLI TX|\tbackend foo { .host = "127.0.0.1"; }
**** v1    0.1 CLI TX|
**** v1    0.1 CLI TX|\tsub vcl_hit {
**** v1    0.1 CLI TX|\t\tset obj.http.x-cache = "hit";
**** v1    0.1 CLI TX|\t}
**** v1    0.1 CLI TX|
**** v1    0.1 CLI TX|%XJEIFLH|)Xspa8P
***  v1    0.1 CLI RX  106
**** v1    0.1 CLI RX|Message from VCC-compiler:
**** v1    0.1 CLI RX|Variable 'obj.http.x-cache' is read only.
**** v1    0.1 CLI RX|At: ('<vcl.inline>' Line 6 Pos 21)
**** v1    0.1 CLI RX|                set obj.http.x-cache = "hit";
**** v1    0.1 CLI RX|--------------------################---------
**** v1    0.1 CLI RX|
**** v1    0.1 CLI RX|Running VCC-compiler failed, exited with 2
**** v1    0.1 CLI RX|VCL compilation failed
**   v1    0.1 VCL compilation failed (as expected)
***  v1    0.1 Found expected string: ("Variable 'obj.http.x-cache' is read only.")
*    top   0.1 RESETTING after ../../../bin/varnishtest/tests/r00310.vtc
**   v1    0.1 Wait
**** v1    0.1 CLI TX|backend.list
***  v1    0.2 CLI RX  101
**** v1    0.2 CLI RX|Unknown request in manager process (child not running).
**** v1    0.2 CLI RX|Type 'help' for more info.
**   v1    0.2 Stop
**** v1    0.2 CLI TX|stop
***  v1    0.2 CLI RX  300
**** v1    0.2 CLI RX|Child in state stopped
**** v1    0.2 CLI TX|status
***  v1    0.2 CLI RX  200
**** v1    0.2 CLI RX|Child in state stopped
**** v1    0.2 STDOUT poll 0x10
**   v1    0.2 R 23164 Status: 0000 (u 0.003188 s 0.019173)
*    diag  0.0 ............................................................
#    top  TEST ../../../bin/varnishtest/tests/r00310.vtc TIMED OUT (kill -9)
#    top  TEST ../../../bin/varnishtest/tests/r00310.vtc FAILED (60.001) signal=9

1 @ SunOS 5.11 i86pc 1.04 32_gcc4.7 uplex

*    top   0.0 TEST ../../../bin/varnishtest/tests/r00310.vtc starting
[...]
*    top   0.0 TEST Test obj.http.x-cache in vcl_hit
[...]
**** v1    0.1 CLI TX|vcl.inline vcl1 << %XJEIFLH|)Xspa8P
**** v1    0.1 CLI TX|vcl 4.0;
**** v1    0.1 CLI TX|
**** v1    0.1 CLI TX|\tbackend foo { .host = "127.0.0.1"; }
**** v1    0.1 CLI TX|
**** v1    0.1 CLI TX|\tsub vcl_hit {
**** v1    0.1 CLI TX|\t\tset obj.http.x-cache = "hit";
**** v1    0.1 CLI TX|\t}
**** v1    0.1 CLI TX|
**** v1    0.1 CLI TX|%XJEIFLH|)Xspa8P
***  v1    0.1 CLI RX  106
**** v1    0.1 CLI RX|Message from VCC-compiler:
**** v1    0.1 CLI RX|Security: Privilege proc_setid missing, will not change uid/gid
**** v1    0.1 CLI RX|Variable 'obj.http.x-cache' is read only.
**** v1    0.1 CLI RX|At: ('<vcl.inline>' Line 6 Pos 21)
**** v1    0.1 CLI RX|                set obj.http.x-cache = "hit";
**** v1    0.1 CLI RX|--------------------################---------
**** v1    0.1 CLI RX|
**** v1    0.1 CLI RX|Running VCC-compiler failed, exited with 2
**** v1    0.1 CLI RX|VCL compilation failed
**   v1    0.1 VCL compilation failed (as expected)
***  v1    0.1 Found expected string: ("Variable 'obj.http.x-cache' is read only.")
*    top   0.1 RESETTING after ../../../bin/varnishtest/tests/r00310.vtc
**   v1    0.1 Wait
**** v1    0.1 CLI TX|backend.list
***  v1    0.1 CLI RX  101
**** v1    0.1 CLI RX|Unknown request in manager process (child not running).
**** v1    0.1 CLI RX|Type 'help' for more info.
**   v1    0.1 Stop
**** v1    0.1 CLI TX|stop
***  v1    0.1 CLI RX  300
**** v1    0.1 CLI RX|Child in state stopped
**** v1    0.1 CLI TX|status
***  v1    0.1 CLI RX  200
**** v1    0.1 CLI RX|Child in state stopped
**** v1    0.1 STDOUT poll 0x10
**   v1    0.1 R 93083 Status: 0000 (u 0.005000 s 0.019000)
*    diag  0.0 ............................................................
#    top  TEST ../../../bin/varnishtest/tests/r00310.vtc TIMED OUT (kill -9)
#    top  TEST ../../../bin/varnishtest/tests/r00310.vtc FAILED (60.002) signal=9

1 @ SunOS 5.11 i86pc 1.04 64_gcc4.7 uplex

*    top   0.0 TEST ../../../bin/varnishtest/tests/r00310.vtc starting
[...]
*    top   0.0 TEST Test obj.http.x-cache in vcl_hit
[...]
**** v1    0.1 CLI TX|vcl.inline vcl1 << %XJEIFLH|)Xspa8P
**** v1    0.1 CLI TX|vcl 4.0;
**** v1    0.1 CLI TX|
**** v1    0.1 CLI TX|\tbackend foo { .host = "127.0.0.1"; }
**** v1    0.1 CLI TX|
**** v1    0.1 CLI TX|\tsub vcl_hit {
**** v1    0.1 CLI TX|\t\tset obj.http.x-cache = "hit";
**** v1    0.1 CLI TX|\t}
**** v1    0.1 CLI TX|
**** v1    0.1 CLI TX|%XJEIFLH|)Xspa8P
***  v1    0.1 CLI RX  106
**** v1    0.1 CLI RX|Message from VCC-compiler:
**** v1    0.1 CLI RX|Security: Privilege proc_setid missing, will not change uid/gid
**** v1    0.1 CLI RX|Variable 'obj.http.x-cache' is read only.
**** v1    0.1 CLI RX|At: ('<vcl.inline>' Line 6 Pos 21)
**** v1    0.1 CLI RX|                set obj.http.x-cache = "hit";
**** v1    0.1 CLI RX|--------------------################---------
**** v1    0.1 CLI RX|
**** v1    0.1 CLI RX|Running VCC-compiler failed, exited with 2
**** v1    0.1 CLI RX|VCL compilation failed
**   v1    0.1 VCL compilation failed (as expected)
***  v1    0.1 Found expected string: ("Variable 'obj.http.x-cache' is read only.")
*    top   0.1 RESETTING after ../../../bin/varnishtest/tests/r00310.vtc
**   v1    0.1 Wait
**** v1    0.1 CLI TX|backend.list
***  v1    0.1 CLI RX  101
**** v1    0.1 CLI RX|Unknown request in manager process (child not running).
**** v1    0.1 CLI RX|Type 'help' for more info.
**   v1    0.1 Stop
**** v1    0.1 CLI TX|stop
***  v1    0.1 CLI RX  300
**** v1    0.1 CLI RX|Child in state stopped
**** v1    0.1 CLI TX|status
***  v1    0.1 CLI RX  200
**** v1    0.1 CLI RX|Child in state stopped
**** v1    0.1 STDOUT poll 0x10
**   v1    0.1 R 89357 Status: 0000 (u 0.007000 s 0.023000)
*    diag  0.0 ............................................................
#    top  TEST ../../../bin/varnishtest/tests/r00310.vtc TIMED OUT (kill -9)
#    top  TEST ../../../bin/varnishtest/tests/r00310.vtc FAILED (60.004) signal=9

1 @ SunOS 5.11 i86pc 1.04 64_sun12.4 uplex

*    top   0.0 TEST ../../../bin/varnishtest/tests/r00310.vtc starting
[...]
*    top   0.0 TEST Test obj.http.x-cache in vcl_hit
[...]
**** v1    0.1 CLI TX|vcl.inline vcl1 << %XJEIFLH|)Xspa8P
**** v1    0.1 CLI TX|vcl 4.0;
**** v1    0.1 CLI TX|
**** v1    0.1 CLI TX|\tbackend foo { .host = "127.0.0.1"; }
**** v1    0.1 CLI TX|
**** v1    0.1 CLI TX|\tsub vcl_hit {
**** v1    0.1 CLI TX|\t\tset obj.http.x-cache = "hit";
**** v1    0.1 CLI TX|\t}
**** v1    0.1 CLI TX|
**** v1    0.1 CLI TX|%XJEIFLH|)Xspa8P
***  v1    0.1 CLI RX  106
**** v1    0.1 CLI RX|Message from VCC-compiler:
**** v1    0.1 CLI RX|Security: Privilege proc_setid missing, will not change uid/gid
**** v1    0.1 CLI RX|Variable 'obj.http.x-cache' is read only.
**** v1    0.1 CLI RX|At: ('<vcl.inline>' Line 6 Pos 21)
**** v1    0.1 CLI RX|                set obj.http.x-cache = "hit";
**** v1    0.1 CLI RX|--------------------################---------
**** v1    0.1 CLI RX|
**** v1    0.1 CLI RX|Running VCC-compiler failed, exited with 2
**** v1    0.1 CLI RX|VCL compilation failed
**   v1    0.1 VCL compilation failed (as expected)
***  v1    0.1 Found expected string: ("Variable 'obj.http.x-cache' is read only.")
*    top   0.1 RESETTING after ../../../bin/varnishtest/tests/r00310.vtc
**   v1    0.1 Wait
**** v1    0.1 CLI TX|backend.list
***  v1    0.1 CLI RX  101
**** v1    0.1 CLI RX|Unknown request in manager process (child not running).
**** v1    0.1 CLI RX|Type 'help' for more info.
**   v1    0.1 Stop
**** v1    0.1 CLI TX|stop
***  v1    0.1 CLI RX  300
**** v1    0.1 CLI RX|Child in state stopped
**** v1    0.1 CLI TX|status
***  v1    0.1 CLI RX  200
**** v1    0.1 CLI RX|Child in state stopped
**** v1    0.1 STDOUT poll 0x10
**   v1    0.1 R 76931 Status: 0000 (u 0.007000 s 0.023000)
*    diag  0.0 ............................................................
#    top  TEST ../../../bin/varnishtest/tests/r00310.vtc TIMED OUT (kill -9)
#    top  TEST ../../../bin/varnishtest/tests/r00310.vtc FAILED (60.005) signal=9

1 @ SunOS 5.11 i86pc 1.04 64_gcc4.7 uplex

*    top   0.0 TEST ../../../bin/varnishtest/tests/r00310.vtc starting
[...]
*    top   0.0 TEST Test obj.http.x-cache in vcl_hit
[...]
**** v1    0.1 CLI TX|vcl.inline vcl1 << %XJEIFLH|)Xspa8P
**** v1    0.1 CLI TX|vcl 4.0;
**** v1    0.1 CLI TX|
**** v1    0.1 CLI TX|\tbackend foo { .host = "127.0.0.1"; }
**** v1    0.1 CLI TX|
**** v1    0.1 CLI TX|\tsub vcl_hit {
**** v1    0.1 CLI TX|\t\tset obj.http.x-cache = "hit";
**** v1    0.1 CLI TX|\t}
**** v1    0.1 CLI TX|
**** v1    0.1 CLI TX|%XJEIFLH|)Xspa8P
***  v1    0.2 CLI RX  106
**** v1    0.2 CLI RX|Message from VCC-compiler:
**** v1    0.2 CLI RX|Security: Privilege proc_setid missing, will not change uid/gid
**** v1    0.2 CLI RX|Variable 'obj.http.x-cache' is read only.
**** v1    0.2 CLI RX|At: ('<vcl.inline>' Line 6 Pos 21)
**** v1    0.2 CLI RX|                set obj.http.x-cache = "hit";
**** v1    0.2 CLI RX|--------------------################---------
**** v1    0.2 CLI RX|
**** v1    0.2 CLI RX|Running VCC-compiler failed, exited with 2
**** v1    0.2 CLI RX|VCL compilation failed
**   v1    0.2 VCL compilation failed (as expected)
***  v1    0.2 Found expected string: ("Variable 'obj.http.x-cache' is read only.")
*    top   0.2 RESETTING after ../../../bin/varnishtest/tests/r00310.vtc
**   v1    0.2 Wait
**** v1    0.2 CLI TX|backend.list
***  v1    0.2 CLI RX  101
**** v1    0.2 CLI RX|Unknown request in manager process (child not running).
**** v1    0.2 CLI RX|Type 'help' for more info.
**   v1    0.2 Stop
**** v1    0.2 CLI TX|stop
***  v1    0.2 CLI RX  300
**** v1    0.2 CLI RX|Child in state stopped
**** v1    0.2 CLI TX|status
***  v1    0.2 CLI RX  200
**** v1    0.2 CLI RX|Child in state stopped
**** v1    0.2 STDOUT poll 0x10
**   v1    0.2 R 91540 Status: 0000 (u 0.009000 s 0.032000)
*    diag  0.0 ............................................................
#    top  TEST ../../../bin/varnishtest/tests/r00310.vtc TIMED OUT (kill -9)
#    top  TEST ../../../bin/varnishtest/tests/r00310.vtc FAILED (60.005) signal=9

1 @ SunOS 5.11 i86pc 1.04 64_gcc4.7 uplex

*    top   0.0 TEST ../../../bin/varnishtest/tests/r00310.vtc starting
[...]
*    top   0.0 TEST Test obj.http.x-cache in vcl_hit
[...]
**** v1    0.1 CLI TX|vcl.inline vcl1 << %XJEIFLH|)Xspa8P
**** v1    0.1 CLI TX|vcl 4.0;
**** v1    0.1 CLI TX|
**** v1    0.1 CLI TX|\tbackend foo { .host = "127.0.0.1"; }
**** v1    0.1 CLI TX|
**** v1    0.1 CLI TX|\tsub vcl_hit {
**** v1    0.1 CLI TX|\t\tset obj.http.x-cache = "hit";
**** v1    0.1 CLI TX|\t}
**** v1    0.1 CLI TX|
**** v1    0.1 CLI TX|%XJEIFLH|)Xspa8P
***  v1    0.1 CLI RX  106
**** v1    0.1 CLI RX|Message from VCC-compiler:
**** v1    0.1 CLI RX|Security: Privilege proc_setid missing, will not change uid/gid
**** v1    0.1 CLI RX|Variable 'obj.http.x-cache' is read only.
**** v1    0.1 CLI RX|At: ('<vcl.inline>' Line 6 Pos 21)
**** v1    0.1 CLI RX|                set obj.http.x-cache = "hit";
**** v1    0.1 CLI RX|--------------------################---------
**** v1    0.1 CLI RX|
**** v1    0.1 CLI RX|Running VCC-compiler failed, exited with 2
**** v1    0.1 CLI RX|VCL compilation failed
**   v1    0.1 VCL compilation failed (as expected)
***  v1    0.1 Found expected string: ("Variable 'obj.http.x-cache' is read only.")
*    top   0.1 RESETTING after ../../../bin/varnishtest/tests/r00310.vtc
**   v1    0.1 Wait
**** v1    0.1 CLI TX|backend.list
***  v1    0.1 CLI RX  101
**** v1    0.1 CLI RX|Unknown request in manager process (child not running).
**** v1    0.1 CLI RX|Type 'help' for more info.
**   v1    0.1 Stop
**** v1    0.1 CLI TX|stop
***  v1    0.1 CLI RX  300
**** v1    0.1 CLI RX|Child in state stopped
**** v1    0.1 CLI TX|status
***  v1    0.1 CLI RX  200
**** v1    0.1 CLI RX|Child in state stopped
**** v1    0.1 STDOUT poll 0x10
**   v1    0.1 R 74625 Status: 0000 (u 0.007000 s 0.023000)
*    diag  0.0 ............................................................
#    top  TEST ../../../bin/varnishtest/tests/r00310.vtc TIMED OUT (kill -9)
#    top  TEST ../../../bin/varnishtest/tests/r00310.vtc FAILED (60.004) signal=9

1 @ SunOS 5.11 i86pc 1.04 32_gcc4.7 uplex

*    top   0.0 TEST ../../../bin/varnishtest/tests/r00310.vtc starting
[...]
*    top   0.0 TEST Test obj.http.x-cache in vcl_hit
[...]
**** v1    0.1 CLI TX|vcl.inline vcl1 << %XJEIFLH|)Xspa8P
**** v1    0.1 CLI TX|vcl 4.0;
**** v1    0.1 CLI TX|
**** v1    0.1 CLI TX|\tbackend foo { .host = "127.0.0.1"; }
**** v1    0.1 CLI TX|
**** v1    0.1 CLI TX|\tsub vcl_hit {
**** v1    0.1 CLI TX|\t\tset obj.http.x-cache = "hit";
**** v1    0.1 CLI TX|\t}
**** v1    0.1 CLI TX|
**** v1    0.1 CLI TX|%XJEIFLH|)Xspa8P
***  v1    0.1 CLI RX  106
**** v1    0.1 CLI RX|Message from VCC-compiler:
**** v1    0.1 CLI RX|Security: Privilege proc_setid missing, will not change uid/gid
**** v1    0.1 CLI RX|Variable 'obj.http.x-cache' is read only.
**** v1    0.1 CLI RX|At: ('<vcl.inline>' Line 6 Pos 21)
**** v1    0.1 CLI RX|                set obj.http.x-cache = "hit";
**** v1    0.1 CLI RX|--------------------################---------
**** v1    0.1 CLI RX|
**** v1    0.1 CLI RX|Running VCC-compiler failed, exited with 2
**** v1    0.1 CLI RX|VCL compilation failed
**   v1    0.1 VCL compilation failed (as expected)
***  v1    0.1 Found expected string: ("Variable 'obj.http.x-cache' is read only.")
*    top   0.1 RESETTING after ../../../bin/varnishtest/tests/r00310.vtc
**   v1    0.1 Wait
**** v1    0.1 CLI TX|backend.list
***  v1    0.1 CLI RX  101
**** v1    0.1 CLI RX|Unknown request in manager process (child not running).
**** v1    0.1 CLI RX|Type 'help' for more info.
**   v1    0.1 Stop
**** v1    0.1 CLI TX|stop
***  v1    0.1 CLI RX  300
**** v1    0.1 CLI RX|Child in state stopped
**** v1    0.1 CLI TX|status
***  v1    0.1 CLI RX  200
**** v1    0.1 CLI RX|Child in state stopped
**** v1    0.1 STDOUT poll 0x10
**   v1    0.1 R 49251 Status: 0000 (u 0.004000 s 0.018000)
*    diag  0.0 ............................................................
#    top  TEST ../../../bin/varnishtest/tests/r00310.vtc TIMED OUT (kill -9)
#    top  TEST ../../../bin/varnishtest/tests/r00310.vtc FAILED (60.002) signal=9

1 @ SunOS 5.11 i86pc 1.04 64_gcc4.7 uplex

*    top   0.0 TEST ../../../bin/varnishtest/tests/r00310.vtc starting
[...]
*    top   0.0 TEST Test obj.http.x-cache in vcl_hit
[...]
**** v1    0.1 CLI TX|vcl.inline vcl1 << %XJEIFLH|)Xspa8P
**** v1    0.1 CLI TX|vcl 4.0;
**** v1    0.1 CLI TX|
**** v1    0.1 CLI TX|\tbackend foo { .host = "127.0.0.1"; }
**** v1    0.1 CLI TX|
**** v1    0.1 CLI TX|\tsub vcl_hit {
**** v1    0.1 CLI TX|\t\tset obj.http.x-cache = "hit";
**** v1    0.1 CLI TX|\t}
**** v1    0.1 CLI TX|
**** v1    0.1 CLI TX|%XJEIFLH|)Xspa8P
***  v1    0.1 CLI RX  106
**** v1    0.1 CLI RX|Message from VCC-compiler:
**** v1    0.1 CLI RX|Security: Privilege proc_setid missing, will not change uid/gid
**** v1    0.1 CLI RX|Variable 'obj.http.x-cache' is read only.
**** v1    0.1 CLI RX|At: ('<vcl.inline>' Line 6 Pos 21)
**** v1    0.1 CLI RX|                set obj.http.x-cache = "hit";
**** v1    0.1 CLI RX|--------------------################---------
**** v1    0.1 CLI RX|
**** v1    0.1 CLI RX|Running VCC-compiler failed, exited with 2
**** v1    0.1 CLI RX|VCL compilation failed
**   v1    0.1 VCL compilation failed (as expected)
***  v1    0.1 Found expected string: ("Variable 'obj.http.x-cache' is read only.")
*    top   0.1 RESETTING after ../../../bin/varnishtest/tests/r00310.vtc
**   v1    0.1 Wait
**** v1    0.1 CLI TX|backend.list
***  v1    0.1 CLI RX  101
**** v1    0.1 CLI RX|Unknown request in manager process (child not running).
**** v1    0.1 CLI RX|Type 'help' for more info.
**   v1    0.1 Stop
**** v1    0.1 CLI TX|stop
***  v1    0.1 CLI RX  300
**** v1    0.1 CLI RX|Child in state stopped
**** v1    0.1 CLI TX|status
***  v1    0.1 CLI RX  200
**** v1    0.1 CLI RX|Child in state stopped
**** v1    0.1 STDOUT poll 0x10
**   v1    0.1 R 34205 Status: 0000 (u 0.007000 s 0.022000)
*    diag  0.0 ............................................................
#    top  TEST ../../../bin/varnishtest/tests/r00310.vtc TIMED OUT (kill -9)
#    top  TEST ../../../bin/varnishtest/tests/r00310.vtc FAILED (60.004) signal=9

1 @ Linux 3.10.0 x86_64 1.02 mblissett

*    top   0.0 TEST ../../../bin/varnishtest/tests/r00310.vtc starting
[...]
*    top   0.0 TEST Test obj.http.x-cache in vcl_hit
[...]
**** v1    0.1 CLI RX|Type 'start' to launch worker process.
**** v1    0.1 CLI TX|vcl.inline vcl1 << %XJEIFLH|)Xspa8P
**** v1    0.1 CLI TX|vcl 4.0;
**** v1    0.1 CLI TX|
**** v1    0.1 CLI TX|\tbackend foo { .host = "127.0.0.1"; }
**** v1    0.1 CLI TX|
**** v1    0.1 CLI TX|\tsub vcl_hit {
**** v1    0.1 CLI TX|\t\tset obj.http.x-cache = "hit";
**** v1    0.1 CLI TX|\t}
**** v1    0.1 CLI TX|
**** v1    0.1 CLI TX|%XJEIFLH|)Xspa8P
***  v1    0.1 CLI RX  106
**** v1    0.1 CLI RX|Message from VCC-compiler:
**** v1    0.1 CLI RX|Variable 'obj.http.x-cache' is read only.
**** v1    0.1 CLI RX|At: ('<vcl.inline>' Line 6 Pos 21)
**** v1    0.1 CLI RX|                set obj.http.x-cache = "hit";
**** v1    0.1 CLI RX|--------------------################---------
**** v1    0.1 CLI RX|
**** v1    0.1 CLI RX|Running VCC-compiler failed, exited with 2
**** v1    0.1 CLI RX|VCL compilation failed
**   v1    0.1 VCL compilation failed (as expected)
***  v1    0.1 Found expected string: ("Variable 'obj.http.x-cache' is read only.")
*    top   0.1 RESETTING after ../../../bin/varnishtest/tests/r00310.vtc
**   v1    0.1 Wait
**** v1    0.1 CLI TX|backend.list
***  v1    0.2 CLI RX  101
**** v1    0.2 CLI RX|Unknown request in manager process (child not running).
**** v1    0.2 CLI RX|Type 'help' for more info.
**   v1    0.2 Stop
**** v1    0.2 CLI TX|stop
***  v1    0.2 CLI RX  300
**** v1    0.2 CLI RX|Child in state stopped
**** v1    0.2 CLI TX|status
***  v1    0.2 CLI RX  200
**** v1    0.2 CLI RX|Child in state stopped
**** v1    0.2 STDOUT poll 0x10
**   v1    0.2 R 6491 Status: 0000 (u 0.004457 s 0.015529)
*    diag  0.0 ............................................................
#    top  TEST ../../../bin/varnishtest/tests/r00310.vtc TIMED OUT (kill -9)
#    top  TEST ../../../bin/varnishtest/tests/r00310.vtc FAILED (60.001) signal=9

1 @ SunOS 5.11 i86pc 1.04 64_gcc4.7 uplex

*    top   0.0 TEST ../../../bin/varnishtest/tests/r00310.vtc starting
[...]
*    top   0.0 TEST Test obj.http.x-cache in vcl_hit
[...]
**** v1    0.1 CLI TX|vcl.inline vcl1 << %XJEIFLH|)Xspa8P
**** v1    0.1 CLI TX|vcl 4.0;
**** v1    0.1 CLI TX|
**** v1    0.1 CLI TX|\tbackend foo { .host = "127.0.0.1"; }
**** v1    0.1 CLI TX|
**** v1    0.1 CLI TX|\tsub vcl_hit {
**** v1    0.1 CLI TX|\t\tset obj.http.x-cache = "hit";
**** v1    0.1 CLI TX|\t}
**** v1    0.1 CLI TX|
**** v1    0.1 CLI TX|%XJEIFLH|)Xspa8P
***  v1    0.1 CLI RX  106
**** v1    0.1 CLI RX|Message from VCC-compiler:
**** v1    0.1 CLI RX|Security: Privilege proc_setid missing, will not change uid/gid
**** v1    0.1 CLI RX|Variable 'obj.http.x-cache' is read only.
**** v1    0.1 CLI RX|At: ('<vcl.inline>' Line 6 Pos 21)
**** v1    0.1 CLI RX|                set obj.http.x-cache = "hit";
**** v1    0.1 CLI RX|--------------------################---------
**** v1    0.1 CLI RX|
**** v1    0.1 CLI RX|Running VCC-compiler failed, exited with 2
**** v1    0.1 CLI RX|VCL compilation failed
**   v1    0.1 VCL compilation failed (as expected)
***  v1    0.1 Found expected string: ("Variable 'obj.http.x-cache' is read only.")
*    top   0.1 RESETTING after ../../../bin/varnishtest/tests/r00310.vtc
**   v1    0.1 Wait
**** v1    0.1 CLI TX|backend.list
***  v1    0.1 CLI RX  101
**** v1    0.1 CLI RX|Unknown request in manager process (child not running).
**** v1    0.1 CLI RX|Type 'help' for more info.
**   v1    0.1 Stop
**** v1    0.1 CLI TX|stop
***  v1    0.1 CLI RX  300
**** v1    0.1 CLI RX|Child in state stopped
**** v1    0.1 CLI TX|status
***  v1    0.1 CLI RX  200
**** v1    0.1 CLI RX|Child in state stopped
**** v1    0.1 STDOUT poll 0x10
**   v1    0.1 R 42885 Status: 0000 (u 0.007000 s 0.022000)
*    diag  0.0 ............................................................
#    top  TEST ../../../bin/varnishtest/tests/r00310.vtc TIMED OUT (kill -9)
#    top  TEST ../../../bin/varnishtest/tests/r00310.vtc FAILED (60.003) signal=9

1 @ SunOS 5.11 i86pc 1.04 64_sun12.4 uplex

*    top   0.0 TEST ../../../bin/varnishtest/tests/r00310.vtc starting
[...]
*    top   0.0 TEST Test obj.http.x-cache in vcl_hit
[...]
**** v1    0.1 CLI TX|vcl.inline vcl1 << %XJEIFLH|)Xspa8P
**** v1    0.1 CLI TX|vcl 4.0;
**** v1    0.1 CLI TX|
**** v1    0.1 CLI TX|\tbackend foo { .host = "127.0.0.1"; }
**** v1    0.1 CLI TX|
**** v1    0.1 CLI TX|\tsub vcl_hit {
**** v1    0.1 CLI TX|\t\tset obj.http.x-cache = "hit";
**** v1    0.1 CLI TX|\t}
**** v1    0.1 CLI TX|
**** v1    0.1 CLI TX|%XJEIFLH|)Xspa8P
***  v1    0.1 CLI RX  106
**** v1    0.1 CLI RX|Message from VCC-compiler:
**** v1    0.1 CLI RX|Security: Privilege proc_setid missing, will not change uid/gid
**** v1    0.1 CLI RX|Variable 'obj.http.x-cache' is read only.
**** v1    0.1 CLI RX|At: ('<vcl.inline>' Line 6 Pos 21)
**** v1    0.1 CLI RX|                set obj.http.x-cache = "hit";
**** v1    0.1 CLI RX|--------------------################---------
**** v1    0.1 CLI RX|
**** v1    0.1 CLI RX|Running VCC-compiler failed, exited with 2
**** v1    0.1 CLI RX|VCL compilation failed
**   v1    0.1 VCL compilation failed (as expected)
***  v1    0.1 Found expected string: ("Variable 'obj.http.x-cache' is read only.")
*    top   0.1 RESETTING after ../../../bin/varnishtest/tests/r00310.vtc
**   v1    0.1 Wait
**** v1    0.1 CLI TX|backend.list
***  v1    0.1 CLI RX  101
**** v1    0.1 CLI RX|Unknown request in manager process (child not running).
**** v1    0.1 CLI RX|Type 'help' for more info.
**   v1    0.1 Stop
**** v1    0.1 CLI TX|stop
***  v1    0.1 CLI RX  300
**** v1    0.1 CLI RX|Child in state stopped
**** v1    0.1 CLI TX|status
***  v1    0.1 CLI RX  200
**** v1    0.1 CLI RX|Child in state stopped
**** v1    0.1 STDOUT poll 0x10
**   v1    0.1 R 78373 Status: 0000 (u 0.006000 s 0.022000)
*    diag  0.0 ............................................................
#    top  TEST ../../../bin/varnishtest/tests/r00310.vtc TIMED OUT (kill -9)
#    top  TEST ../../../bin/varnishtest/tests/r00310.vtc FAILED (60.004) signal=9

1 @ SunOS 5.11 i86pc 1.04 64_sun12.4 uplex

*    top   0.0 TEST ../../../bin/varnishtest/tests/r00310.vtc starting
[...]
*    top   0.0 TEST Test obj.http.x-cache in vcl_hit
[...]
**** v1    0.1 CLI TX|vcl.inline vcl1 << %XJEIFLH|)Xspa8P
**** v1    0.1 CLI TX|vcl 4.0;
**** v1    0.1 CLI TX|
**** v1    0.1 CLI TX|\tbackend foo { .host = "127.0.0.1"; }
**** v1    0.1 CLI TX|
**** v1    0.1 CLI TX|\tsub vcl_hit {
**** v1    0.1 CLI TX|\t\tset obj.http.x-cache = "hit";
**** v1    0.1 CLI TX|\t}
**** v1    0.1 CLI TX|
**** v1    0.1 CLI TX|%XJEIFLH|)Xspa8P
***  v1    0.2 CLI RX  106
**** v1    0.2 CLI RX|Message from VCC-compiler:
**** v1    0.2 CLI RX|Security: Privilege proc_setid missing, will not change uid/gid
**** v1    0.2 CLI RX|Variable 'obj.http.x-cache' is read only.
**** v1    0.2 CLI RX|At: ('<vcl.inline>' Line 6 Pos 21)
**** v1    0.2 CLI RX|                set obj.http.x-cache = "hit";
**** v1    0.2 CLI RX|--------------------################---------
**** v1    0.2 CLI RX|
**** v1    0.2 CLI RX|Running VCC-compiler failed, exited with 2
**** v1    0.2 CLI RX|VCL compilation failed
**   v1    0.2 VCL compilation failed (as expected)
***  v1    0.2 Found expected string: ("Variable 'obj.http.x-cache' is read only.")
*    top   0.2 RESETTING after ../../../bin/varnishtest/tests/r00310.vtc
**   v1    0.2 Wait
**** v1    0.2 CLI TX|backend.list
***  v1    0.2 CLI RX  101
**** v1    0.2 CLI RX|Unknown request in manager process (child not running).
**** v1    0.2 CLI RX|Type 'help' for more info.
**   v1    0.2 Stop
**** v1    0.2 CLI TX|stop
***  v1    0.2 CLI RX  300
**** v1    0.2 CLI RX|Child in state stopped
**** v1    0.2 CLI TX|status
***  v1    0.2 CLI RX  200
**** v1    0.2 CLI RX|Child in state stopped
**** v1    0.2 STDOUT poll 0x10
**   v1    0.2 R 4099 Status: 0000 (u 0.008000 s 0.027000)
*    diag  0.0 ............................................................
#    top  TEST ../../../bin/varnishtest/tests/r00310.vtc TIMED OUT (kill -9)
#    top  TEST ../../../bin/varnishtest/tests/r00310.vtc FAILED (60.005) signal=9

1 @ SunOS 5.11 i86pc 1.04 32_sun12.4 uplex

*    top   0.0 TEST ../../../bin/varnishtest/tests/r00310.vtc starting
[...]
*    top   0.0 TEST Test obj.http.x-cache in vcl_hit
[...]
**** v1    0.1 CLI TX|vcl.inline vcl1 << %XJEIFLH|)Xspa8P
**** v1    0.1 CLI TX|vcl 4.0;
**** v1    0.1 CLI TX|
**** v1    0.1 CLI TX|\tbackend foo { .host = "127.0.0.1"; }
**** v1    0.1 CLI TX|
**** v1    0.1 CLI TX|\tsub vcl_hit {
**** v1    0.1 CLI TX|\t\tset obj.http.x-cache = "hit";
**** v1    0.1 CLI TX|\t}
**** v1    0.1 CLI TX|
**** v1    0.1 CLI TX|%XJEIFLH|)Xspa8P
***  v1    0.1 CLI RX  106
**** v1    0.1 CLI RX|Message from VCC-compiler:
**** v1    0.1 CLI RX|Security: Privilege proc_setid missing, will not change uid/gid
**** v1    0.1 CLI RX|Variable 'obj.http.x-cache' is read only.
**** v1    0.1 CLI RX|At: ('<vcl.inline>' Line 6 Pos 21)
**** v1    0.1 CLI RX|                set obj.http.x-cache = "hit";
**** v1    0.1 CLI RX|--------------------################---------
**** v1    0.1 CLI RX|
**** v1    0.1 CLI RX|Running VCC-compiler failed, exited with 2
**** v1    0.1 CLI RX|VCL compilation failed
**   v1    0.1 VCL compilation failed (as expected)
***  v1    0.1 Found expected string: ("Variable 'obj.http.x-cache' is read only.")
*    top   0.1 RESETTING after ../../../bin/varnishtest/tests/r00310.vtc
**   v1    0.1 Wait
**** v1    0.1 CLI TX|backend.list
***  v1    0.1 CLI RX  101
**** v1    0.1 CLI RX|Unknown request in manager process (child not running).
**** v1    0.1 CLI RX|Type 'help' for more info.
**   v1    0.1 Stop
**** v1    0.1 CLI TX|stop
***  v1    0.1 CLI RX  300
**** v1    0.1 CLI RX|Child in state stopped
**** v1    0.1 CLI TX|status
***  v1    0.1 CLI RX  200
**** v1    0.1 CLI RX|Child in state stopped
**** v1    0.1 STDOUT poll 0x10
**   v1    0.1 R 87317 Status: 0000 (u 0.004000 s 0.017000)
*    diag  0.0 ............................................................
#    top  TEST ../../../bin/varnishtest/tests/r00310.vtc TIMED OUT (kill -9)
#    top  TEST ../../../bin/varnishtest/tests/r00310.vtc FAILED (60.002) signal=9

1 @ SunOS 5.11 i86pc 1.04 32_gcc4.7 uplex

*    top   0.0 TEST ../../../bin/varnishtest/tests/r00310.vtc starting
[...]
*    top   0.0 TEST Test obj.http.x-cache in vcl_hit
[...]
**** v1    0.1 CLI TX|vcl.inline vcl1 << %XJEIFLH|)Xspa8P
**** v1    0.1 CLI TX|vcl 4.0;
**** v1    0.1 CLI TX|
**** v1    0.1 CLI TX|\tbackend foo { .host = "127.0.0.1"; }
**** v1    0.1 CLI TX|
**** v1    0.1 CLI TX|\tsub vcl_hit {
**** v1    0.1 CLI TX|\t\tset obj.http.x-cache = "hit";
**** v1    0.1 CLI TX|\t}
**** v1    0.1 CLI TX|
**** v1    0.1 CLI TX|%XJEIFLH|)Xspa8P
***  v1    0.1 CLI RX  106
**** v1    0.1 CLI RX|Message from VCC-compiler:
**** v1    0.1 CLI RX|Security: Privilege proc_setid missing, will not change uid/gid
**** v1    0.1 CLI RX|Variable 'obj.http.x-cache' is read only.
**** v1    0.1 CLI RX|At: ('<vcl.inline>' Line 6 Pos 21)
**** v1    0.1 CLI RX|                set obj.http.x-cache = "hit";
**** v1    0.1 CLI RX|--------------------################---------
**** v1    0.1 CLI RX|
**** v1    0.1 CLI RX|Running VCC-compiler failed, exited with 2
**** v1    0.1 CLI RX|VCL compilation failed
**   v1    0.1 VCL compilation failed (as expected)
***  v1    0.1 Found expected string: ("Variable 'obj.http.x-cache' is read only.")
*    top   0.1 RESETTING after ../../../bin/varnishtest/tests/r00310.vtc
**   v1    0.1 Wait
**** v1    0.1 CLI TX|backend.list
***  v1    0.1 CLI RX  101
**** v1    0.1 CLI RX|Unknown request in manager process (child not running).
**** v1    0.1 CLI RX|Type 'help' for more info.
**   v1    0.1 Stop
**** v1    0.1 CLI TX|stop
***  v1    0.1 CLI RX  300
**** v1    0.1 CLI RX|Child in state stopped
**** v1    0.1 CLI TX|status
***  v1    0.1 CLI RX  200
**** v1    0.1 CLI RX|Child in state stopped
**** v1    0.1 STDOUT poll 0x10
**   v1    0.1 R 5652 Status: 0000 (u 0.004000 s 0.017000)
*    diag  0.0 ............................................................
#    top  TEST ../../../bin/varnishtest/tests/r00310.vtc TIMED OUT (kill -9)
#    top  TEST ../../../bin/varnishtest/tests/r00310.vtc FAILED (60.002) signal=9

1 @ SunOS 5.11 i86pc 1.04 64_gcc4.7 uplex

*    top   0.0 TEST ../../../bin/varnishtest/tests/r00310.vtc starting
[...]
*    top   0.0 TEST Test obj.http.x-cache in vcl_hit
[...]
**** v1    0.1 CLI TX|vcl.inline vcl1 << %XJEIFLH|)Xspa8P
**** v1    0.1 CLI TX|vcl 4.0;
**** v1    0.1 CLI TX|
**** v1    0.1 CLI TX|\tbackend foo { .host = "127.0.0.1"; }
**** v1    0.1 CLI TX|
**** v1    0.1 CLI TX|\tsub vcl_hit {
**** v1    0.1 CLI TX|\t\tset obj.http.x-cache = "hit";
**** v1    0.1 CLI TX|\t}
**** v1    0.1 CLI TX|
**** v1    0.1 CLI TX|%XJEIFLH|)Xspa8P
***  v1    0.1 CLI RX  106
**** v1    0.1 CLI RX|Message from VCC-compiler:
**** v1    0.1 CLI RX|Security: Privilege proc_setid missing, will not change uid/gid
**** v1    0.1 CLI RX|Variable 'obj.http.x-cache' is read only.
**** v1    0.1 CLI RX|At: ('<vcl.inline>' Line 6 Pos 21)
**** v1    0.1 CLI RX|                set obj.http.x-cache = "hit";
**** v1    0.1 CLI RX|--------------------################---------
**** v1    0.1 CLI RX|
**** v1    0.1 CLI RX|Running VCC-compiler failed, exited with 2
**** v1    0.1 CLI RX|VCL compilation failed
**   v1    0.1 VCL compilation failed (as expected)
***  v1    0.1 Found expected string: ("Variable 'obj.http.x-cache' is read only.")
*    top   0.1 RESETTING after ../../../bin/varnishtest/tests/r00310.vtc
**   v1    0.1 Wait
**** v1    0.1 CLI TX|backend.list
***  v1    0.1 CLI RX  101
**** v1    0.1 CLI RX|Unknown request in manager process (child not running).
**** v1    0.1 CLI RX|Type 'help' for more info.
**   v1    0.1 Stop
**** v1    0.1 CLI TX|stop
***  v1    0.1 CLI RX  300
**** v1    0.1 CLI RX|Child in state stopped
**** v1    0.1 CLI TX|status
***  v1    0.1 CLI RX  200
**** v1    0.1 CLI RX|Child in state stopped
**** v1    0.1 STDOUT poll 0x10
**   v1    0.1 R 87302 Status: 0000 (u 0.007000 s 0.024000)
*    diag  0.0 ............................................................
#    top  TEST ../../../bin/varnishtest/tests/r00310.vtc TIMED OUT (kill -9)
#    top  TEST ../../../bin/varnishtest/tests/r00310.vtc FAILED (60.004) signal=9

1 @ Ubuntu LTS i686 1.04 fgs

*    top   0.0 TEST ../../../bin/varnishtest/tests/r00310.vtc starting
[...]
*    top   0.0 TEST Test obj.http.x-cache in vcl_hit
[...]
**** v1    0.1 CLI RX|Type 'start' to launch worker process.
**** v1    0.1 CLI TX|vcl.inline vcl1 << %XJEIFLH|)Xspa8P
**** v1    0.1 CLI TX|vcl 4.0;
**** v1    0.1 CLI TX|
**** v1    0.1 CLI TX|\tbackend foo { .host = "127.0.0.1"; }
**** v1    0.1 CLI TX|
**** v1    0.1 CLI TX|\tsub vcl_hit {
**** v1    0.1 CLI TX|\t\tset obj.http.x-cache = "hit";
**** v1    0.1 CLI TX|\t}
**** v1    0.1 CLI TX|
**** v1    0.1 CLI TX|%XJEIFLH|)Xspa8P
***  v1    0.1 CLI RX  106
**** v1    0.1 CLI RX|Message from VCC-compiler:
**** v1    0.1 CLI RX|Variable 'obj.http.x-cache' is read only.
**** v1    0.1 CLI RX|At: ('<vcl.inline>' Line 6 Pos 21)
**** v1    0.1 CLI RX|                set obj.http.x-cache = "hit";
**** v1    0.1 CLI RX|--------------------################---------
**** v1    0.1 CLI RX|
**** v1    0.1 CLI RX|Running VCC-compiler failed, exited with 2
**** v1    0.1 CLI RX|VCL compilation failed
**   v1    0.1 VCL compilation failed (as expected)
***  v1    0.1 Found expected string: ("Variable 'obj.http.x-cache' is read only.")
*    top   0.1 RESETTING after ../../../bin/varnishtest/tests/r00310.vtc
**   v1    0.1 Wait
**** v1    0.1 CLI TX|backend.list
***  v1    0.2 CLI RX  101
**** v1    0.2 CLI RX|Unknown request in manager process (child not running).
**** v1    0.2 CLI RX|Type 'help' for more info.
**   v1    0.2 Stop
**** v1    0.2 CLI TX|stop
***  v1    0.2 CLI RX  300
**** v1    0.2 CLI RX|Child in state stopped
**** v1    0.2 CLI TX|status
***  v1    0.2 CLI RX  200
**** v1    0.2 CLI RX|Child in state stopped
**** v1    0.2 STDOUT poll 0x10
**   v1    0.2 R 23926 Status: 0000 (u 0.000000 s 0.004000)
*    diag  0.0 ............................................................
#    top  TEST ../../../bin/varnishtest/tests/r00310.vtc TIMED OUT (kill -9)
#    top  TEST ../../../bin/varnishtest/tests/r00310.vtc FAILED (60.001) signal=9

1 @ SunOS 5.11 i86pc 1.04 64_sun12.4 uplex

*    top   0.0 TEST ../../../bin/varnishtest/tests/r00310.vtc starting
[...]
*    top   0.0 TEST Test obj.http.x-cache in vcl_hit
[...]
**** v1    0.1 CLI TX|vcl.inline vcl1 << %XJEIFLH|)Xspa8P
**** v1    0.1 CLI TX|vcl 4.0;
**** v1    0.1 CLI TX|
**** v1    0.1 CLI TX|\tbackend foo { .host = "127.0.0.1"; }
**** v1    0.1 CLI TX|
**** v1    0.1 CLI TX|\tsub vcl_hit {
**** v1    0.1 CLI TX|\t\tset obj.http.x-cache = "hit";
**** v1    0.1 CLI TX|\t}
**** v1    0.1 CLI TX|
**** v1    0.1 CLI TX|%XJEIFLH|)Xspa8P
***  v1    0.1 CLI RX  106
**** v1    0.1 CLI RX|Message from VCC-compiler:
**** v1    0.1 CLI RX|Security: Privilege proc_setid missing, will not change uid/gid
**** v1    0.1 CLI RX|Variable 'obj.http.x-cache' is read only.
**** v1    0.1 CLI RX|At: ('<vcl.inline>' Line 6 Pos 21)
**** v1    0.1 CLI RX|                set obj.http.x-cache = "hit";
**** v1    0.1 CLI RX|--------------------################---------
**** v1    0.1 CLI RX|
**** v1    0.1 CLI RX|Running VCC-compiler failed, exited with 2
**** v1    0.1 CLI RX|VCL compilation failed
**   v1    0.1 VCL compilation failed (as expected)
***  v1    0.1 Found expected string: ("Variable 'obj.http.x-cache' is read only.")
*    top   0.1 RESETTING after ../../../bin/varnishtest/tests/r00310.vtc
**   v1    0.1 Wait
**** v1    0.1 CLI TX|backend.list
***  v1    0.1 CLI RX  101
**** v1    0.1 CLI RX|Unknown request in manager process (child not running).
**** v1    0.1 CLI RX|Type 'help' for more info.
**   v1    0.1 Stop
**** v1    0.1 CLI TX|stop
***  v1    0.1 CLI RX  300
**** v1    0.1 CLI RX|Child in state stopped
**** v1    0.1 CLI TX|status
***  v1    0.1 CLI RX  200
**** v1    0.1 CLI RX|Child in state stopped
**** v1    0.1 STDOUT poll 0x10
**   v1    0.1 R 6642 Status: 0000 (u 0.008000 s 0.029000)
*    diag  0.0 ............................................................
#    top  TEST ../../../bin/varnishtest/tests/r00310.vtc TIMED OUT (kill -9)
#    top  TEST ../../../bin/varnishtest/tests/r00310.vtc FAILED (60.004) signal=9

1 @ Linux 3.10.0 x86_64 1.02 mblissett

*    top   0.0 TEST ../../../bin/varnishtest/tests/r00310.vtc starting
[...]
*    top   0.0 TEST Test obj.http.x-cache in vcl_hit
[...]
**** v1    0.1 CLI RX|Type 'start' to launch worker process.
**** v1    0.1 CLI TX|vcl.inline vcl1 << %XJEIFLH|)Xspa8P
**** v1    0.1 CLI TX|vcl 4.0;
**** v1    0.1 CLI TX|
**** v1    0.1 CLI TX|\tbackend foo { .host = "127.0.0.1"; }
**** v1    0.1 CLI TX|
**** v1    0.1 CLI TX|\tsub vcl_hit {
**** v1    0.1 CLI TX|\t\tset obj.http.x-cache = "hit";
**** v1    0.1 CLI TX|\t}
**** v1    0.1 CLI TX|
**** v1    0.1 CLI TX|%XJEIFLH|)Xspa8P
***  v1    0.1 CLI RX  106
**** v1    0.1 CLI RX|Message from VCC-compiler:
**** v1    0.1 CLI RX|Variable 'obj.http.x-cache' is read only.
**** v1    0.1 CLI RX|At: ('<vcl.inline>' Line 6 Pos 21)
**** v1    0.1 CLI RX|                set obj.http.x-cache = "hit";
**** v1    0.1 CLI RX|--------------------################---------
**** v1    0.1 CLI RX|
**** v1    0.1 CLI RX|Running VCC-compiler failed, exited with 2
**** v1    0.1 CLI RX|VCL compilation failed
**   v1    0.1 VCL compilation failed (as expected)
***  v1    0.1 Found expected string: ("Variable 'obj.http.x-cache' is read only.")
*    top   0.1 RESETTING after ../../../bin/varnishtest/tests/r00310.vtc
**   v1    0.1 Wait
**** v1    0.1 CLI TX|backend.list
***  v1    0.2 CLI RX  101
**** v1    0.2 CLI RX|Unknown request in manager process (child not running).
**** v1    0.2 CLI RX|Type 'help' for more info.
**   v1    0.2 Stop
**** v1    0.2 CLI TX|stop
***  v1    0.2 CLI RX  300
**** v1    0.2 CLI RX|Child in state stopped
**** v1    0.2 CLI TX|status
***  v1    0.2 CLI RX  200
**** v1    0.2 CLI RX|Child in state stopped
**** v1    0.2 STDOUT poll 0x10
**   v1    0.2 R 13631 Status: 0000 (u 0.001018 s 0.017573)
*    diag  0.0 ............................................................
#    top  TEST ../../../bin/varnishtest/tests/r00310.vtc TIMED OUT (kill -9)
#    top  TEST ../../../bin/varnishtest/tests/r00310.vtc FAILED (60.001) signal=9

1 @ SunOS 5.11 i86pc 1.04 64_gcc4.7 uplex

*    top   0.0 TEST ../../../bin/varnishtest/tests/r00310.vtc starting
[...]
*    top   0.0 TEST Test obj.http.x-cache in vcl_hit
[...]
**** v1    0.1 CLI TX|vcl.inline vcl1 << %XJEIFLH|)Xspa8P
**** v1    0.1 CLI TX|vcl 4.0;
**** v1    0.1 CLI TX|
**** v1    0.1 CLI TX|\tbackend foo { .host = "127.0.0.1"; }
**** v1    0.1 CLI TX|
**** v1    0.1 CLI TX|\tsub vcl_hit {
**** v1    0.1 CLI TX|\t\tset obj.http.x-cache = "hit";
**** v1    0.1 CLI TX|\t}
**** v1    0.1 CLI TX|
**** v1    0.1 CLI TX|%XJEIFLH|)Xspa8P
***  v1    0.2 CLI RX  106
**** v1    0.2 CLI RX|Message from VCC-compiler:
**** v1    0.2 CLI RX|Security: Privilege proc_setid missing, will not change uid/gid
**** v1    0.2 CLI RX|Variable 'obj.http.x-cache' is read only.
**** v1    0.2 CLI RX|At: ('<vcl.inline>' Line 6 Pos 21)
**** v1    0.2 CLI RX|                set obj.http.x-cache = "hit";
**** v1    0.2 CLI RX|--------------------################---------
**** v1    0.2 CLI RX|
**** v1    0.2 CLI RX|Running VCC-compiler failed, exited with 2
**** v1    0.2 CLI RX|VCL compilation failed
**   v1    0.2 VCL compilation failed (as expected)
***  v1    0.2 Found expected string: ("Variable 'obj.http.x-cache' is read only.")
*    top   0.2 RESETTING after ../../../bin/varnishtest/tests/r00310.vtc
**   v1    0.2 Wait
**** v1    0.2 CLI TX|backend.list
***  v1    0.2 CLI RX  101
**** v1    0.2 CLI RX|Unknown request in manager process (child not running).
**** v1    0.2 CLI RX|Type 'help' for more info.
**   v1    0.2 Stop
**** v1    0.2 CLI TX|stop
***  v1    0.2 CLI RX  300
**** v1    0.2 CLI RX|Child in state stopped
**** v1    0.2 CLI TX|status
***  v1    0.2 CLI RX  200
**** v1    0.2 CLI RX|Child in state stopped
**** v1    0.2 STDOUT poll 0x10
**   v1    0.2 R 62371 Status: 0000 (u 0.008000 s 0.030000)
*    diag  0.0 ............................................................
#    top  TEST ../../../bin/varnishtest/tests/r00310.vtc TIMED OUT (kill -9)
#    top  TEST ../../../bin/varnishtest/tests/r00310.vtc FAILED (60.005) signal=9

1 @ Ubuntu LTS i686 1.04 fgs

*    top   0.0 TEST ../../../bin/varnishtest/tests/r00310.vtc starting
[...]
*    top   0.0 TEST Test obj.http.x-cache in vcl_hit
[...]
**** v1    0.1 CLI RX|Type 'start' to launch worker process.
**** v1    0.1 CLI TX|vcl.inline vcl1 << %XJEIFLH|)Xspa8P
**** v1    0.1 CLI TX|vcl 4.0;
**** v1    0.1 CLI TX|
**** v1    0.1 CLI TX|\tbackend foo { .host = "127.0.0.1"; }
**** v1    0.1 CLI TX|
**** v1    0.1 CLI TX|\tsub vcl_hit {
**** v1    0.1 CLI TX|\t\tset obj.http.x-cache = "hit";
**** v1    0.1 CLI TX|\t}
**** v1    0.1 CLI TX|
**** v1    0.1 CLI TX|%XJEIFLH|)Xspa8P
***  v1    0.1 CLI RX  106
**** v1    0.1 CLI RX|Message from VCC-compiler:
**** v1    0.1 CLI RX|Variable 'obj.http.x-cache' is read only.
**** v1    0.1 CLI RX|At: ('<vcl.inline>' Line 6 Pos 21)
**** v1    0.1 CLI RX|                set obj.http.x-cache = "hit";
**** v1    0.1 CLI RX|--------------------################---------
**** v1    0.1 CLI RX|
**** v1    0.1 CLI RX|Running VCC-compiler failed, exited with 2
**** v1    0.1 CLI RX|VCL compilation failed
**   v1    0.1 VCL compilation failed (as expected)
***  v1    0.1 Found expected string: ("Variable 'obj.http.x-cache' is read only.")
*    top   0.1 RESETTING after ../../../bin/varnishtest/tests/r00310.vtc
**   v1    0.1 Wait
**** v1    0.1 CLI TX|backend.list
***  v1    0.1 CLI RX  101
**** v1    0.1 CLI RX|Unknown request in manager process (child not running).
**** v1    0.1 CLI RX|Type 'help' for more info.
**   v1    0.1 Stop
**** v1    0.1 CLI TX|stop
***  v1    0.2 CLI RX  300
**** v1    0.2 CLI RX|Child in state stopped
**** v1    0.2 CLI TX|status
***  v1    0.2 CLI RX  200
**** v1    0.2 CLI RX|Child in state stopped
**** v1    0.2 STDOUT poll 0x10
**   v1    0.2 R 2806 Status: 0000 (u 0.000000 s 0.004000)
*    diag  0.0 ............................................................
#    top  TEST ../../../bin/varnishtest/tests/r00310.vtc TIMED OUT (kill -9)
#    top  TEST ../../../bin/varnishtest/tests/r00310.vtc FAILED (60.001) signal=9

1 @ SunOS 5.11 i86pc 1.04 32_gcc4.7 uplex

*    top   0.0 TEST ../../../bin/varnishtest/tests/r00310.vtc starting
[...]
*    top   0.0 TEST Test obj.http.x-cache in vcl_hit
[...]
**** v1    0.1 CLI TX|vcl.inline vcl1 << %XJEIFLH|)Xspa8P
**** v1    0.1 CLI TX|vcl 4.0;
**** v1    0.1 CLI TX|
**** v1    0.1 CLI TX|\tbackend foo { .host = "127.0.0.1"; }
**** v1    0.1 CLI TX|
**** v1    0.1 CLI TX|\tsub vcl_hit {
**** v1    0.1 CLI TX|\t\tset obj.http.x-cache = "hit";
**** v1    0.1 CLI TX|\t}
**** v1    0.1 CLI TX|
**** v1    0.1 CLI TX|%XJEIFLH|)Xspa8P
***  v1    0.1 CLI RX  106
**** v1    0.1 CLI RX|Message from VCC-compiler:
**** v1    0.1 CLI RX|Security: Privilege proc_setid missing, will not change uid/gid
**** v1    0.1 CLI RX|Variable 'obj.http.x-cache' is read only.
**** v1    0.1 CLI RX|At: ('<vcl.inline>' Line 6 Pos 21)
**** v1    0.1 CLI RX|                set obj.http.x-cache = "hit";
**** v1    0.1 CLI RX|--------------------################---------
**** v1    0.1 CLI RX|
**** v1    0.1 CLI RX|Running VCC-compiler failed, exited with 2
**** v1    0.1 CLI RX|VCL compilation failed
**   v1    0.1 VCL compilation failed (as expected)
***  v1    0.1 Found expected string: ("Variable 'obj.http.x-cache' is read only.")
*    top   0.1 RESETTING after ../../../bin/varnishtest/tests/r00310.vtc
**   v1    0.1 Wait
**** v1    0.1 CLI TX|backend.list
***  v1    0.1 CLI RX  101
**** v1    0.1 CLI RX|Unknown request in manager process (child not running).
**** v1    0.1 CLI RX|Type 'help' for more info.
**   v1    0.1 Stop
**** v1    0.1 CLI TX|stop
***  v1    0.1 CLI RX  300
**** v1    0.1 CLI RX|Child in state stopped
**** v1    0.1 CLI TX|status
***  v1    0.1 CLI RX  200
**** v1    0.1 CLI RX|Child in state stopped
**** v1    0.1 STDOUT poll 0x10
**   v1    0.1 R 25769 Status: 0000 (u 0.004000 s 0.016000)
*    diag  0.0 ............................................................
#    top  TEST ../../../bin/varnishtest/tests/r00310.vtc TIMED OUT (kill -9)
#    top  TEST ../../../bin/varnishtest/tests/r00310.vtc FAILED (60.002) signal=9

1 @ SunOS 5.11 i86pc 1.04 64_gcc4.7 uplex

*    top   0.0 TEST ../../../bin/varnishtest/tests/r00310.vtc starting
[...]
*    top   0.0 TEST Test obj.http.x-cache in vcl_hit
[...]
**** v1    0.1 CLI TX|vcl.inline vcl1 << %XJEIFLH|)Xspa8P
**** v1    0.1 CLI TX|vcl 4.0;
**** v1    0.1 CLI TX|
**** v1    0.1 CLI TX|\tbackend foo { .host = "127.0.0.1"; }
**** v1    0.1 CLI TX|
**** v1    0.1 CLI TX|\tsub vcl_hit {
**** v1    0.1 CLI TX|\t\tset obj.http.x-cache = "hit";
**** v1    0.1 CLI TX|\t}
**** v1    0.1 CLI TX|
**** v1    0.1 CLI TX|%XJEIFLH|)Xspa8P
***  v1    0.1 CLI RX  106
**** v1    0.1 CLI RX|Message from VCC-compiler:
**** v1    0.1 CLI RX|Security: Privilege proc_setid missing, will not change uid/gid
**** v1    0.1 CLI RX|Variable 'obj.http.x-cache' is read only.
**** v1    0.1 CLI RX|At: ('<vcl.inline>' Line 6 Pos 21)
**** v1    0.1 CLI RX|                set obj.http.x-cache = "hit";
**** v1    0.1 CLI RX|--------------------################---------
**** v1    0.1 CLI RX|
**** v1    0.1 CLI RX|Running VCC-compiler failed, exited with 2
**** v1    0.1 CLI RX|VCL compilation failed
**   v1    0.1 VCL compilation failed (as expected)
***  v1    0.1 Found expected string: ("Variable 'obj.http.x-cache' is read only.")
*    top   0.1 RESETTING after ../../../bin/varnishtest/tests/r00310.vtc
**   v1    0.1 Wait
**** v1    0.1 CLI TX|backend.list
***  v1    0.1 CLI RX  101
**** v1    0.1 CLI RX|Unknown request in manager process (child not running).
**** v1    0.1 CLI RX|Type 'help' for more info.
**   v1    0.1 Stop
**** v1    0.1 CLI TX|stop
***  v1    0.1 CLI RX  300
**** v1    0.1 CLI RX|Child in state stopped
**** v1    0.1 CLI TX|status
***  v1    0.1 CLI RX  200
**** v1    0.1 CLI RX|Child in state stopped
**** v1    0.1 STDOUT poll 0x10
**   v1    0.1 R 10371 Status: 0000 (u 0.007000 s 0.023000)
*    diag  0.0 ............................................................
#    top  TEST ../../../bin/varnishtest/tests/r00310.vtc TIMED OUT (kill -9)
#    top  TEST ../../../bin/varnishtest/tests/r00310.vtc FAILED (60.004) signal=9

1 @ SunOS 5.11 i86pc 1.04 64_sun12.4 uplex

*    top   0.0 TEST ../../../bin/varnishtest/tests/r00310.vtc starting
[...]
*    top   0.0 TEST Test obj.http.x-cache in vcl_hit
[...]
**** v1    0.1 CLI TX|vcl.inline vcl1 << %XJEIFLH|)Xspa8P
**** v1    0.1 CLI TX|vcl 4.0;
**** v1    0.1 CLI TX|
**** v1    0.1 CLI TX|\tbackend foo { .host = "127.0.0.1"; }
**** v1    0.1 CLI TX|
**** v1    0.1 CLI TX|\tsub vcl_hit {
**** v1    0.1 CLI TX|\t\tset obj.http.x-cache = "hit";
**** v1    0.1 CLI TX|\t}
**** v1    0.1 CLI TX|
**** v1    0.1 CLI TX|%XJEIFLH|)Xspa8P
***  v1    0.1 CLI RX  106
**** v1    0.1 CLI RX|Message from VCC-compiler:
**** v1    0.1 CLI RX|Security: Privilege proc_setid missing, will not change uid/gid
**** v1    0.1 CLI RX|Variable 'obj.http.x-cache' is read only.
**** v1    0.1 CLI RX|At: ('<vcl.inline>' Line 6 Pos 21)
**** v1    0.1 CLI RX|                set obj.http.x-cache = "hit";
**** v1    0.1 CLI RX|--------------------################---------
**** v1    0.1 CLI RX|
**** v1    0.1 CLI RX|Running VCC-compiler failed, exited with 2
**** v1    0.1 CLI RX|VCL compilation failed
**   v1    0.1 VCL compilation failed (as expected)
***  v1    0.1 Found expected string: ("Variable 'obj.http.x-cache' is read only.")
*    top   0.1 RESETTING after ../../../bin/varnishtest/tests/r00310.vtc
**   v1    0.1 Wait
**** v1    0.1 CLI TX|backend.list
***  v1    0.1 CLI RX  101
**** v1    0.1 CLI RX|Unknown request in manager process (child not running).
**** v1    0.1 CLI RX|Type 'help' for more info.
**   v1    0.1 Stop
**** v1    0.1 CLI TX|stop
***  v1    0.1 CLI RX  300
**** v1    0.1 CLI RX|Child in state stopped
**** v1    0.1 CLI TX|status
***  v1    0.1 CLI RX  200
**** v1    0.1 CLI RX|Child in state stopped
**** v1    0.1 STDOUT poll 0x10
**   v1    0.1 R 86631 Status: 0000 (u 0.007000 s 0.025000)
*    diag  0.0 ............................................................
#    top  TEST ../../../bin/varnishtest/tests/r00310.vtc TIMED OUT (kill -9)
#    top  TEST ../../../bin/varnishtest/tests/r00310.vtc FAILED (60.005) signal=9

1 @ SunOS 5.11 i86pc 1.04 64_sun12.4 uplex

*    top   0.0 TEST ../../../bin/varnishtest/tests/r00310.vtc starting
[...]
*    top   0.0 TEST Test obj.http.x-cache in vcl_hit
[...]
**** v1    0.1 CLI TX|vcl.inline vcl1 << %XJEIFLH|)Xspa8P
**** v1    0.1 CLI TX|vcl 4.0;
**** v1    0.1 CLI TX|
**** v1    0.1 CLI TX|\tbackend foo { .host = "127.0.0.1"; }
**** v1    0.1 CLI TX|
**** v1    0.1 CLI TX|\tsub vcl_hit {
**** v1    0.1 CLI TX|\t\tset obj.http.x-cache = "hit";
**** v1    0.1 CLI TX|\t}
**** v1    0.1 CLI TX|
**** v1    0.1 CLI TX|%XJEIFLH|)Xspa8P
***  v1    0.1 CLI RX  106
**** v1    0.1 CLI RX|Message from VCC-compiler:
**** v1    0.1 CLI RX|Security: Privilege proc_setid missing, will not change uid/gid
**** v1    0.1 CLI RX|Variable 'obj.http.x-cache' is read only.
**** v1    0.1 CLI RX|At: ('<vcl.inline>' Line 6 Pos 21)
**** v1    0.1 CLI RX|                set obj.http.x-cache = "hit";
**** v1    0.1 CLI RX|--------------------################---------
**** v1    0.1 CLI RX|
**** v1    0.1 CLI RX|Running VCC-compiler failed, exited with 2
**** v1    0.1 CLI RX|VCL compilation failed
**   v1    0.1 VCL compilation failed (as expected)
***  v1    0.1 Found expected string: ("Variable 'obj.http.x-cache' is read only.")
*    top   0.1 RESETTING after ../../../bin/varnishtest/tests/r00310.vtc
**   v1    0.1 Wait
**** v1    0.1 CLI TX|backend.list
***  v1    0.1 CLI RX  101
**** v1    0.1 CLI RX|Unknown request in manager process (child not running).
**** v1    0.1 CLI RX|Type 'help' for more info.
**   v1    0.1 Stop
**** v1    0.1 CLI TX|stop
***  v1    0.1 CLI RX  300
**** v1    0.1 CLI RX|Child in state stopped
**** v1    0.1 CLI TX|status
***  v1    0.1 CLI RX  200
**** v1    0.1 CLI RX|Child in state stopped
**** v1    0.1 STDOUT poll 0x10
**   v1    0.1 R 16543 Status: 0000 (u 0.007000 s 0.024000)
*    diag  0.0 ............................................................
#    top  TEST ../../../bin/varnishtest/tests/r00310.vtc TIMED OUT (kill -9)
#    top  TEST ../../../bin/varnishtest/tests/r00310.vtc FAILED (60.004) signal=9

1 @ SunOS 5.11 i86pc 1.04 64_sun12.4 uplex

*    top   0.0 TEST ../../../bin/varnishtest/tests/r00310.vtc starting
[...]
*    top   0.0 TEST Test obj.http.x-cache in vcl_hit
[...]
**** v1    0.1 CLI TX|vcl.inline vcl1 << %XJEIFLH|)Xspa8P
**** v1    0.1 CLI TX|vcl 4.0;
**** v1    0.1 CLI TX|
**** v1    0.1 CLI TX|\tbackend foo { .host = "127.0.0.1"; }
**** v1    0.1 CLI TX|
**** v1    0.1 CLI TX|\tsub vcl_hit {
**** v1    0.1 CLI TX|\t\tset obj.http.x-cache = "hit";
**** v1    0.1 CLI TX|\t}
**** v1    0.1 CLI TX|
**** v1    0.1 CLI TX|%XJEIFLH|)Xspa8P
***  v1    0.1 CLI RX  106
**** v1    0.1 CLI RX|Message from VCC-compiler:
**** v1    0.1 CLI RX|Security: Privilege proc_setid missing, will not change uid/gid
**** v1    0.1 CLI RX|Variable 'obj.http.x-cache' is read only.
**** v1    0.1 CLI RX|At: ('<vcl.inline>' Line 6 Pos 21)
**** v1    0.1 CLI RX|                set obj.http.x-cache = "hit";
**** v1    0.1 CLI RX|--------------------################---------
**** v1    0.1 CLI RX|
**** v1    0.1 CLI RX|Running VCC-compiler failed, exited with 2
**** v1    0.1 CLI RX|VCL compilation failed
**   v1    0.1 VCL compilation failed (as expected)
***  v1    0.1 Found expected string: ("Variable 'obj.http.x-cache' is read only.")
*    top   0.1 RESETTING after ../../../bin/varnishtest/tests/r00310.vtc
**   v1    0.1 Wait
**** v1    0.1 CLI TX|backend.list
***  v1    0.1 CLI RX  101
**** v1    0.1 CLI RX|Unknown request in manager process (child not running).
**** v1    0.1 CLI RX|Type 'help' for more info.
**   v1    0.1 Stop
**** v1    0.1 CLI TX|stop
***  v1    0.1 CLI RX  300
**** v1    0.1 CLI RX|Child in state stopped
**** v1    0.1 CLI TX|status
***  v1    0.1 CLI RX  200
**** v1    0.1 CLI RX|Child in state stopped
**** v1    0.1 STDOUT poll 0x10
**   v1    0.1 R 56015 Status: 0000 (u 0.007000 s 0.025000)
*    diag  0.0 ............................................................
#    top  TEST ../../../bin/varnishtest/tests/r00310.vtc TIMED OUT (kill -9)
#    top  TEST ../../../bin/varnishtest/tests/r00310.vtc FAILED (60.003) signal=9

1 @ SunOS 5.11 i86pc 1.04 32_sun12.4 uplex

*    top   0.0 TEST ../../../bin/varnishtest/tests/r00310.vtc starting
[...]
*    top   0.0 TEST Test obj.http.x-cache in vcl_hit
[...]
**** v1    0.1 CLI TX|vcl.inline vcl1 << %XJEIFLH|)Xspa8P
**** v1    0.1 CLI TX|vcl 4.0;
**** v1    0.1 CLI TX|
**** v1    0.1 CLI TX|\tbackend foo { .host = "127.0.0.1"; }
**** v1    0.1 CLI TX|
**** v1    0.1 CLI TX|\tsub vcl_hit {
**** v1    0.1 CLI TX|\t\tset obj.http.x-cache = "hit";
**** v1    0.1 CLI TX|\t}
**** v1    0.1 CLI TX|
**** v1    0.1 CLI TX|%XJEIFLH|)Xspa8P
***  v1    0.1 CLI RX  106
**** v1    0.1 CLI RX|Message from VCC-compiler:
**** v1    0.1 CLI RX|Security: Privilege proc_setid missing, will not change uid/gid
**** v1    0.1 CLI RX|Variable 'obj.http.x-cache' is read only.
**** v1    0.1 CLI RX|At: ('<vcl.inline>' Line 6 Pos 21)
**** v1    0.1 CLI RX|                set obj.http.x-cache = "hit";
**** v1    0.1 CLI RX|--------------------################---------
**** v1    0.1 CLI RX|
**** v1    0.1 CLI RX|Running VCC-compiler failed, exited with 2
**** v1    0.1 CLI RX|VCL compilation failed
**   v1    0.1 VCL compilation failed (as expected)
***  v1    0.1 Found expected string: ("Variable 'obj.http.x-cache' is read only.")
*    top   0.1 RESETTING after ../../../bin/varnishtest/tests/r00310.vtc
**   v1    0.1 Wait
**** v1    0.1 CLI TX|backend.list
***  v1    0.1 CLI RX  101
**** v1    0.1 CLI RX|Unknown request in manager process (child not running).
**** v1    0.1 CLI RX|Type 'help' for more info.
**   v1    0.1 Stop
**** v1    0.1 CLI TX|stop
***  v1    0.1 CLI RX  300
**** v1    0.1 CLI RX|Child in state stopped
**** v1    0.1 CLI TX|status
***  v1    0.1 CLI RX  200
**** v1    0.1 CLI RX|Child in state stopped
**** v1    0.1 STDOUT poll 0x10
**   v1    0.1 R 32441 Status: 0000 (u 0.004000 s 0.017000)
*    diag  0.0 ............................................................
#    top  TEST ../../../bin/varnishtest/tests/r00310.vtc TIMED OUT (kill -9)
#    top  TEST ../../../bin/varnishtest/tests/r00310.vtc FAILED (60.002) signal=9

1 @ Ubuntu LTS i686 1.04 fgs

*    top   0.0 TEST ../../../bin/varnishtest/tests/r00310.vtc starting
[...]
*    top   0.0 TEST Test obj.http.x-cache in vcl_hit
[...]
**** v1    0.1 CLI RX|Type 'start' to launch worker process.
**** v1    0.1 CLI TX|vcl.inline vcl1 << %XJEIFLH|)Xspa8P
**** v1    0.1 CLI TX|vcl 4.0;
**** v1    0.1 CLI TX|
**** v1    0.1 CLI TX|\tbackend foo { .host = "127.0.0.1"; }
**** v1    0.1 CLI TX|
**** v1    0.1 CLI TX|\tsub vcl_hit {
**** v1    0.1 CLI TX|\t\tset obj.http.x-cache = "hit";
**** v1    0.1 CLI TX|\t}
**** v1    0.1 CLI TX|
**** v1    0.1 CLI TX|%XJEIFLH|)Xspa8P
***  v1    0.1 CLI RX  106
**** v1    0.1 CLI RX|Message from VCC-compiler:
**** v1    0.1 CLI RX|Variable 'obj.http.x-cache' is read only.
**** v1    0.1 CLI RX|At: ('<vcl.inline>' Line 6 Pos 21)
**** v1    0.1 CLI RX|                set obj.http.x-cache = "hit";
**** v1    0.1 CLI RX|--------------------################---------
**** v1    0.1 CLI RX|
**** v1    0.1 CLI RX|Running VCC-compiler failed, exited with 2
**** v1    0.1 CLI RX|VCL compilation failed
**   v1    0.1 VCL compilation failed (as expected)
***  v1    0.1 Found expected string: ("Variable 'obj.http.x-cache' is read only.")
*    top   0.1 RESETTING after ../../../bin/varnishtest/tests/r00310.vtc
**   v1    0.1 Wait
**** v1    0.1 CLI TX|backend.list
***  v1    0.1 CLI RX  101
**** v1    0.1 CLI RX|Unknown request in manager process (child not running).
**** v1    0.1 CLI RX|Type 'help' for more info.
**   v1    0.1 Stop
**** v1    0.1 CLI TX|stop
***  v1    0.2 CLI RX  300
**** v1    0.2 CLI RX|Child in state stopped
**** v1    0.2 CLI TX|status
***  v1    0.2 CLI RX  200
**** v1    0.2 CLI RX|Child in state stopped
**** v1    0.2 STDOUT poll 0x10
**   v1    0.2 R 8815 Status: 0000 (u 0.004000 s 0.000000)
*    diag  0.0 ............................................................
#    top  TEST ../../../bin/varnishtest/tests/r00310.vtc TIMED OUT (kill -9)
#    top  TEST ../../../bin/varnishtest/tests/r00310.vtc FAILED (60.001) signal=9

1 @ SunOS 5.11 i86pc 1.04 32_gcc4.7 uplex

*    top   0.0 TEST ../../../bin/varnishtest/tests/r00310.vtc starting
[...]
*    top   0.0 TEST Test obj.http.x-cache in vcl_hit
[...]
**** v1    0.1 CLI TX|vcl.inline vcl1 << %XJEIFLH|)Xspa8P
**** v1    0.1 CLI TX|vcl 4.0;
**** v1    0.1 CLI TX|
**** v1    0.1 CLI TX|\tbackend foo { .host = "127.0.0.1"; }
**** v1    0.1 CLI TX|
**** v1    0.1 CLI TX|\tsub vcl_hit {
**** v1    0.1 CLI TX|\t\tset obj.http.x-cache = "hit";
**** v1    0.1 CLI TX|\t}
**** v1    0.1 CLI TX|
**** v1    0.1 CLI TX|%XJEIFLH|)Xspa8P
***  v1    0.1 CLI RX  106
**** v1    0.1 CLI RX|Message from VCC-compiler:
**** v1    0.1 CLI RX|Security: Privilege proc_setid missing, will not change uid/gid
**** v1    0.1 CLI RX|Variable 'obj.http.x-cache' is read only.
**** v1    0.1 CLI RX|At: ('<vcl.inline>' Line 6 Pos 21)
**** v1    0.1 CLI RX|                set obj.http.x-cache = "hit";
**** v1    0.1 CLI RX|--------------------################---------
**** v1    0.1 CLI RX|
**** v1    0.1 CLI RX|Running VCC-compiler failed, exited with 2
**** v1    0.1 CLI RX|VCL compilation failed
**   v1    0.1 VCL compilation failed (as expected)
***  v1    0.1 Found expected string: ("Variable 'obj.http.x-cache' is read only.")
*    top   0.1 RESETTING after ../../../bin/varnishtest/tests/r00310.vtc
**   v1    0.1 Wait
**** v1    0.1 CLI TX|backend.list
***  v1    0.1 CLI RX  101
**** v1    0.1 CLI RX|Unknown request in manager process (child not running).
**** v1    0.1 CLI RX|Type 'help' for more info.
**   v1    0.1 Stop
**** v1    0.1 CLI TX|stop
***  v1    0.1 CLI RX  300
**** v1    0.1 CLI RX|Child in state stopped
**** v1    0.1 CLI TX|status
***  v1    0.1 CLI RX  200
**** v1    0.1 CLI RX|Child in state stopped
**** v1    0.1 STDOUT poll 0x10
**   v1    0.1 R 79060 Status: 0000 (u 0.004000 s 0.016000)
*    diag  0.0 ............................................................
#    top  TEST ../../../bin/varnishtest/tests/r00310.vtc TIMED OUT (kill -9)
#    top  TEST ../../../bin/varnishtest/tests/r00310.vtc FAILED (60.002) signal=9

1 @ Ubuntu LTS i686 1.04 fgs

*    top   0.0 TEST ../../../bin/varnishtest/tests/r00310.vtc starting
[...]
*    top   0.0 TEST Test obj.http.x-cache in vcl_hit
[...]
**** v1    0.1 CLI RX|Type 'start' to launch worker process.
**** v1    0.1 CLI TX|vcl.inline vcl1 << %XJEIFLH|)Xspa8P
**** v1    0.1 CLI TX|vcl 4.0;
**** v1    0.1 CLI TX|
**** v1    0.1 CLI TX|\tbackend foo { .host = "127.0.0.1"; }
**** v1    0.1 CLI TX|
**** v1    0.1 CLI TX|\tsub vcl_hit {
**** v1    0.1 CLI TX|\t\tset obj.http.x-cache = "hit";
**** v1    0.1 CLI TX|\t}
**** v1    0.1 CLI TX|
**** v1    0.1 CLI TX|%XJEIFLH|)Xspa8P
***  v1    0.1 CLI RX  106
**** v1    0.1 CLI RX|Message from VCC-compiler:
**** v1    0.1 CLI RX|Variable 'obj.http.x-cache' is read only.
**** v1    0.1 CLI RX|At: ('<vcl.inline>' Line 6 Pos 21)
**** v1    0.1 CLI RX|                set obj.http.x-cache = "hit";
**** v1    0.1 CLI RX|--------------------################---------
**** v1    0.1 CLI RX|
**** v1    0.1 CLI RX|Running VCC-compiler failed, exited with 2
**** v1    0.1 CLI RX|VCL compilation failed
**   v1    0.1 VCL compilation failed (as expected)
***  v1    0.1 Found expected string: ("Variable 'obj.http.x-cache' is read only.")
*    top   0.1 RESETTING after ../../../bin/varnishtest/tests/r00310.vtc
**   v1    0.1 Wait
**** v1    0.1 CLI TX|backend.list
***  v1    0.1 CLI RX  101
**** v1    0.1 CLI RX|Unknown request in manager process (child not running).
**** v1    0.1 CLI RX|Type 'help' for more info.
**   v1    0.1 Stop
**** v1    0.1 CLI TX|stop
***  v1    0.2 CLI RX  300
**** v1    0.2 CLI RX|Child in state stopped
**** v1    0.2 CLI TX|status
***  v1    0.2 CLI RX  200
**** v1    0.2 CLI RX|Child in state stopped
**** v1    0.2 STDOUT poll 0x10
**   v1    0.2 R 3860 Status: 0000 (u 0.000000 s 0.004000)
*    diag  0.0 ............................................................
#    top  TEST ../../../bin/varnishtest/tests/r00310.vtc TIMED OUT (kill -9)
#    top  TEST ../../../bin/varnishtest/tests/r00310.vtc FAILED (60.001) signal=9

1 @ Ubuntu LTS i686 1.04 fgs

*    top   0.0 TEST ../../../bin/varnishtest/tests/r00310.vtc starting
[...]
*    top   0.0 TEST Test obj.http.x-cache in vcl_hit
[...]
**** v1    0.1 CLI RX|Type 'start' to launch worker process.
**** v1    0.1 CLI TX|vcl.inline vcl1 << %XJEIFLH|)Xspa8P
**** v1    0.1 CLI TX|vcl 4.0;
**** v1    0.1 CLI TX|
**** v1    0.1 CLI TX|\tbackend foo { .host = "127.0.0.1"; }
**** v1    0.1 CLI TX|
**** v1    0.1 CLI TX|\tsub vcl_hit {
**** v1    0.1 CLI TX|\t\tset obj.http.x-cache = "hit";
**** v1    0.1 CLI TX|\t}
**** v1    0.1 CLI TX|
**** v1    0.1 CLI TX|%XJEIFLH|)Xspa8P
***  v1    0.1 CLI RX  106
**** v1    0.1 CLI RX|Message from VCC-compiler:
**** v1    0.1 CLI RX|Variable 'obj.http.x-cache' is read only.
**** v1    0.1 CLI RX|At: ('<vcl.inline>' Line 6 Pos 21)
**** v1    0.1 CLI RX|                set obj.http.x-cache = "hit";
**** v1    0.1 CLI RX|--------------------################---------
**** v1    0.1 CLI RX|
**** v1    0.1 CLI RX|Running VCC-compiler failed, exited with 2
**** v1    0.1 CLI RX|VCL compilation failed
**   v1    0.1 VCL compilation failed (as expected)
***  v1    0.1 Found expected string: ("Variable 'obj.http.x-cache' is read only.")
*    top   0.1 RESETTING after ../../../bin/varnishtest/tests/r00310.vtc
**   v1    0.1 Wait
**** v1    0.1 CLI TX|backend.list
***  v1    0.2 CLI RX  101
**** v1    0.2 CLI RX|Unknown request in manager process (child not running).
**** v1    0.2 CLI RX|Type 'help' for more info.
**   v1    0.2 Stop
**** v1    0.2 CLI TX|stop
***  v1    0.2 CLI RX  300
**** v1    0.2 CLI RX|Child in state stopped
**** v1    0.2 CLI TX|status
***  v1    0.2 CLI RX  200
**** v1    0.2 CLI RX|Child in state stopped
**** v1    0.2 STDOUT poll 0x10
**   v1    0.2 R 5793 Status: 0000 (u 0.008000 s 0.000000)
*    diag  0.0 ............................................................
#    top  TEST ../../../bin/varnishtest/tests/r00310.vtc TIMED OUT (kill -9)
#    top  TEST ../../../bin/varnishtest/tests/r00310.vtc FAILED (60.001) signal=9

1 @ SunOS 5.11 i86pc 1.04 64_gcc4.7 uplex

*    top   0.0 TEST ../../../bin/varnishtest/tests/r00310.vtc starting
[...]
*    top   0.0 TEST Test obj.http.x-cache in vcl_hit
[...]
**** v1    0.1 CLI TX|vcl.inline vcl1 << %XJEIFLH|)Xspa8P
**** v1    0.1 CLI TX|vcl 4.0;
**** v1    0.1 CLI TX|
**** v1    0.1 CLI TX|\tbackend foo { .host = "127.0.0.1"; }
**** v1    0.1 CLI TX|
**** v1    0.1 CLI TX|\tsub vcl_hit {
**** v1    0.1 CLI TX|\t\tset obj.http.x-cache = "hit";
**** v1    0.1 CLI TX|\t}
**** v1    0.1 CLI TX|
**** v1    0.1 CLI TX|%XJEIFLH|)Xspa8P
***  v1    0.2 CLI RX  106
**** v1    0.2 CLI RX|Message from VCC-compiler:
**** v1    0.2 CLI RX|Security: Privilege proc_setid missing, will not change uid/gid
**** v1    0.2 CLI RX|Variable 'obj.http.x-cache' is read only.
**** v1    0.2 CLI RX|At: ('<vcl.inline>' Line 6 Pos 21)
**** v1    0.2 CLI RX|                set obj.http.x-cache = "hit";
**** v1    0.2 CLI RX|--------------------################---------
**** v1    0.2 CLI RX|
**** v1    0.2 CLI RX|Running VCC-compiler failed, exited with 2
**** v1    0.2 CLI RX|VCL compilation failed
**   v1    0.2 VCL compilation failed (as expected)
***  v1    0.2 Found expected string: ("Variable 'obj.http.x-cache' is read only.")
*    top   0.2 RESETTING after ../../../bin/varnishtest/tests/r00310.vtc
**   v1    0.2 Wait
**** v1    0.2 CLI TX|backend.list
***  v1    0.2 CLI RX  101
**** v1    0.2 CLI RX|Unknown request in manager process (child not running).
**** v1    0.2 CLI RX|Type 'help' for more info.
**   v1    0.2 Stop
**** v1    0.2 CLI TX|stop
***  v1    0.2 CLI RX  300
**** v1    0.2 CLI RX|Child in state stopped
**** v1    0.2 CLI TX|status
***  v1    0.2 CLI RX  200
**** v1    0.2 CLI RX|Child in state stopped
**** v1    0.2 STDOUT poll 0x10
**   v1    0.2 R 55861 Status: 0000 (u 0.009000 s 0.031000)
*    diag  0.0 ............................................................
#    top  TEST ../../../bin/varnishtest/tests/r00310.vtc TIMED OUT (kill -9)
#    top  TEST ../../../bin/varnishtest/tests/r00310.vtc FAILED (60.006) signal=9

1 @ SunOS 5.11 i86pc 1.04 64_gcc4.7 uplex

*    top   0.0 TEST ../../../bin/varnishtest/tests/r00310.vtc starting
[...]
*    top   0.0 TEST Test obj.http.x-cache in vcl_hit
[...]
**** v1    0.1 CLI TX|vcl.inline vcl1 << %XJEIFLH|)Xspa8P
**** v1    0.1 CLI TX|vcl 4.0;
**** v1    0.1 CLI TX|
**** v1    0.1 CLI TX|\tbackend foo { .host = "127.0.0.1"; }
**** v1    0.1 CLI TX|
**** v1    0.1 CLI TX|\tsub vcl_hit {
**** v1    0.1 CLI TX|\t\tset obj.http.x-cache = "hit";
**** v1    0.1 CLI TX|\t}
**** v1    0.1 CLI TX|
**** v1    0.1 CLI TX|%XJEIFLH|)Xspa8P
***  v1    0.1 CLI RX  106
**** v1    0.1 CLI RX|Message from VCC-compiler:
**** v1    0.1 CLI RX|Security: Privilege proc_setid missing, will not change uid/gid
**** v1    0.1 CLI RX|Variable 'obj.http.x-cache' is read only.
**** v1    0.1 CLI RX|At: ('<vcl.inline>' Line 6 Pos 21)
**** v1    0.1 CLI RX|                set obj.http.x-cache = "hit";
**** v1    0.1 CLI RX|--------------------################---------
**** v1    0.1 CLI RX|
**** v1    0.1 CLI RX|Running VCC-compiler failed, exited with 2
**** v1    0.1 CLI RX|VCL compilation failed
**   v1    0.1 VCL compilation failed (as expected)
***  v1    0.1 Found expected string: ("Variable 'obj.http.x-cache' is read only.")
*    top   0.1 RESETTING after ../../../bin/varnishtest/tests/r00310.vtc
**   v1    0.1 Wait
**** v1    0.1 CLI TX|backend.list
***  v1    0.1 CLI RX  101
**** v1    0.1 CLI RX|Unknown request in manager process (child not running).
**** v1    0.1 CLI RX|Type 'help' for more info.
**   v1    0.1 Stop
**** v1    0.1 CLI TX|stop
***  v1    0.1 CLI RX  300
**** v1    0.1 CLI RX|Child in state stopped
**** v1    0.1 CLI TX|status
***  v1    0.1 CLI RX  200
**** v1    0.1 CLI RX|Child in state stopped
**** v1    0.1 STDOUT poll 0x10
**   v1    0.1 R 25649 Status: 0000 (u 0.007000 s 0.023000)
*    diag  0.0 ............................................................
#    top  TEST ../../../bin/varnishtest/tests/r00310.vtc TIMED OUT (kill -9)
#    top  TEST ../../../bin/varnishtest/tests/r00310.vtc FAILED (60.004) signal=9

1 @ SunOS 5.11 i86pc 1.04 64_gcc4.7 uplex

*    top   0.0 TEST ../../../bin/varnishtest/tests/r00310.vtc starting
[...]
*    top   0.0 TEST Test obj.http.x-cache in vcl_hit
[...]
**** v1    0.1 CLI TX|vcl.inline vcl1 << %XJEIFLH|)Xspa8P
**** v1    0.1 CLI TX|vcl 4.0;
**** v1    0.1 CLI TX|
**** v1    0.1 CLI TX|\tbackend foo { .host = "127.0.0.1"; }
**** v1    0.1 CLI TX|
**** v1    0.1 CLI TX|\tsub vcl_hit {
**** v1    0.1 CLI TX|\t\tset obj.http.x-cache = "hit";
**** v1    0.1 CLI TX|\t}
**** v1    0.1 CLI TX|
**** v1    0.1 CLI TX|%XJEIFLH|)Xspa8P
***  v1    0.1 CLI RX  106
**** v1    0.1 CLI RX|Message from VCC-compiler:
**** v1    0.1 CLI RX|Security: Privilege proc_setid missing, will not change uid/gid
**** v1    0.1 CLI RX|Variable 'obj.http.x-cache' is read only.
**** v1    0.1 CLI RX|At: ('<vcl.inline>' Line 6 Pos 21)
**** v1    0.1 CLI RX|                set obj.http.x-cache = "hit";
**** v1    0.1 CLI RX|--------------------################---------
**** v1    0.1 CLI RX|
**** v1    0.1 CLI RX|Running VCC-compiler failed, exited with 2
**** v1    0.1 CLI RX|VCL compilation failed
**   v1    0.1 VCL compilation failed (as expected)
***  v1    0.1 Found expected string: ("Variable 'obj.http.x-cache' is read only.")
*    top   0.1 RESETTING after ../../../bin/varnishtest/tests/r00310.vtc
**   v1    0.1 Wait
**** v1    0.1 CLI TX|backend.list
***  v1    0.1 CLI RX  101
**** v1    0.1 CLI RX|Unknown request in manager process (child not running).
**** v1    0.1 CLI RX|Type 'help' for more info.
**   v1    0.1 Stop
**** v1    0.1 CLI TX|stop
***  v1    0.1 CLI RX  300
**** v1    0.1 CLI RX|Child in state stopped
**** v1    0.1 CLI TX|status
***  v1    0.1 CLI RX  200
**** v1    0.1 CLI RX|Child in state stopped
**** v1    0.1 STDOUT poll 0x10
**   v1    0.1 R 32972 Status: 0000 (u 0.006000 s 0.022000)
*    diag  0.0 ............................................................
#    top  TEST ../../../bin/varnishtest/tests/r00310.vtc TIMED OUT (kill -9)
#    top  TEST ../../../bin/varnishtest/tests/r00310.vtc FAILED (60.004) signal=9

1 @ SunOS 5.11 i86pc 1.04 64_sun12.4 uplex

*    top   0.0 TEST ../../../bin/varnishtest/tests/r00310.vtc starting
[...]
*    top   0.0 TEST Test obj.http.x-cache in vcl_hit
[...]
**** v1    0.2 CLI TX|vcl.inline vcl1 << %XJEIFLH|)Xspa8P
**** v1    0.2 CLI TX|vcl 4.0;
**** v1    0.2 CLI TX|
**** v1    0.2 CLI TX|\tbackend foo { .host = "127.0.0.1"; }
**** v1    0.2 CLI TX|
**** v1    0.2 CLI TX|\tsub vcl_hit {
**** v1    0.2 CLI TX|\t\tset obj.http.x-cache = "hit";
**** v1    0.2 CLI TX|\t}
**** v1    0.2 CLI TX|
**** v1    0.2 CLI TX|%XJEIFLH|)Xspa8P
***  v1    0.2 CLI RX  106
**** v1    0.2 CLI RX|Message from VCC-compiler:
**** v1    0.2 CLI RX|Security: Privilege proc_setid missing, will not change uid/gid
**** v1    0.2 CLI RX|Variable 'obj.http.x-cache' is read only.
**** v1    0.2 CLI RX|At: ('<vcl.inline>' Line 6 Pos 21)
**** v1    0.2 CLI RX|                set obj.http.x-cache = "hit";
**** v1    0.2 CLI RX|--------------------################---------
**** v1    0.2 CLI RX|
**** v1    0.2 CLI RX|Running VCC-compiler failed, exited with 2
**** v1    0.2 CLI RX|VCL compilation failed
**   v1    0.2 VCL compilation failed (as expected)
***  v1    0.2 Found expected string: ("Variable 'obj.http.x-cache' is read only.")
*    top   0.2 RESETTING after ../../../bin/varnishtest/tests/r00310.vtc
**   v1    0.2 Wait
**** v1    0.2 CLI TX|backend.list
***  v1    0.2 CLI RX  101
**** v1    0.2 CLI RX|Unknown request in manager process (child not running).
**** v1    0.2 CLI RX|Type 'help' for more info.
**   v1    0.2 Stop
**** v1    0.2 CLI TX|stop
***  v1    0.2 CLI RX  300
**** v1    0.2 CLI RX|Child in state stopped
**** v1    0.2 CLI TX|status
***  v1    0.2 CLI RX  200
**** v1    0.2 CLI RX|Child in state stopped
**** v1    0.2 STDOUT poll 0x10
**   v1    0.2 R 15515 Status: 0000 (u 0.010000 s 0.035000)
*    diag  0.0 ............................................................
#    top  TEST ../../../bin/varnishtest/tests/r00310.vtc TIMED OUT (kill -9)
#    top  TEST ../../../bin/varnishtest/tests/r00310.vtc FAILED (60.006) signal=9

1 @ SunOS 5.11 i86pc 1.04 64_gcc4.7 uplex

*    top   0.0 TEST ../../../bin/varnishtest/tests/r00310.vtc starting
[...]
*    top   0.0 TEST Test obj.http.x-cache in vcl_hit
[...]
**** v1    0.1 CLI TX|vcl.inline vcl1 << %XJEIFLH|)Xspa8P
**** v1    0.1 CLI TX|vcl 4.0;
**** v1    0.1 CLI TX|
**** v1    0.1 CLI TX|\tbackend foo { .host = "127.0.0.1"; }
**** v1    0.1 CLI TX|
**** v1    0.1 CLI TX|\tsub vcl_hit {
**** v1    0.1 CLI TX|\t\tset obj.http.x-cache = "hit";
**** v1    0.1 CLI TX|\t}
**** v1    0.1 CLI TX|
**** v1    0.1 CLI TX|%XJEIFLH|)Xspa8P
***  v1    0.1 CLI RX  106
**** v1    0.1 CLI RX|Message from VCC-compiler:
**** v1    0.1 CLI RX|Security: Privilege proc_setid missing, will not change uid/gid
**** v1    0.1 CLI RX|Variable 'obj.http.x-cache' is read only.
**** v1    0.1 CLI RX|At: ('<vcl.inline>' Line 6 Pos 21)
**** v1    0.1 CLI RX|                set obj.http.x-cache = "hit";
**** v1    0.1 CLI RX|--------------------################---------
**** v1    0.1 CLI RX|
**** v1    0.1 CLI RX|Running VCC-compiler failed, exited with 2
**** v1    0.1 CLI RX|VCL compilation failed
**   v1    0.1 VCL compilation failed (as expected)
***  v1    0.1 Found expected string: ("Variable 'obj.http.x-cache' is read only.")
*    top   0.1 RESETTING after ../../../bin/varnishtest/tests/r00310.vtc
**   v1    0.1 Wait
**** v1    0.1 CLI TX|backend.list
***  v1    0.1 CLI RX  101
**** v1    0.1 CLI RX|Unknown request in manager process (child not running).
**** v1    0.1 CLI RX|Type 'help' for more info.
**   v1    0.1 Stop
**** v1    0.1 CLI TX|stop
***  v1    0.1 CLI RX  300
**** v1    0.1 CLI RX|Child in state stopped
**** v1    0.1 CLI TX|status
***  v1    0.1 CLI RX  200
**** v1    0.1 CLI RX|Child in state stopped
**** v1    0.1 STDOUT poll 0x10
**   v1    0.1 R 13879 Status: 0000 (u 0.007000 s 0.023000)
*    diag  0.0 ............................................................
#    top  TEST ../../../bin/varnishtest/tests/r00310.vtc TIMED OUT (kill -9)
#    top  TEST ../../../bin/varnishtest/tests/r00310.vtc FAILED (60.004) signal=9

1 @ SunOS 5.11 i86pc 1.04 32_gcc4.7 uplex

*    top   0.0 TEST ../../../bin/varnishtest/tests/r00310.vtc starting
[...]
*    top   0.0 TEST Test obj.http.x-cache in vcl_hit
[...]
**** v1    0.1 CLI TX|vcl.inline vcl1 << %XJEIFLH|)Xspa8P
**** v1    0.1 CLI TX|vcl 4.0;
**** v1    0.1 CLI TX|
**** v1    0.1 CLI TX|\tbackend foo { .host = "127.0.0.1"; }
**** v1    0.1 CLI TX|
**** v1    0.1 CLI TX|\tsub vcl_hit {
**** v1    0.1 CLI TX|\t\tset obj.http.x-cache = "hit";
**** v1    0.1 CLI TX|\t}
**** v1    0.1 CLI TX|
**** v1    0.1 CLI TX|%XJEIFLH|)Xspa8P
***  v1    0.1 CLI RX  106
**** v1    0.1 CLI RX|Message from VCC-compiler:
**** v1    0.1 CLI RX|Security: Privilege proc_setid missing, will not change uid/gid
**** v1    0.1 CLI RX|Variable 'obj.http.x-cache' is read only.
**** v1    0.1 CLI RX|At: ('<vcl.inline>' Line 6 Pos 21)
**** v1    0.1 CLI RX|                set obj.http.x-cache = "hit";
**** v1    0.1 CLI RX|--------------------################---------
**** v1    0.1 CLI RX|
**** v1    0.1 CLI RX|Running VCC-compiler failed, exited with 2
**** v1    0.1 CLI RX|VCL compilation failed
**   v1    0.1 VCL compilation failed (as expected)
***  v1    0.1 Found expected string: ("Variable 'obj.http.x-cache' is read only.")
*    top   0.1 RESETTING after ../../../bin/varnishtest/tests/r00310.vtc
**   v1    0.1 Wait
**** v1    0.1 CLI TX|backend.list
***  v1    0.1 CLI RX  101
**** v1    0.1 CLI RX|Unknown request in manager process (child not running).
**** v1    0.1 CLI RX|Type 'help' for more info.
**   v1    0.1 Stop
**** v1    0.1 CLI TX|stop
***  v1    0.1 CLI RX  300
**** v1    0.1 CLI RX|Child in state stopped
**** v1    0.1 CLI TX|status
***  v1    0.1 CLI RX  200
**** v1    0.1 CLI RX|Child in state stopped
**** v1    0.1 STDOUT poll 0x10
**   v1    0.1 R 47650 Status: 0000 (u 0.005000 s 0.019000)
*    diag  0.0 ............................................................
#    top  TEST ../../../bin/varnishtest/tests/r00310.vtc TIMED OUT (kill -9)
#    top  TEST ../../../bin/varnishtest/tests/r00310.vtc FAILED (60.002) signal=9

1 @ SunOS 5.11 i86pc 1.04 64_gcc4.7 uplex

*    top   0.0 TEST ../../../bin/varnishtest/tests/r00310.vtc starting
[...]
*    top   0.0 TEST Test obj.http.x-cache in vcl_hit
[...]
**** v1    0.1 CLI TX|vcl.inline vcl1 << %XJEIFLH|)Xspa8P
**** v1    0.1 CLI TX|vcl 4.0;
**** v1    0.1 CLI TX|
**** v1    0.1 CLI TX|\tbackend foo { .host = "127.0.0.1"; }
**** v1    0.1 CLI TX|
**** v1    0.1 CLI TX|\tsub vcl_hit {
**** v1    0.1 CLI TX|\t\tset obj.http.x-cache = "hit";
**** v1    0.1 CLI TX|\t}
**** v1    0.1 CLI TX|
**** v1    0.1 CLI TX|%XJEIFLH|)Xspa8P
***  v1    0.1 CLI RX  106
**** v1    0.1 CLI RX|Message from VCC-compiler:
**** v1    0.1 CLI RX|Security: Privilege proc_setid missing, will not change uid/gid
**** v1    0.1 CLI RX|Variable 'obj.http.x-cache' is read only.
**** v1    0.1 CLI RX|At: ('<vcl.inline>' Line 6 Pos 21)
**** v1    0.1 CLI RX|                set obj.http.x-cache = "hit";
**** v1    0.1 CLI RX|--------------------################---------
**** v1    0.1 CLI RX|
**** v1    0.1 CLI RX|Running VCC-compiler failed, exited with 2
**** v1    0.1 CLI RX|VCL compilation failed
**   v1    0.1 VCL compilation failed (as expected)
***  v1    0.1 Found expected string: ("Variable 'obj.http.x-cache' is read only.")
*    top   0.1 RESETTING after ../../../bin/varnishtest/tests/r00310.vtc
**   v1    0.1 Wait
**** v1    0.1 CLI TX|backend.list
***  v1    0.1 CLI RX  101
**** v1    0.1 CLI RX|Unknown request in manager process (child not running).
**** v1    0.1 CLI RX|Type 'help' for more info.
**   v1    0.1 Stop
**** v1    0.1 CLI TX|stop
***  v1    0.1 CLI RX  300
**** v1    0.1 CLI RX|Child in state stopped
**** v1    0.1 CLI TX|status
***  v1    0.1 CLI RX  200
**** v1    0.1 CLI RX|Child in state stopped
**** v1    0.1 STDOUT poll 0x10
**   v1    0.1 R 87924 Status: 0000 (u 0.007000 s 0.024000)
*    diag  0.0 ............................................................
#    top  TEST ../../../bin/varnishtest/tests/r00310.vtc TIMED OUT (kill -9)
#    top  TEST ../../../bin/varnishtest/tests/r00310.vtc FAILED (60.004) signal=9

1 @ Ubuntu LTS i686 1.04 fgs

*    top   0.0 TEST ../../../bin/varnishtest/tests/r00310.vtc starting
[...]
*    top   0.0 TEST Test obj.http.x-cache in vcl_hit
[...]
**** v1    0.1 CLI RX|Type 'start' to launch worker process.
**** v1    0.1 CLI TX|vcl.inline vcl1 << %XJEIFLH|)Xspa8P
**** v1    0.1 CLI TX|vcl 4.0;
**** v1    0.1 CLI TX|
**** v1    0.1 CLI TX|\tbackend foo { .host = "127.0.0.1"; }
**** v1    0.1 CLI TX|
**** v1    0.1 CLI TX|\tsub vcl_hit {
**** v1    0.1 CLI TX|\t\tset obj.http.x-cache = "hit";
**** v1    0.1 CLI TX|\t}
**** v1    0.1 CLI TX|
**** v1    0.1 CLI TX|%XJEIFLH|)Xspa8P
***  v1    0.1 CLI RX  106
**** v1    0.1 CLI RX|Message from VCC-compiler:
**** v1    0.1 CLI RX|Variable 'obj.http.x-cache' is read only.
**** v1    0.1 CLI RX|At: ('<vcl.inline>' Line 6 Pos 21)
**** v1    0.1 CLI RX|                set obj.http.x-cache = "hit";
**** v1    0.1 CLI RX|--------------------################---------
**** v1    0.1 CLI RX|
**** v1    0.1 CLI RX|Running VCC-compiler failed, exited with 2
**** v1    0.1 CLI RX|VCL compilation failed
**   v1    0.1 VCL compilation failed (as expected)
***  v1    0.1 Found expected string: ("Variable 'obj.http.x-cache' is read only.")
*    top   0.1 RESETTING after ../../../bin/varnishtest/tests/r00310.vtc
**   v1    0.1 Wait
**** v1    0.1 CLI TX|backend.list
***  v1    0.1 CLI RX  101
**** v1    0.1 CLI RX|Unknown request in manager process (child not running).
**** v1    0.1 CLI RX|Type 'help' for more info.
**   v1    0.1 Stop
**** v1    0.1 CLI TX|stop
***  v1    0.2 CLI RX  300
**** v1    0.2 CLI RX|Child in state stopped
**** v1    0.2 CLI TX|status
***  v1    0.2 CLI RX  200
**** v1    0.2 CLI RX|Child in state stopped
**** v1    0.2 STDOUT poll 0x10
**   v1    0.2 R 17629 Status: 0000 (u 0.004000 s 0.004000)
*    diag  0.0 ............................................................
#    top  TEST ../../../bin/varnishtest/tests/r00310.vtc TIMED OUT (kill -9)
#    top  TEST ../../../bin/varnishtest/tests/r00310.vtc FAILED (60.001) signal=9

1 @ Ubuntu LTS i686 1.04 fgs

*    top   0.0 TEST ../../../bin/varnishtest/tests/r00310.vtc starting
[...]
*    top   0.0 TEST Test obj.http.x-cache in vcl_hit
[...]
**** v1    0.1 CLI RX|Type 'start' to launch worker process.
**** v1    0.1 CLI TX|vcl.inline vcl1 << %XJEIFLH|)Xspa8P
**** v1    0.1 CLI TX|vcl 4.0;
**** v1    0.1 CLI TX|
**** v1    0.1 CLI TX|\tbackend foo { .host = "127.0.0.1"; }
**** v1    0.1 CLI TX|
**** v1    0.1 CLI TX|\tsub vcl_hit {
**** v1    0.1 CLI TX|\t\tset obj.http.x-cache = "hit";
**** v1    0.1 CLI TX|\t}
**** v1    0.1 CLI TX|
**** v1    0.1 CLI TX|%XJEIFLH|)Xspa8P
***  v1    0.1 CLI RX  106
**** v1    0.1 CLI RX|Message from VCC-compiler:
**** v1    0.1 CLI RX|Variable 'obj.http.x-cache' is read only.
**** v1    0.1 CLI RX|At: ('<vcl.inline>' Line 6 Pos 21)
**** v1    0.1 CLI RX|                set obj.http.x-cache = "hit";
**** v1    0.1 CLI RX|--------------------################---------
**** v1    0.1 CLI RX|
**** v1    0.1 CLI RX|Running VCC-compiler failed, exited with 2
**** v1    0.1 CLI RX|VCL compilation failed
**   v1    0.1 VCL compilation failed (as expected)
***  v1    0.1 Found expected string: ("Variable 'obj.http.x-cache' is read only.")
*    top   0.1 RESETTING after ../../../bin/varnishtest/tests/r00310.vtc
**   v1    0.1 Wait
**** v1    0.1 CLI TX|backend.list
***  v1    0.1 CLI RX  101
**** v1    0.1 CLI RX|Unknown request in manager process (child not running).
**** v1    0.1 CLI RX|Type 'help' for more info.
**   v1    0.1 Stop
**** v1    0.1 CLI TX|stop
***  v1    0.2 CLI RX  300
**** v1    0.2 CLI RX|Child in state stopped
**** v1    0.2 CLI TX|status
***  v1    0.2 CLI RX  200
**** v1    0.2 CLI RX|Child in state stopped
**** v1    0.2 STDOUT poll 0x10
**   v1    0.2 R 11731 Status: 0000 (u 0.000000 s 0.004000)
*    diag  0.0 ............................................................
#    top  TEST ../../../bin/varnishtest/tests/r00310.vtc TIMED OUT (kill -9)
#    top  TEST ../../../bin/varnishtest/tests/r00310.vtc FAILED (60.002) signal=9

1 @ SunOS 5.11 i86pc 1.04 32_gcc4.7 uplex

*    top   0.0 TEST ../../../bin/varnishtest/tests/r00310.vtc starting
[...]
*    top   0.0 TEST Test obj.http.x-cache in vcl_hit
[...]
**** v1    0.1 CLI TX|vcl.inline vcl1 << %XJEIFLH|)Xspa8P
**** v1    0.1 CLI TX|vcl 4.0;
**** v1    0.1 CLI TX|
**** v1    0.1 CLI TX|\tbackend foo { .host = "127.0.0.1"; }
**** v1    0.1 CLI TX|
**** v1    0.1 CLI TX|\tsub vcl_hit {
**** v1    0.1 CLI TX|\t\tset obj.http.x-cache = "hit";
**** v1    0.1 CLI TX|\t}
**** v1    0.1 CLI TX|
**** v1    0.1 CLI TX|%XJEIFLH|)Xspa8P
***  v1    0.1 CLI RX  106
**** v1    0.1 CLI RX|Message from VCC-compiler:
**** v1    0.1 CLI RX|Security: Privilege proc_setid missing, will not change uid/gid
**** v1    0.1 CLI RX|Variable 'obj.http.x-cache' is read only.
**** v1    0.1 CLI RX|At: ('<vcl.inline>' Line 6 Pos 21)
**** v1    0.1 CLI RX|                set obj.http.x-cache = "hit";
**** v1    0.1 CLI RX|--------------------################---------
**** v1    0.1 CLI RX|
**** v1    0.1 CLI RX|Running VCC-compiler failed, exited with 2
**** v1    0.1 CLI RX|VCL compilation failed
**   v1    0.1 VCL compilation failed (as expected)
***  v1    0.1 Found expected string: ("Variable 'obj.http.x-cache' is read only.")
*    top   0.1 RESETTING after ../../../bin/varnishtest/tests/r00310.vtc
**   v1    0.1 Wait
**** v1    0.1 CLI TX|backend.list
***  v1    0.1 CLI RX  101
**** v1    0.1 CLI RX|Unknown request in manager process (child not running).
**** v1    0.1 CLI RX|Type 'help' for more info.
**   v1    0.1 Stop
**** v1    0.1 CLI TX|stop
***  v1    0.1 CLI RX  300
**** v1    0.1 CLI RX|Child in state stopped
**** v1    0.1 CLI TX|status
***  v1    0.1 CLI RX  200
**** v1    0.1 CLI RX|Child in state stopped
**** v1    0.1 STDOUT poll 0x10
**   v1    0.1 R 3987 Status: 0000 (u 0.006000 s 0.022000)
*    diag  0.0 ............................................................
#    top  TEST ../../../bin/varnishtest/tests/r00310.vtc TIMED OUT (kill -9)
#    top  TEST ../../../bin/varnishtest/tests/r00310.vtc FAILED (60.002) signal=9

1 @ SunOS 5.11 i86pc 1.04 32_sun12.4 uplex

*    top   0.0 TEST ../../../bin/varnishtest/tests/r00310.vtc starting
[...]
*    top   0.0 TEST Test obj.http.x-cache in vcl_hit
[...]
**** v1    0.1 CLI TX|vcl.inline vcl1 << %XJEIFLH|)Xspa8P
**** v1    0.1 CLI TX|vcl 4.0;
**** v1    0.1 CLI TX|
**** v1    0.1 CLI TX|\tbackend foo { .host = "127.0.0.1"; }
**** v1    0.1 CLI TX|
**** v1    0.1 CLI TX|\tsub vcl_hit {
**** v1    0.1 CLI TX|\t\tset obj.http.x-cache = "hit";
**** v1    0.1 CLI TX|\t}
**** v1    0.1 CLI TX|
**** v1    0.1 CLI TX|%XJEIFLH|)Xspa8P
***  v1    0.1 CLI RX  106
**** v1    0.1 CLI RX|Message from VCC-compiler:
**** v1    0.1 CLI RX|Security: Privilege proc_setid missing, will not change uid/gid
**** v1    0.1 CLI RX|Variable 'obj.http.x-cache' is read only.
**** v1    0.1 CLI RX|At: ('<vcl.inline>' Line 6 Pos 21)
**** v1    0.1 CLI RX|                set obj.http.x-cache = "hit";
**** v1    0.1 CLI RX|--------------------################---------
**** v1    0.1 CLI RX|
**** v1    0.1 CLI RX|Running VCC-compiler failed, exited with 2
**** v1    0.1 CLI RX|VCL compilation failed
**   v1    0.1 VCL compilation failed (as expected)
***  v1    0.1 Found expected string: ("Variable 'obj.http.x-cache' is read only.")
*    top   0.1 RESETTING after ../../../bin/varnishtest/tests/r00310.vtc
**   v1    0.1 Wait
**** v1    0.1 CLI TX|backend.list
***  v1    0.1 CLI RX  101
**** v1    0.1 CLI RX|Unknown request in manager process (child not running).
**** v1    0.1 CLI RX|Type 'help' for more info.
**   v1    0.1 Stop
**** v1    0.1 CLI TX|stop
***  v1    0.1 CLI RX  300
**** v1    0.1 CLI RX|Child in state stopped
**** v1    0.1 CLI TX|status
***  v1    0.1 CLI RX  200
**** v1    0.1 CLI RX|Child in state stopped
**** v1    0.1 STDOUT poll 0x10
**   v1    0.1 R 74502 Status: 0000 (u 0.004000 s 0.019000)
*    diag  0.0 ............................................................
#    top  TEST ../../../bin/varnishtest/tests/r00310.vtc TIMED OUT (kill -9)
#    top  TEST ../../../bin/varnishtest/tests/r00310.vtc FAILED (60.002) signal=9

1 @ SunOS 5.11 i86pc 1.04 32_gcc4.7 uplex

*    top   0.0 TEST ../../../bin/varnishtest/tests/r00310.vtc starting
[...]
*    top   0.0 TEST Test obj.http.x-cache in vcl_hit
[...]
**** v1    0.1 CLI TX|vcl.inline vcl1 << %XJEIFLH|)Xspa8P
**** v1    0.1 CLI TX|vcl 4.0;
**** v1    0.1 CLI TX|
**** v1    0.1 CLI TX|\tbackend foo { .host = "127.0.0.1"; }
**** v1    0.1 CLI TX|
**** v1    0.1 CLI TX|\tsub vcl_hit {
**** v1    0.1 CLI TX|\t\tset obj.http.x-cache = "hit";
**** v1    0.1 CLI TX|\t}
**** v1    0.1 CLI TX|
**** v1    0.1 CLI TX|%XJEIFLH|)Xspa8P
***  v1    0.1 CLI RX  106
**** v1    0.1 CLI RX|Message from VCC-compiler:
**** v1    0.1 CLI RX|Security: Privilege proc_setid missing, will not change uid/gid
**** v1    0.1 CLI RX|Variable 'obj.http.x-cache' is read only.
**** v1    0.1 CLI RX|At: ('<vcl.inline>' Line 6 Pos 21)
**** v1    0.1 CLI RX|                set obj.http.x-cache = "hit";
**** v1    0.1 CLI RX|--------------------################---------
**** v1    0.1 CLI RX|
**** v1    0.1 CLI RX|Running VCC-compiler failed, exited with 2
**** v1    0.1 CLI RX|VCL compilation failed
**   v1    0.1 VCL compilation failed (as expected)
***  v1    0.1 Found expected string: ("Variable 'obj.http.x-cache' is read only.")
*    top   0.1 RESETTING after ../../../bin/varnishtest/tests/r00310.vtc
**   v1    0.1 Wait
**** v1    0.1 CLI TX|backend.list
***  v1    0.1 CLI RX  101
**** v1    0.1 CLI RX|Unknown request in manager process (child not running).
**** v1    0.1 CLI RX|Type 'help' for more info.
**   v1    0.1 Stop
**** v1    0.1 CLI TX|stop
***  v1    0.1 CLI RX  300
**** v1    0.1 CLI RX|Child in state stopped
**** v1    0.1 CLI TX|status
***  v1    0.1 CLI RX  200
**** v1    0.1 CLI RX|Child in state stopped
**** v1    0.1 STDOUT poll 0x10
**   v1    0.1 R 54263 Status: 0000 (u 0.004000 s 0.017000)
*    diag  0.0 ............................................................
#    top  TEST ../../../bin/varnishtest/tests/r00310.vtc TIMED OUT (kill -9)
#    top  TEST ../../../bin/varnishtest/tests/r00310.vtc FAILED (60.002) signal=9

1 @ SunOS 5.11 i86pc 1.04 32_gcc4.7 uplex

*    top   0.0 TEST ../../../bin/varnishtest/tests/r00310.vtc starting
[...]
*    top   0.0 TEST Test obj.http.x-cache in vcl_hit
[...]
**** v1    0.1 CLI TX|vcl.inline vcl1 << %XJEIFLH|)Xspa8P
**** v1    0.1 CLI TX|vcl 4.0;
**** v1    0.1 CLI TX|
**** v1    0.1 CLI TX|\tbackend foo { .host = "127.0.0.1"; }
**** v1    0.1 CLI TX|
**** v1    0.1 CLI TX|\tsub vcl_hit {
**** v1    0.1 CLI TX|\t\tset obj.http.x-cache = "hit";
**** v1    0.1 CLI TX|\t}
**** v1    0.1 CLI TX|
**** v1    0.1 CLI TX|%XJEIFLH|)Xspa8P
***  v1    0.1 CLI RX  106
**** v1    0.1 CLI RX|Message from VCC-compiler:
**** v1    0.1 CLI RX|Security: Privilege proc_setid missing, will not change uid/gid
**** v1    0.1 CLI RX|Variable 'obj.http.x-cache' is read only.
**** v1    0.1 CLI RX|At: ('<vcl.inline>' Line 6 Pos 21)
**** v1    0.1 CLI RX|                set obj.http.x-cache = "hit";
**** v1    0.1 CLI RX|--------------------################---------
**** v1    0.1 CLI RX|
**** v1    0.1 CLI RX|Running VCC-compiler failed, exited with 2
**** v1    0.1 CLI RX|VCL compilation failed
**   v1    0.1 VCL compilation failed (as expected)
***  v1    0.1 Found expected string: ("Variable 'obj.http.x-cache' is read only.")
*    top   0.1 RESETTING after ../../../bin/varnishtest/tests/r00310.vtc
**   v1    0.1 Wait
**** v1    0.1 CLI TX|backend.list
***  v1    0.1 CLI RX  101
**** v1    0.1 CLI RX|Unknown request in manager process (child not running).
**** v1    0.1 CLI RX|Type 'help' for more info.
**   v1    0.1 Stop
**** v1    0.1 CLI TX|stop
***  v1    0.1 CLI RX  300
**** v1    0.1 CLI RX|Child in state stopped
**** v1    0.1 CLI TX|status
***  v1    0.1 CLI RX  200
**** v1    0.1 CLI RX|Child in state stopped
**** v1    0.1 STDOUT poll 0x10
**   v1    0.1 R 10646 Status: 0000 (u 0.007000 s 0.019000)
*    diag  0.0 ............................................................
#    top  TEST ../../../bin/varnishtest/tests/r00310.vtc TIMED OUT (kill -9)
#    top  TEST ../../../bin/varnishtest/tests/r00310.vtc FAILED (60.002) signal=9

1 @ SunOS 5.11 i86pc 1.04 64_gcc4.7 uplex

*    top   0.0 TEST ../../../bin/varnishtest/tests/r00310.vtc starting
[...]
*    top   0.0 TEST Test obj.http.x-cache in vcl_hit
[...]
**** v1    0.1 CLI TX|vcl.inline vcl1 << %XJEIFLH|)Xspa8P
**** v1    0.1 CLI TX|vcl 4.0;
**** v1    0.1 CLI TX|
**** v1    0.1 CLI TX|\tbackend foo { .host = "127.0.0.1"; }
**** v1    0.1 CLI TX|
**** v1    0.1 CLI TX|\tsub vcl_hit {
**** v1    0.1 CLI TX|\t\tset obj.http.x-cache = "hit";
**** v1    0.1 CLI TX|\t}
**** v1    0.1 CLI TX|
**** v1    0.1 CLI TX|%XJEIFLH|)Xspa8P
***  v1    0.1 CLI RX  106
**** v1    0.1 CLI RX|Message from VCC-compiler:
**** v1    0.1 CLI RX|Security: Privilege proc_setid missing, will not change uid/gid
**** v1    0.1 CLI RX|Variable 'obj.http.x-cache' is read only.
**** v1    0.1 CLI RX|At: ('<vcl.inline>' Line 6 Pos 21)
**** v1    0.1 CLI RX|                set obj.http.x-cache = "hit";
**** v1    0.1 CLI RX|--------------------################---------
**** v1    0.1 CLI RX|
**** v1    0.1 CLI RX|Running VCC-compiler failed, exited with 2
**** v1    0.1 CLI RX|VCL compilation failed
**   v1    0.1 VCL compilation failed (as expected)
***  v1    0.1 Found expected string: ("Variable 'obj.http.x-cache' is read only.")
*    top   0.1 RESETTING after ../../../bin/varnishtest/tests/r00310.vtc
**   v1    0.1 Wait
**** v1    0.1 CLI TX|backend.list
***  v1    0.1 CLI RX  101
**** v1    0.1 CLI RX|Unknown request in manager process (child not running).
**** v1    0.1 CLI RX|Type 'help' for more info.
**   v1    0.1 Stop
**** v1    0.1 CLI TX|stop
***  v1    0.1 CLI RX  300
**** v1    0.1 CLI RX|Child in state stopped
**** v1    0.1 CLI TX|status
***  v1    0.1 CLI RX  200
**** v1    0.1 CLI RX|Child in state stopped
**** v1    0.1 STDOUT poll 0x10
**   v1    0.1 R 17194 Status: 0000 (u 0.007000 s 0.023000)
*    diag  0.0 ............................................................
#    top  TEST ../../../bin/varnishtest/tests/r00310.vtc TIMED OUT (kill -9)
#    top  TEST ../../../bin/varnishtest/tests/r00310.vtc FAILED (60.004) signal=9

1 @ SunOS 5.11 i86pc 1.04 64_gcc4.7 uplex

*    top   0.0 TEST ../../../bin/varnishtest/tests/r00310.vtc starting
[...]
*    top   0.0 TEST Test obj.http.x-cache in vcl_hit
[...]
**** v1    0.1 CLI TX|vcl.inline vcl1 << %XJEIFLH|)Xspa8P
**** v1    0.1 CLI TX|vcl 4.0;
**** v1    0.1 CLI TX|
**** v1    0.1 CLI TX|\tbackend foo { .host = "127.0.0.1"; }
**** v1    0.1 CLI TX|
**** v1    0.1 CLI TX|\tsub vcl_hit {
**** v1    0.1 CLI TX|\t\tset obj.http.x-cache = "hit";
**** v1    0.1 CLI TX|\t}
**** v1    0.1 CLI TX|
**** v1    0.1 CLI TX|%XJEIFLH|)Xspa8P
***  v1    0.2 CLI RX  106
**** v1    0.2 CLI RX|Message from VCC-compiler:
**** v1    0.2 CLI RX|Security: Privilege proc_setid missing, will not change uid/gid
**** v1    0.2 CLI RX|Variable 'obj.http.x-cache' is read only.
**** v1    0.2 CLI RX|At: ('<vcl.inline>' Line 6 Pos 21)
**** v1    0.2 CLI RX|                set obj.http.x-cache = "hit";
**** v1    0.2 CLI RX|--------------------################---------
**** v1    0.2 CLI RX|
**** v1    0.2 CLI RX|Running VCC-compiler failed, exited with 2
**** v1    0.2 CLI RX|VCL compilation failed
**   v1    0.2 VCL compilation failed (as expected)
***  v1    0.2 Found expected string: ("Variable 'obj.http.x-cache' is read only.")
*    top   0.2 RESETTING after ../../../bin/varnishtest/tests/r00310.vtc
**   v1    0.2 Wait
**** v1    0.2 CLI TX|backend.list
***  v1    0.2 CLI RX  101
**** v1    0.2 CLI RX|Unknown request in manager process (child not running).
**** v1    0.2 CLI RX|Type 'help' for more info.
**   v1    0.2 Stop
**** v1    0.2 CLI TX|stop
***  v1    0.2 CLI RX  300
**** v1    0.2 CLI RX|Child in state stopped
**** v1    0.2 CLI TX|status
***  v1    0.2 CLI RX  200
**** v1    0.2 CLI RX|Child in state stopped
**** v1    0.2 STDOUT poll 0x10
**   v1    0.2 R 763 Status: 0000 (u 0.010000 s 0.035000)
*    diag  0.0 ............................................................
#    top  TEST ../../../bin/varnishtest/tests/r00310.vtc TIMED OUT (kill -9)
#    top  TEST ../../../bin/varnishtest/tests/r00310.vtc FAILED (60.004) signal=9

1 @ Linux 3.10.0 x86_64 1.02 mblissett

*    top   0.0 TEST ../../../bin/varnishtest/tests/r00310.vtc starting
[...]
*    top   0.0 TEST Test obj.http.x-cache in vcl_hit
[...]
**** v1    0.1 CLI RX|Type 'start' to launch worker process.
**** v1    0.1 CLI TX|vcl.inline vcl1 << %XJEIFLH|)Xspa8P
**** v1    0.1 CLI TX|vcl 4.0;
**** v1    0.1 CLI TX|
**** v1    0.1 CLI TX|\tbackend foo { .host = "127.0.0.1"; }
**** v1    0.1 CLI TX|
**** v1    0.1 CLI TX|\tsub vcl_hit {
**** v1    0.1 CLI TX|\t\tset obj.http.x-cache = "hit";
**** v1    0.1 CLI TX|\t}
**** v1    0.1 CLI TX|
**** v1    0.1 CLI TX|%XJEIFLH|)Xspa8P
***  v1    0.1 CLI RX  106
**** v1    0.1 CLI RX|Message from VCC-compiler:
**** v1    0.1 CLI RX|Variable 'obj.http.x-cache' is read only.
**** v1    0.1 CLI RX|At: ('<vcl.inline>' Line 6 Pos 21)
**** v1    0.1 CLI RX|                set obj.http.x-cache = "hit";
**** v1    0.1 CLI RX|--------------------################---------
**** v1    0.1 CLI RX|
**** v1    0.1 CLI RX|Running VCC-compiler failed, exited with 2
**** v1    0.1 CLI RX|VCL compilation failed
**   v1    0.1 VCL compilation failed (as expected)
***  v1    0.1 Found expected string: ("Variable 'obj.http.x-cache' is read only.")
*    top   0.1 RESETTING after ../../../bin/varnishtest/tests/r00310.vtc
**   v1    0.1 Wait
**** v1    0.1 CLI TX|backend.list
***  v1    0.2 CLI RX  101
**** v1    0.2 CLI RX|Unknown request in manager process (child not running).
**** v1    0.2 CLI RX|Type 'help' for more info.
**   v1    0.2 Stop
**** v1    0.2 CLI TX|stop
***  v1    0.2 CLI RX  300
**** v1    0.2 CLI RX|Child in state stopped
**** v1    0.2 CLI TX|status
***  v1    0.2 CLI RX  200
**** v1    0.2 CLI RX|Child in state stopped
**** v1    0.2 STDOUT poll 0x10
**   v1    0.2 R 32610 Status: 0000 (u 0.004866 s 0.009180)
*    diag  0.0 ............................................................
#    top  TEST ../../../bin/varnishtest/tests/r00310.vtc TIMED OUT (kill -9)
#    top  TEST ../../../bin/varnishtest/tests/r00310.vtc FAILED (60.001) signal=9

1 @ SunOS 5.11 i86pc 1.04 64_sun12.4 uplex

*    top   0.0 TEST ../../../bin/varnishtest/tests/r00310.vtc starting
[...]
*    top   0.0 TEST Test obj.http.x-cache in vcl_hit
[...]
**** v1    0.1 CLI TX|vcl.inline vcl1 << %XJEIFLH|)Xspa8P
**** v1    0.1 CLI TX|vcl 4.0;
**** v1    0.1 CLI TX|
**** v1    0.1 CLI TX|\tbackend foo { .host = "127.0.0.1"; }
**** v1    0.1 CLI TX|
**** v1    0.1 CLI TX|\tsub vcl_hit {
**** v1    0.1 CLI TX|\t\tset obj.http.x-cache = "hit";
**** v1    0.1 CLI TX|\t}
**** v1    0.1 CLI TX|
**** v1    0.1 CLI TX|%XJEIFLH|)Xspa8P
***  v1    0.1 CLI RX  106
**** v1    0.1 CLI RX|Message from VCC-compiler:
**** v1    0.1 CLI RX|Security: Privilege proc_setid missing, will not change uid/gid
**** v1    0.1 CLI RX|Variable 'obj.http.x-cache' is read only.
**** v1    0.1 CLI RX|At: ('<vcl.inline>' Line 6 Pos 21)
**** v1    0.1 CLI RX|                set obj.http.x-cache = "hit";
**** v1    0.1 CLI RX|--------------------################---------
**** v1    0.1 CLI RX|
**** v1    0.1 CLI RX|Running VCC-compiler failed, exited with 2
**** v1    0.1 CLI RX|VCL compilation failed
**   v1    0.1 VCL compilation failed (as expected)
***  v1    0.1 Found expected string: ("Variable 'obj.http.x-cache' is read only.")
*    top   0.1 RESETTING after ../../../bin/varnishtest/tests/r00310.vtc
**   v1    0.1 Wait
**** v1    0.1 CLI TX|backend.list
***  v1    0.1 CLI RX  101
**** v1    0.1 CLI RX|Unknown request in manager process (child not running).
**** v1    0.1 CLI RX|Type 'help' for more info.
**   v1    0.1 Stop
**** v1    0.1 CLI TX|stop
***  v1    0.1 CLI RX  300
**** v1    0.1 CLI RX|Child in state stopped
**** v1    0.1 CLI TX|status
***  v1    0.1 CLI RX  200
**** v1    0.1 CLI RX|Child in state stopped
**** v1    0.1 STDOUT poll 0x10
**   v1    0.1 R 18728 Status: 0000 (u 0.007000 s 0.022000)
*    diag  0.0 ............................................................
#    top  TEST ../../../bin/varnishtest/tests/r00310.vtc TIMED OUT (kill -9)
#    top  TEST ../../../bin/varnishtest/tests/r00310.vtc FAILED (60.003) signal=9

1 @ Ubuntu LTS i686 1.04 fgs

*    top   0.0 TEST ../../../bin/varnishtest/tests/r00310.vtc starting
[...]
*    top   0.0 TEST Test obj.http.x-cache in vcl_hit
[...]
**** v1    0.1 CLI RX|Type 'start' to launch worker process.
**** v1    0.1 CLI TX|vcl.inline vcl1 << %XJEIFLH|)Xspa8P
**** v1    0.1 CLI TX|vcl 4.0;
**** v1    0.1 CLI TX|
**** v1    0.1 CLI TX|\tbackend foo { .host = "127.0.0.1"; }
**** v1    0.1 CLI TX|
**** v1    0.1 CLI TX|\tsub vcl_hit {
**** v1    0.1 CLI TX|\t\tset obj.http.x-cache = "hit";
**** v1    0.1 CLI TX|\t}
**** v1    0.1 CLI TX|
**** v1    0.1 CLI TX|%XJEIFLH|)Xspa8P
***  v1    0.1 CLI RX  106
**** v1    0.1 CLI RX|Message from VCC-compiler:
**** v1    0.1 CLI RX|Variable 'obj.http.x-cache' is read only.
**** v1    0.1 CLI RX|At: ('<vcl.inline>' Line 6 Pos 21)
**** v1    0.1 CLI RX|                set obj.http.x-cache = "hit";
**** v1    0.1 CLI RX|--------------------################---------
**** v1    0.1 CLI RX|
**** v1    0.1 CLI RX|Running VCC-compiler failed, exited with 2
**** v1    0.1 CLI RX|VCL compilation failed
**   v1    0.1 VCL compilation failed (as expected)
***  v1    0.1 Found expected string: ("Variable 'obj.http.x-cache' is read only.")
*    top   0.1 RESETTING after ../../../bin/varnishtest/tests/r00310.vtc
**   v1    0.1 Wait
**** v1    0.1 CLI TX|backend.list
***  v1    0.1 CLI RX  101
**** v1    0.1 CLI RX|Unknown request in manager process (child not running).
**** v1    0.1 CLI RX|Type 'help' for more info.
**   v1    0.1 Stop
**** v1    0.1 CLI TX|stop
***  v1    0.2 CLI RX  300
**** v1    0.2 CLI RX|Child in state stopped
**** v1    0.2 CLI TX|status
***  v1    0.2 CLI RX  200
**** v1    0.2 CLI RX|Child in state stopped
**** v1    0.2 STDOUT poll 0x10
**   v1    0.2 R 30112 Status: 0000 (u 0.004000 s 0.000000)
*    diag  0.0 ............................................................
#    top  TEST ../../../bin/varnishtest/tests/r00310.vtc TIMED OUT (kill -9)
#    top  TEST ../../../bin/varnishtest/tests/r00310.vtc FAILED (60.001) signal=9

1 @ SunOS 5.11 i86pc 1.04 64_sun12.4 uplex

*    top   0.0 TEST ../../../bin/varnishtest/tests/r00310.vtc starting
[...]
*    top   0.0 TEST Test obj.http.x-cache in vcl_hit
[...]
**** v1    0.1 CLI TX|vcl.inline vcl1 << %XJEIFLH|)Xspa8P
**** v1    0.1 CLI TX|vcl 4.0;
**** v1    0.1 CLI TX|
**** v1    0.1 CLI TX|\tbackend foo { .host = "127.0.0.1"; }
**** v1    0.1 CLI TX|
**** v1    0.1 CLI TX|\tsub vcl_hit {
**** v1    0.1 CLI TX|\t\tset obj.http.x-cache = "hit";
**** v1    0.1 CLI TX|\t}
**** v1    0.1 CLI TX|
**** v1    0.1 CLI TX|%XJEIFLH|)Xspa8P
***  v1    0.2 CLI RX  106
**** v1    0.2 CLI RX|Message from VCC-compiler:
**** v1    0.2 CLI RX|Security: Privilege proc_setid missing, will not change uid/gid
**** v1    0.2 CLI RX|Variable 'obj.http.x-cache' is read only.
**** v1    0.2 CLI RX|At: ('<vcl.inline>' Line 6 Pos 21)
**** v1    0.2 CLI RX|                set obj.http.x-cache = "hit";
**** v1    0.2 CLI RX|--------------------################---------
**** v1    0.2 CLI RX|
**** v1    0.2 CLI RX|Running VCC-compiler failed, exited with 2
**** v1    0.2 CLI RX|VCL compilation failed
**   v1    0.2 VCL compilation failed (as expected)
***  v1    0.2 Found expected string: ("Variable 'obj.http.x-cache' is read only.")
*    top   0.2 RESETTING after ../../../bin/varnishtest/tests/r00310.vtc
**   v1    0.2 Wait
**** v1    0.2 CLI TX|backend.list
***  v1    0.2 CLI RX  101
**** v1    0.2 CLI RX|Unknown request in manager process (child not running).
**** v1    0.2 CLI RX|Type 'help' for more info.
**   v1    0.2 Stop
**** v1    0.2 CLI TX|stop
***  v1    0.2 CLI RX  300
**** v1    0.2 CLI RX|Child in state stopped
**** v1    0.2 CLI TX|status
***  v1    0.2 CLI RX  200
**** v1    0.2 CLI RX|Child in state stopped
**** v1    0.2 STDOUT poll 0x10
**   v1    0.2 R 23397 Status: 0000 (u 0.009000 s 0.031000)
*    diag  0.0 ............................................................
#    top  TEST ../../../bin/varnishtest/tests/r00310.vtc TIMED OUT (kill -9)
#    top  TEST ../../../bin/varnishtest/tests/r00310.vtc FAILED (60.003) signal=9

1 @ SunOS 5.11 i86pc 1.04 32_gcc4.7 uplex

*    top   0.0 TEST ../../../bin/varnishtest/tests/r00310.vtc starting
[...]
*    top   0.0 TEST Test obj.http.x-cache in vcl_hit
[...]
**** v1    0.1 CLI TX|vcl.inline vcl1 << %XJEIFLH|)Xspa8P
**** v1    0.1 CLI TX|vcl 4.0;
**** v1    0.1 CLI TX|
**** v1    0.1 CLI TX|\tbackend foo { .host = "127.0.0.1"; }
**** v1    0.1 CLI TX|
**** v1    0.1 CLI TX|\tsub vcl_hit {
**** v1    0.1 CLI TX|\t\tset obj.http.x-cache = "hit";
**** v1    0.1 CLI TX|\t}
**** v1    0.1 CLI TX|
**** v1    0.1 CLI TX|%XJEIFLH|)Xspa8P
***  v1    0.1 CLI RX  106
**** v1    0.1 CLI RX|Message from VCC-compiler:
**** v1    0.1 CLI RX|Security: Privilege proc_setid missing, will not change uid/gid
**** v1    0.1 CLI RX|Variable 'obj.http.x-cache' is read only.
**** v1    0.1 CLI RX|At: ('<vcl.inline>' Line 6 Pos 21)
**** v1    0.1 CLI RX|                set obj.http.x-cache = "hit";
**** v1    0.1 CLI RX|--------------------################---------
**** v1    0.1 CLI RX|
**** v1    0.1 CLI RX|Running VCC-compiler failed, exited with 2
**** v1    0.1 CLI RX|VCL compilation failed
**   v1    0.1 VCL compilation failed (as expected)
***  v1    0.1 Found expected string: ("Variable 'obj.http.x-cache' is read only.")
*    top   0.1 RESETTING after ../../../bin/varnishtest/tests/r00310.vtc
**   v1    0.1 Wait
**** v1    0.1 CLI TX|backend.list
***  v1    0.1 CLI RX  101
**** v1    0.1 CLI RX|Unknown request in manager process (child not running).
**** v1    0.1 CLI RX|Type 'help' for more info.
**   v1    0.1 Stop
**** v1    0.1 CLI TX|stop
***  v1    0.1 CLI RX  300
**** v1    0.1 CLI RX|Child in state stopped
**** v1    0.1 CLI TX|status
***  v1    0.1 CLI RX  200
**** v1    0.1 CLI RX|Child in state stopped
**** v1    0.1 STDOUT poll 0x10
**   v1    0.1 R 33229 Status: 0000 (u 0.004000 s 0.016000)
*    diag  0.0 ............................................................
#    top  TEST ../../../bin/varnishtest/tests/r00310.vtc TIMED OUT (kill -9)
#    top  TEST ../../../bin/varnishtest/tests/r00310.vtc FAILED (60.003) signal=9

1 @ SunOS 5.11 i86pc 1.04 64_sun12.4 uplex

*    top   0.0 TEST ../../../bin/varnishtest/tests/r00310.vtc starting
[...]
*    top   0.0 TEST Test obj.http.x-cache in vcl_hit
[...]
**** v1    0.1 CLI TX|vcl.inline vcl1 << %XJEIFLH|)Xspa8P
**** v1    0.1 CLI TX|vcl 4.0;
**** v1    0.1 CLI TX|
**** v1    0.1 CLI TX|\tbackend foo { .host = "127.0.0.1"; }
**** v1    0.1 CLI TX|
**** v1    0.1 CLI TX|\tsub vcl_hit {
**** v1    0.1 CLI TX|\t\tset obj.http.x-cache = "hit";
**** v1    0.1 CLI TX|\t}
**** v1    0.1 CLI TX|
**** v1    0.1 CLI TX|%XJEIFLH|)Xspa8P
***  v1    0.1 CLI RX  106
**** v1    0.1 CLI RX|Message from VCC-compiler:
**** v1    0.1 CLI RX|Security: Privilege proc_setid missing, will not change uid/gid
**** v1    0.1 CLI RX|Variable 'obj.http.x-cache' is read only.
**** v1    0.1 CLI RX|At: ('<vcl.inline>' Line 6 Pos 21)
**** v1    0.1 CLI RX|                set obj.http.x-cache = "hit";
**** v1    0.1 CLI RX|--------------------################---------
**** v1    0.1 CLI RX|
**** v1    0.1 CLI RX|Running VCC-compiler failed, exited with 2
**** v1    0.1 CLI RX|VCL compilation failed
**   v1    0.1 VCL compilation failed (as expected)
***  v1    0.1 Found expected string: ("Variable 'obj.http.x-cache' is read only.")
*    top   0.1 RESETTING after ../../../bin/varnishtest/tests/r00310.vtc
**   v1    0.1 Wait
**** v1    0.1 CLI TX|backend.list
***  v1    0.1 CLI RX  101
**** v1    0.1 CLI RX|Unknown request in manager process (child not running).
**** v1    0.1 CLI RX|Type 'help' for more info.
**   v1    0.1 Stop
**** v1    0.1 CLI TX|stop
***  v1    0.1 CLI RX  300
**** v1    0.1 CLI RX|Child in state stopped
**** v1    0.1 CLI TX|status
***  v1    0.1 CLI RX  200
**** v1    0.1 CLI RX|Child in state stopped
**** v1    0.1 STDOUT poll 0x10
**   v1    0.1 R 17094 Status: 0000 (u 0.007000 s 0.025000)
*    diag  0.0 ............................................................
#    top  TEST ../../../bin/varnishtest/tests/r00310.vtc TIMED OUT (kill -9)
#    top  TEST ../../../bin/varnishtest/tests/r00310.vtc FAILED (60.004) signal=9

1 @ Ubuntu LTS i686 1.04 fgs

*    top   0.0 TEST ../../../bin/varnishtest/tests/r00310.vtc starting
[...]
*    top   0.0 TEST Test obj.http.x-cache in vcl_hit
[...]
**** v1    0.1 CLI RX|Type 'start' to launch worker process.
**** v1    0.1 CLI TX|vcl.inline vcl1 << %XJEIFLH|)Xspa8P
**** v1    0.1 CLI TX|vcl 4.0;
**** v1    0.1 CLI TX|
**** v1    0.1 CLI TX|\tbackend foo { .host = "127.0.0.1"; }
**** v1    0.1 CLI TX|
**** v1    0.1 CLI TX|\tsub vcl_hit {
**** v1    0.1 CLI TX|\t\tset obj.http.x-cache = "hit";
**** v1    0.1 CLI TX|\t}
**** v1    0.1 CLI TX|
**** v1    0.1 CLI TX|%XJEIFLH|)Xspa8P
***  v1    0.1 CLI RX  106
**** v1    0.1 CLI RX|Message from VCC-compiler:
**** v1    0.1 CLI RX|Variable 'obj.http.x-cache' is read only.
**** v1    0.1 CLI RX|At: ('<vcl.inline>' Line 6 Pos 21)
**** v1    0.1 CLI RX|                set obj.http.x-cache = "hit";
**** v1    0.1 CLI RX|--------------------################---------
**** v1    0.1 CLI RX|
**** v1    0.1 CLI RX|Running VCC-compiler failed, exited with 2
**** v1    0.1 CLI RX|VCL compilation failed
**   v1    0.1 VCL compilation failed (as expected)
***  v1    0.1 Found expected string: ("Variable 'obj.http.x-cache' is read only.")
*    top   0.1 RESETTING after ../../../bin/varnishtest/tests/r00310.vtc
**   v1    0.1 Wait
**** v1    0.1 CLI TX|backend.list
***  v1    0.1 CLI RX  101
**** v1    0.1 CLI RX|Unknown request in manager process (child not running).
**** v1    0.1 CLI RX|Type 'help' for more info.
**   v1    0.1 Stop
**** v1    0.1 CLI TX|stop
***  v1    0.2 CLI RX  300
**** v1    0.2 CLI RX|Child in state stopped
**** v1    0.2 CLI TX|status
***  v1    0.2 CLI RX  200
**** v1    0.2 CLI RX|Child in state stopped
**** v1    0.2 STDOUT poll 0x10
**   v1    0.2 R 27122 Status: 0000 (u 0.000000 s 0.004000)
*    diag  0.0 ............................................................
#    top  TEST ../../../bin/varnishtest/tests/r00310.vtc TIMED OUT (kill -9)
#    top  TEST ../../../bin/varnishtest/tests/r00310.vtc FAILED (60.001) signal=9

1 @ SunOS 5.11 i86pc 1.04 32_sun12.4 uplex

*    top   0.0 TEST ../../../bin/varnishtest/tests/r00310.vtc starting
[...]
*    top   0.0 TEST Test obj.http.x-cache in vcl_hit
[...]
**** v1    0.1 CLI TX|vcl.inline vcl1 << %XJEIFLH|)Xspa8P
**** v1    0.1 CLI TX|vcl 4.0;
**** v1    0.1 CLI TX|
**** v1    0.1 CLI TX|\tbackend foo { .host = "127.0.0.1"; }
**** v1    0.1 CLI TX|
**** v1    0.1 CLI TX|\tsub vcl_hit {
**** v1    0.1 CLI TX|\t\tset obj.http.x-cache = "hit";
**** v1    0.1 CLI TX|\t}
**** v1    0.1 CLI TX|
**** v1    0.1 CLI TX|%XJEIFLH|)Xspa8P
***  v1    0.1 CLI RX  106
**** v1    0.1 CLI RX|Message from VCC-compiler:
**** v1    0.1 CLI RX|Security: Privilege proc_setid missing, will not change uid/gid
**** v1    0.1 CLI RX|Variable 'obj.http.x-cache' is read only.
**** v1    0.1 CLI RX|At: ('<vcl.inline>' Line 6 Pos 21)
**** v1    0.1 CLI RX|                set obj.http.x-cache = "hit";
**** v1    0.1 CLI RX|--------------------################---------
**** v1    0.1 CLI RX|
**** v1    0.1 CLI RX|Running VCC-compiler failed, exited with 2
**** v1    0.1 CLI RX|VCL compilation failed
**   v1    0.1 VCL compilation failed (as expected)
***  v1    0.1 Found expected string: ("Variable 'obj.http.x-cache' is read only.")
*    top   0.1 RESETTING after ../../../bin/varnishtest/tests/r00310.vtc
**   v1    0.1 Wait
**** v1    0.1 CLI TX|backend.list
***  v1    0.1 CLI RX  101
**** v1    0.1 CLI RX|Unknown request in manager process (child not running).
**** v1    0.1 CLI RX|Type 'help' for more info.
**   v1    0.1 Stop
**** v1    0.1 CLI TX|stop
***  v1    0.1 CLI RX  300
**** v1    0.1 CLI RX|Child in state stopped
**** v1    0.1 CLI TX|status
***  v1    0.1 CLI RX  200
**** v1    0.1 CLI RX|Child in state stopped
**** v1    0.1 STDOUT poll 0x10
**   v1    0.1 R 89989 Status: 0000 (u 0.004000 s 0.018000)
*    diag  0.0 ............................................................
#    top  TEST ../../../bin/varnishtest/tests/r00310.vtc TIMED OUT (kill -9)
#    top  TEST ../../../bin/varnishtest/tests/r00310.vtc FAILED (60.002) signal=9

1 @ Ubuntu LTS i686 1.04 fgs

*    top   0.0 TEST ../../../bin/varnishtest/tests/r00310.vtc starting
[...]
*    top   0.0 TEST Test obj.http.x-cache in vcl_hit
[...]
**** v1    0.1 CLI RX|Type 'start' to launch worker process.
**** v1    0.1 CLI TX|vcl.inline vcl1 << %XJEIFLH|)Xspa8P
**** v1    0.1 CLI TX|vcl 4.0;
**** v1    0.1 CLI TX|
**** v1    0.1 CLI TX|\tbackend foo { .host = "127.0.0.1"; }
**** v1    0.1 CLI TX|
**** v1    0.1 CLI TX|\tsub vcl_hit {
**** v1    0.1 CLI TX|\t\tset obj.http.x-cache = "hit";
**** v1    0.1 CLI TX|\t}
**** v1    0.1 CLI TX|
**** v1    0.1 CLI TX|%XJEIFLH|)Xspa8P
***  v1    0.1 CLI RX  106
**** v1    0.1 CLI RX|Message from VCC-compiler:
**** v1    0.1 CLI RX|Variable 'obj.http.x-cache' is read only.
**** v1    0.1 CLI RX|At: ('<vcl.inline>' Line 6 Pos 21)
**** v1    0.1 CLI RX|                set obj.http.x-cache = "hit";
**** v1    0.1 CLI RX|--------------------################---------
**** v1    0.1 CLI RX|
**** v1    0.1 CLI RX|Running VCC-compiler failed, exited with 2
**** v1    0.1 CLI RX|VCL compilation failed
**   v1    0.1 VCL compilation failed (as expected)
***  v1    0.1 Found expected string: ("Variable 'obj.http.x-cache' is read only.")
*    top   0.1 RESETTING after ../../../bin/varnishtest/tests/r00310.vtc
**   v1    0.1 Wait
**** v1    0.1 CLI TX|backend.list
***  v1    0.1 CLI RX  101
**** v1    0.1 CLI RX|Unknown request in manager process (child not running).
**** v1    0.1 CLI RX|Type 'help' for more info.
**   v1    0.1 Stop
**** v1    0.1 CLI TX|stop
***  v1    0.2 CLI RX  300
**** v1    0.2 CLI RX|Child in state stopped
**** v1    0.2 CLI TX|status
***  v1    0.2 CLI RX  200
**** v1    0.2 CLI RX|Child in state stopped
**** v1    0.2 STDOUT poll 0x10
**   v1    0.2 R 630 Status: 0000 (u 0.000000 s 0.004000)
*    diag  0.0 ............................................................
#    top  TEST ../../../bin/varnishtest/tests/r00310.vtc TIMED OUT (kill -9)
#    top  TEST ../../../bin/varnishtest/tests/r00310.vtc FAILED (60.001) signal=9

1 @ SunOS 5.11 i86pc 1.04 32_sun12.4 uplex

*    top   0.0 TEST ../../../bin/varnishtest/tests/r00310.vtc starting
[...]
*    top   0.0 TEST Test obj.http.x-cache in vcl_hit
[...]
**** v1    0.1 CLI TX|vcl.inline vcl1 << %XJEIFLH|)Xspa8P
**** v1    0.1 CLI TX|vcl 4.0;
**** v1    0.1 CLI TX|
**** v1    0.1 CLI TX|\tbackend foo { .host = "127.0.0.1"; }
**** v1    0.1 CLI TX|
**** v1    0.1 CLI TX|\tsub vcl_hit {
**** v1    0.1 CLI TX|\t\tset obj.http.x-cache = "hit";
**** v1    0.1 CLI TX|\t}
**** v1    0.1 CLI TX|
**** v1    0.1 CLI TX|%XJEIFLH|)Xspa8P
***  v1    0.1 CLI RX  106
**** v1    0.1 CLI RX|Message from VCC-compiler:
**** v1    0.1 CLI RX|Security: Privilege proc_setid missing, will not change uid/gid
**** v1    0.1 CLI RX|Variable 'obj.http.x-cache' is read only.
**** v1    0.1 CLI RX|At: ('<vcl.inline>' Line 6 Pos 21)
**** v1    0.1 CLI RX|                set obj.http.x-cache = "hit";
**** v1    0.1 CLI RX|--------------------################---------
**** v1    0.1 CLI RX|
**** v1    0.1 CLI RX|Running VCC-compiler failed, exited with 2
**** v1    0.1 CLI RX|VCL compilation failed
**   v1    0.1 VCL compilation failed (as expected)
***  v1    0.1 Found expected string: ("Variable 'obj.http.x-cache' is read only.")
*    top   0.1 RESETTING after ../../../bin/varnishtest/tests/r00310.vtc
**   v1    0.1 Wait
**** v1    0.1 CLI TX|backend.list
***  v1    0.1 CLI RX  101
**** v1    0.1 CLI RX|Unknown request in manager process (child not running).
**** v1    0.1 CLI RX|Type 'help' for more info.
**   v1    0.2 Stop
**** v1    0.2 CLI TX|stop
***  v1    0.2 CLI RX  300
**** v1    0.2 CLI RX|Child in state stopped
**** v1    0.2 CLI TX|status
***  v1    0.2 CLI RX  200
**** v1    0.2 CLI RX|Child in state stopped
**** v1    0.2 STDOUT poll 0x10
**   v1    0.2 R 86834 Status: 0000 (u 0.007000 s 0.027000)
*    diag  0.0 ............................................................
#    top  TEST ../../../bin/varnishtest/tests/r00310.vtc TIMED OUT (kill -9)
#    top  TEST ../../../bin/varnishtest/tests/r00310.vtc FAILED (60.003) signal=9

1 @ Linux 3.10.0 x86_64 1.02 mblissett

*    top   0.0 TEST ../../../bin/varnishtest/tests/r00310.vtc starting
[...]
*    top   0.0 TEST Test obj.http.x-cache in vcl_hit
[...]
**** v1    0.1 CLI RX|Type 'start' to launch worker process.
**** v1    0.1 CLI TX|vcl.inline vcl1 << %XJEIFLH|)Xspa8P
**** v1    0.1 CLI TX|vcl 4.0;
**** v1    0.1 CLI TX|
**** v1    0.1 CLI TX|\tbackend foo { .host = "127.0.0.1"; }
**** v1    0.1 CLI TX|
**** v1    0.1 CLI TX|\tsub vcl_hit {
**** v1    0.1 CLI TX|\t\tset obj.http.x-cache = "hit";
**** v1    0.1 CLI TX|\t}
**** v1    0.1 CLI TX|
**** v1    0.1 CLI TX|%XJEIFLH|)Xspa8P
***  v1    0.1 CLI RX  106
**** v1    0.1 CLI RX|Message from VCC-compiler:
**** v1    0.1 CLI RX|Variable 'obj.http.x-cache' is read only.
**** v1    0.1 CLI RX|At: ('<vcl.inline>' Line 6 Pos 21)
**** v1    0.1 CLI RX|                set obj.http.x-cache = "hit";
**** v1    0.1 CLI RX|--------------------################---------
**** v1    0.1 CLI RX|
**** v1    0.1 CLI RX|Running VCC-compiler failed, exited with 2
**** v1    0.1 CLI RX|VCL compilation failed
**   v1    0.1 VCL compilation failed (as expected)
***  v1    0.1 Found expected string: ("Variable 'obj.http.x-cache' is read only.")
*    top   0.1 RESETTING after ../../../bin/varnishtest/tests/r00310.vtc
**   v1    0.1 Wait
**** v1    0.1 CLI TX|backend.list
***  v1    0.2 CLI RX  101
**** v1    0.2 CLI RX|Unknown request in manager process (child not running).
**** v1    0.2 CLI RX|Type 'help' for more info.
**   v1    0.2 Stop
**** v1    0.2 CLI TX|stop
***  v1    0.2 CLI RX  300
**** v1    0.2 CLI RX|Child in state stopped
**** v1    0.2 CLI TX|status
***  v1    0.2 CLI RX  200
**** v1    0.2 CLI RX|Child in state stopped
**** v1    0.2 STDOUT poll 0x10
**   v1    0.2 R 16793 Status: 0000 (u 0.002385 s 0.010973)
*    diag  0.0 ............................................................
#    top  TEST ../../../bin/varnishtest/tests/r00310.vtc TIMED OUT (kill -9)
#    top  TEST ../../../bin/varnishtest/tests/r00310.vtc FAILED (60.001) signal=9

1 @ SunOS 5.11 i86pc 1.04 32_sun12.4 uplex

*    top   0.0 TEST ../../../bin/varnishtest/tests/r00310.vtc starting
[...]
*    top   0.0 TEST Test obj.http.x-cache in vcl_hit
[...]
**** v1    0.1 CLI TX|vcl.inline vcl1 << %XJEIFLH|)Xspa8P
**** v1    0.1 CLI TX|vcl 4.0;
**** v1    0.1 CLI TX|
**** v1    0.1 CLI TX|\tbackend foo { .host = "127.0.0.1"; }
**** v1    0.1 CLI TX|
**** v1    0.1 CLI TX|\tsub vcl_hit {
**** v1    0.1 CLI TX|\t\tset obj.http.x-cache = "hit";
**** v1    0.1 CLI TX|\t}
**** v1    0.1 CLI TX|
**** v1    0.1 CLI TX|%XJEIFLH|)Xspa8P
***  v1    0.1 CLI RX  106
**** v1    0.1 CLI RX|Message from VCC-compiler:
**** v1    0.1 CLI RX|Security: Privilege proc_setid missing, will not change uid/gid
**** v1    0.1 CLI RX|Variable 'obj.http.x-cache' is read only.
**** v1    0.1 CLI RX|At: ('<vcl.inline>' Line 6 Pos 21)
**** v1    0.1 CLI RX|                set obj.http.x-cache = "hit";
**** v1    0.1 CLI RX|--------------------################---------
**** v1    0.1 CLI RX|
**** v1    0.1 CLI RX|Running VCC-compiler failed, exited with 2
**** v1    0.1 CLI RX|VCL compilation failed
**   v1    0.1 VCL compilation failed (as expected)
***  v1    0.1 Found expected string: ("Variable 'obj.http.x-cache' is read only.")
*    top   0.1 RESETTING after ../../../bin/varnishtest/tests/r00310.vtc
**   v1    0.1 Wait
**** v1    0.1 CLI TX|backend.list
***  v1    0.1 CLI RX  101
**** v1    0.1 CLI RX|Unknown request in manager process (child not running).
**** v1    0.1 CLI RX|Type 'help' for more info.
**   v1    0.1 Stop
**** v1    0.1 CLI TX|stop
***  v1    0.1 CLI RX  300
**** v1    0.1 CLI RX|Child in state stopped
**** v1    0.1 CLI TX|status
***  v1    0.1 CLI RX  200
**** v1    0.1 CLI RX|Child in state stopped
**** v1    0.1 STDOUT poll 0x10
**   v1    0.1 R 78229 Status: 0000 (u 0.004000 s 0.015000)
*    diag  0.0 ............................................................
#    top  TEST ../../../bin/varnishtest/tests/r00310.vtc TIMED OUT (kill -9)
#    top  TEST ../../../bin/varnishtest/tests/r00310.vtc FAILED (60.002) signal=9

1 @ Linux 3.10.0 x86_64 1.02 mblissett

*    top   0.0 TEST ../../../bin/varnishtest/tests/r00310.vtc starting
[...]
*    top   0.0 TEST Test obj.http.x-cache in vcl_hit
[...]
**** v1    0.1 CLI RX|Type 'start' to launch worker process.
**** v1    0.1 CLI TX|vcl.inline vcl1 << %XJEIFLH|)Xspa8P
**** v1    0.1 CLI TX|vcl 4.0;
**** v1    0.1 CLI TX|
**** v1    0.1 CLI TX|\tbackend foo { .host = "127.0.0.1"; }
**** v1    0.1 CLI TX|
**** v1    0.1 CLI TX|\tsub vcl_hit {
**** v1    0.1 CLI TX|\t\tset obj.http.x-cache = "hit";
**** v1    0.1 CLI TX|\t}
**** v1    0.1 CLI TX|
**** v1    0.1 CLI TX|%XJEIFLH|)Xspa8P
***  v1    0.1 CLI RX  106
**** v1    0.1 CLI RX|Message from VCC-compiler:
**** v1    0.1 CLI RX|Variable 'obj.http.x-cache' is read only.
**** v1    0.1 CLI RX|At: ('<vcl.inline>' Line 6 Pos 21)
**** v1    0.1 CLI RX|                set obj.http.x-cache = "hit";
**** v1    0.1 CLI RX|--------------------################---------
**** v1    0.1 CLI RX|
**** v1    0.1 CLI RX|Running VCC-compiler failed, exited with 2
**** v1    0.1 CLI RX|VCL compilation failed
**   v1    0.1 VCL compilation failed (as expected)
***  v1    0.1 Found expected string: ("Variable 'obj.http.x-cache' is read only.")
*    top   0.1 RESETTING after ../../../bin/varnishtest/tests/r00310.vtc
**   v1    0.1 Wait
**** v1    0.1 CLI TX|backend.list
***  v1    0.2 CLI RX  101
**** v1    0.2 CLI RX|Unknown request in manager process (child not running).
**** v1    0.2 CLI RX|Type 'help' for more info.
**   v1    0.2 Stop
**** v1    0.2 CLI TX|stop
***  v1    0.2 CLI RX  300
**** v1    0.2 CLI RX|Child in state stopped
**** v1    0.2 CLI TX|status
***  v1    0.2 CLI RX  200
**** v1    0.2 CLI RX|Child in state stopped
**** v1    0.2 STDOUT poll 0x10
**   v1    0.2 R 10475 Status: 0000 (u 0.004425 s 0.014326)
*    diag  0.0 ............................................................
#    top  TEST ../../../bin/varnishtest/tests/r00310.vtc TIMED OUT (kill -9)
#    top  TEST ../../../bin/varnishtest/tests/r00310.vtc FAILED (60.002) signal=9

1 @ Linux 3.10.0 x86_64 1.02 mblissett

*    top   0.0 TEST ../../../bin/varnishtest/tests/r00310.vtc starting
[...]
*    top   0.0 TEST Test obj.http.x-cache in vcl_hit
[...]
**** v1    0.1 CLI RX|Type 'start' to launch worker process.
**** v1    0.1 CLI TX|vcl.inline vcl1 << %XJEIFLH|)Xspa8P
**** v1    0.1 CLI TX|vcl 4.0;
**** v1    0.1 CLI TX|
**** v1    0.1 CLI TX|\tbackend foo { .host = "127.0.0.1"; }
**** v1    0.1 CLI TX|
**** v1    0.1 CLI TX|\tsub vcl_hit {
**** v1    0.1 CLI TX|\t\tset obj.http.x-cache = "hit";
**** v1    0.1 CLI TX|\t}
**** v1    0.1 CLI TX|
**** v1    0.1 CLI TX|%XJEIFLH|)Xspa8P
***  v1    0.1 CLI RX  106
**** v1    0.1 CLI RX|Message from VCC-compiler:
**** v1    0.1 CLI RX|Variable 'obj.http.x-cache' is read only.
**** v1    0.1 CLI RX|At: ('<vcl.inline>' Line 6 Pos 21)
**** v1    0.1 CLI RX|                set obj.http.x-cache = "hit";
**** v1    0.1 CLI RX|--------------------################---------
**** v1    0.1 CLI RX|
**** v1    0.1 CLI RX|Running VCC-compiler failed, exited with 2
**** v1    0.1 CLI RX|VCL compilation failed
**   v1    0.1 VCL compilation failed (as expected)
***  v1    0.1 Found expected string: ("Variable 'obj.http.x-cache' is read only.")
*    top   0.1 RESETTING after ../../../bin/varnishtest/tests/r00310.vtc
**   v1    0.1 Wait
**** v1    0.1 CLI TX|backend.list
***  v1    0.2 CLI RX  101
**** v1    0.2 CLI RX|Unknown request in manager process (child not running).
**** v1    0.2 CLI RX|Type 'help' for more info.
**   v1    0.2 Stop
**** v1    0.2 CLI TX|stop
***  v1    0.2 CLI RX  300
**** v1    0.2 CLI RX|Child in state stopped
**** v1    0.2 CLI TX|status
***  v1    0.2 CLI RX  200
**** v1    0.2 CLI RX|Child in state stopped
**** v1    0.2 STDOUT poll 0x10
**   v1    0.2 R 9608 Status: 0000 (u 0.004254 s 0.014884)
*    diag  0.0 ............................................................
#    top  TEST ../../../bin/varnishtest/tests/r00310.vtc TIMED OUT (kill -9)
#    top  TEST ../../../bin/varnishtest/tests/r00310.vtc FAILED (60.002) signal=9

1 @ SunOS 5.11 i86pc 1.04 32_gcc4.7 uplex

*    top   0.0 TEST ../../../bin/varnishtest/tests/r00310.vtc starting
[...]
*    top   0.0 TEST Test obj.http.x-cache in vcl_hit
[...]
**** v1    0.1 CLI TX|vcl.inline vcl1 << %XJEIFLH|)Xspa8P
**** v1    0.1 CLI TX|vcl 4.0;
**** v1    0.1 CLI TX|
**** v1    0.1 CLI TX|\tbackend foo { .host = "127.0.0.1"; }
**** v1    0.1 CLI TX|
**** v1    0.1 CLI TX|\tsub vcl_hit {
**** v1    0.1 CLI TX|\t\tset obj.http.x-cache = "hit";
**** v1    0.1 CLI TX|\t}
**** v1    0.1 CLI TX|
**** v1    0.1 CLI TX|%XJEIFLH|)Xspa8P
***  v1    0.1 CLI RX  106
**** v1    0.1 CLI RX|Message from VCC-compiler:
**** v1    0.1 CLI RX|Security: Privilege proc_setid missing, will not change uid/gid
**** v1    0.1 CLI RX|Variable 'obj.http.x-cache' is read only.
**** v1    0.1 CLI RX|At: ('<vcl.inline>' Line 6 Pos 21)
**** v1    0.1 CLI RX|                set obj.http.x-cache = "hit";
**** v1    0.1 CLI RX|--------------------################---------
**** v1    0.1 CLI RX|
**** v1    0.1 CLI RX|Running VCC-compiler failed, exited with 2
**** v1    0.1 CLI RX|VCL compilation failed
**   v1    0.1 VCL compilation failed (as expected)
***  v1    0.1 Found expected string: ("Variable 'obj.http.x-cache' is read only.")
*    top   0.1 RESETTING after ../../../bin/varnishtest/tests/r00310.vtc
**   v1    0.1 Wait
**** v1    0.1 CLI TX|backend.list
***  v1    0.1 CLI RX  101
**** v1    0.1 CLI RX|Unknown request in manager process (child not running).
**** v1    0.1 CLI RX|Type 'help' for more info.
**   v1    0.1 Stop
**** v1    0.1 CLI TX|stop
***  v1    0.1 CLI RX  300
**** v1    0.1 CLI RX|Child in state stopped
**** v1    0.1 CLI TX|status
***  v1    0.1 CLI RX  200
**** v1    0.1 CLI RX|Child in state stopped
**** v1    0.1 STDOUT poll 0x10
**   v1    0.1 R 16085 Status: 0000 (u 0.004000 s 0.017000)
*    diag  0.0 ............................................................
#    top  TEST ../../../bin/varnishtest/tests/r00310.vtc TIMED OUT (kill -9)
#    top  TEST ../../../bin/varnishtest/tests/r00310.vtc FAILED (60.002) signal=9

1 @ Linux 3.10.0 x86_64 1.02 mblissett

*    top   0.0 TEST ../../../bin/varnishtest/tests/r00310.vtc starting
[...]
*    top   0.0 TEST Test obj.http.x-cache in vcl_hit
[...]
**** v1    0.1 CLI RX|Type 'start' to launch worker process.
**** v1    0.1 CLI TX|vcl.inline vcl1 << %XJEIFLH|)Xspa8P
**** v1    0.1 CLI TX|vcl 4.0;
**** v1    0.1 CLI TX|
**** v1    0.1 CLI TX|\tbackend foo { .host = "127.0.0.1"; }
**** v1    0.1 CLI TX|
**** v1    0.1 CLI TX|\tsub vcl_hit {
**** v1    0.1 CLI TX|\t\tset obj.http.x-cache = "hit";
**** v1    0.1 CLI TX|\t}
**** v1    0.1 CLI TX|
**** v1    0.1 CLI TX|%XJEIFLH|)Xspa8P
***  v1    0.1 CLI RX  106
**** v1    0.1 CLI RX|Message from VCC-compiler:
**** v1    0.1 CLI RX|Variable 'obj.http.x-cache' is read only.
**** v1    0.1 CLI RX|At: ('<vcl.inline>' Line 6 Pos 21)
**** v1    0.1 CLI RX|                set obj.http.x-cache = "hit";
**** v1    0.1 CLI RX|--------------------################---------
**** v1    0.1 CLI RX|
**** v1    0.1 CLI RX|Running VCC-compiler failed, exited with 2
**** v1    0.1 CLI RX|VCL compilation failed
**   v1    0.1 VCL compilation failed (as expected)
***  v1    0.1 Found expected string: ("Variable 'obj.http.x-cache' is read only.")
*    top   0.1 RESETTING after ../../../bin/varnishtest/tests/r00310.vtc
**   v1    0.1 Wait
**** v1    0.1 CLI TX|backend.list
***  v1    0.2 CLI RX  101
**** v1    0.2 CLI RX|Unknown request in manager process (child not running).
**** v1    0.2 CLI RX|Type 'help' for more info.
**   v1    0.2 Stop
**** v1    0.2 CLI TX|stop
***  v1    0.2 CLI RX  300
**** v1    0.2 CLI RX|Child in state stopped
**** v1    0.2 CLI TX|status
***  v1    0.2 CLI RX  200
**** v1    0.2 CLI RX|Child in state stopped
**** v1    0.2 STDOUT poll 0x10
**   v1    0.2 R 3378 Status: 0000 (u 0.003151 s 0.019417)
*    diag  0.0 ............................................................
#    top  TEST ../../../bin/varnishtest/tests/r00310.vtc TIMED OUT (kill -9)
#    top  TEST ../../../bin/varnishtest/tests/r00310.vtc FAILED (60.001) signal=9

1 @ SunOS 5.11 i86pc 1.04 64_gcc4.7 uplex

*    top   0.0 TEST ../../../bin/varnishtest/tests/r00310.vtc starting
[...]
*    top   0.0 TEST Test obj.http.x-cache in vcl_hit
[...]
**** v1    0.1 CLI TX|vcl.inline vcl1 << %XJEIFLH|)Xspa8P
**** v1    0.1 CLI TX|vcl 4.0;
**** v1    0.1 CLI TX|
**** v1    0.1 CLI TX|\tbackend foo { .host = "127.0.0.1"; }
**** v1    0.1 CLI TX|
**** v1    0.1 CLI TX|\tsub vcl_hit {
**** v1    0.1 CLI TX|\t\tset obj.http.x-cache = "hit";
**** v1    0.1 CLI TX|\t}
**** v1    0.1 CLI TX|
**** v1    0.1 CLI TX|%XJEIFLH|)Xspa8P
***  v1    0.1 CLI RX  106
**** v1    0.1 CLI RX|Message from VCC-compiler:
**** v1    0.1 CLI RX|Security: Privilege proc_setid missing, will not change uid/gid
**** v1    0.1 CLI RX|Variable 'obj.http.x-cache' is read only.
**** v1    0.1 CLI RX|At: ('<vcl.inline>' Line 6 Pos 21)
**** v1    0.1 CLI RX|                set obj.http.x-cache = "hit";
**** v1    0.1 CLI RX|--------------------################---------
**** v1    0.1 CLI RX|
**** v1    0.1 CLI RX|Running VCC-compiler failed, exited with 2
**** v1    0.1 CLI RX|VCL compilation failed
**   v1    0.1 VCL compilation failed (as expected)
***  v1    0.1 Found expected string: ("Variable 'obj.http.x-cache' is read only.")
*    top   0.1 RESETTING after ../../../bin/varnishtest/tests/r00310.vtc
**   v1    0.1 Wait
**** v1    0.1 CLI TX|backend.list
***  v1    0.1 CLI RX  101
**** v1    0.1 CLI RX|Unknown request in manager process (child not running).
**** v1    0.1 CLI RX|Type 'help' for more info.
**   v1    0.1 Stop
**** v1    0.1 CLI TX|stop
***  v1    0.1 CLI RX  300
**** v1    0.1 CLI RX|Child in state stopped
**** v1    0.1 CLI TX|status
***  v1    0.1 CLI RX  200
**** v1    0.1 CLI RX|Child in state stopped
**** v1    0.1 STDOUT poll 0x10
**   v1    0.1 R 3932 Status: 0000 (u 0.007000 s 0.023000)
*    diag  0.0 ............................................................
#    top  TEST ../../../bin/varnishtest/tests/r00310.vtc TIMED OUT (kill -9)
#    top  TEST ../../../bin/varnishtest/tests/r00310.vtc FAILED (60.004) signal=9

1 @ SunOS 5.11 i86pc 1.04 64_sun12.4 uplex

*    top   0.0 TEST ../../../bin/varnishtest/tests/r00310.vtc starting
[...]
*    top   0.0 TEST Test obj.http.x-cache in vcl_hit
[...]
**** v1    0.1 CLI TX|vcl.inline vcl1 << %XJEIFLH|)Xspa8P
**** v1    0.1 CLI TX|vcl 4.0;
**** v1    0.1 CLI TX|
**** v1    0.1 CLI TX|\tbackend foo { .host = "127.0.0.1"; }
**** v1    0.1 CLI TX|
**** v1    0.1 CLI TX|\tsub vcl_hit {
**** v1    0.1 CLI TX|\t\tset obj.http.x-cache = "hit";
**** v1    0.1 CLI TX|\t}
**** v1    0.1 CLI TX|
**** v1    0.1 CLI TX|%XJEIFLH|)Xspa8P
***  v1    0.1 CLI RX  106
**** v1    0.1 CLI RX|Message from VCC-compiler:
**** v1    0.1 CLI RX|Security: Privilege proc_setid missing, will not change uid/gid
**** v1    0.1 CLI RX|Variable 'obj.http.x-cache' is read only.
**** v1    0.1 CLI RX|At: ('<vcl.inline>' Line 6 Pos 21)
**** v1    0.1 CLI RX|                set obj.http.x-cache = "hit";
**** v1    0.1 CLI RX|--------------------################---------
**** v1    0.1 CLI RX|
**** v1    0.1 CLI RX|Running VCC-compiler failed, exited with 2
**** v1    0.1 CLI RX|VCL compilation failed
**   v1    0.1 VCL compilation failed (as expected)
***  v1    0.1 Found expected string: ("Variable 'obj.http.x-cache' is read only.")
*    top   0.1 RESETTING after ../../../bin/varnishtest/tests/r00310.vtc
**   v1    0.1 Wait
**** v1    0.1 CLI TX|backend.list
***  v1    0.1 CLI RX  101
**** v1    0.1 CLI RX|Unknown request in manager process (child not running).
**** v1    0.1 CLI RX|Type 'help' for more info.
**   v1    0.1 Stop
**** v1    0.1 CLI TX|stop
***  v1    0.1 CLI RX  300
**** v1    0.1 CLI RX|Child in state stopped
**** v1    0.1 CLI TX|status
***  v1    0.1 CLI RX  200
**** v1    0.1 CLI RX|Child in state stopped
**** v1    0.1 STDOUT poll 0x10
**   v1    0.1 R 62923 Status: 0000 (u 0.006000 s 0.021000)
*    diag  0.0 ............................................................
#    top  TEST ../../../bin/varnishtest/tests/r00310.vtc TIMED OUT (kill -9)
#    top  TEST ../../../bin/varnishtest/tests/r00310.vtc FAILED (60.004) signal=9

1 @ SunOS 5.11 i86pc 1.04 64_gcc4.7 uplex

*    top   0.0 TEST ../../../bin/varnishtest/tests/r00310.vtc starting
[...]
*    top   0.0 TEST Test obj.http.x-cache in vcl_hit
[...]
**** v1    0.1 CLI TX|vcl.inline vcl1 << %XJEIFLH|)Xspa8P
**** v1    0.1 CLI TX|vcl 4.0;
**** v1    0.1 CLI TX|
**** v1    0.1 CLI TX|\tbackend foo { .host = "127.0.0.1"; }
**** v1    0.1 CLI TX|
**** v1    0.1 CLI TX|\tsub vcl_hit {
**** v1    0.1 CLI TX|\t\tset obj.http.x-cache = "hit";
**** v1    0.1 CLI TX|\t}
**** v1    0.1 CLI TX|
**** v1    0.1 CLI TX|%XJEIFLH|)Xspa8P
***  v1    0.2 CLI RX  106
**** v1    0.2 CLI RX|Message from VCC-compiler:
**** v1    0.2 CLI RX|Security: Privilege proc_setid missing, will not change uid/gid
**** v1    0.2 CLI RX|Variable 'obj.http.x-cache' is read only.
**** v1    0.2 CLI RX|At: ('<vcl.inline>' Line 6 Pos 21)
**** v1    0.2 CLI RX|                set obj.http.x-cache = "hit";
**** v1    0.2 CLI RX|--------------------################---------
**** v1    0.2 CLI RX|
**** v1    0.2 CLI RX|Running VCC-compiler failed, exited with 2
**** v1    0.2 CLI RX|VCL compilation failed
**   v1    0.2 VCL compilation failed (as expected)
***  v1    0.2 Found expected string: ("Variable 'obj.http.x-cache' is read only.")
*    top   0.2 RESETTING after ../../../bin/varnishtest/tests/r00310.vtc
**   v1    0.2 Wait
**** v1    0.2 CLI TX|backend.list
***  v1    0.2 CLI RX  101
**** v1    0.2 CLI RX|Unknown request in manager process (child not running).
**** v1    0.2 CLI RX|Type 'help' for more info.
**   v1    0.2 Stop
**** v1    0.2 CLI TX|stop
***  v1    0.2 CLI RX  300
**** v1    0.2 CLI RX|Child in state stopped
**** v1    0.2 CLI TX|status
***  v1    0.2 CLI RX  200
**** v1    0.2 CLI RX|Child in state stopped
**** v1    0.2 STDOUT poll 0x10
**   v1    0.2 R 74963 Status: 0000 (u 0.010000 s 0.032000)
*    diag  0.0 ............................................................
#    top  TEST ../../../bin/varnishtest/tests/r00310.vtc TIMED OUT (kill -9)
#    top  TEST ../../../bin/varnishtest/tests/r00310.vtc FAILED (60.005) signal=9

1 @ Ubuntu LTS i686 1.04 fgs

*    top   0.0 TEST ../../../bin/varnishtest/tests/r00310.vtc starting
[...]
*    top   0.0 TEST Test obj.http.x-cache in vcl_hit
[...]
**** v1    0.1 CLI RX|Type 'start' to launch worker process.
**** v1    0.1 CLI TX|vcl.inline vcl1 << %XJEIFLH|)Xspa8P
**** v1    0.1 CLI TX|vcl 4.0;
**** v1    0.1 CLI TX|
**** v1    0.1 CLI TX|\tbackend foo { .host = "127.0.0.1"; }
**** v1    0.1 CLI TX|
**** v1    0.1 CLI TX|\tsub vcl_hit {
**** v1    0.1 CLI TX|\t\tset obj.http.x-cache = "hit";
**** v1    0.1 CLI TX|\t}
**** v1    0.1 CLI TX|
**** v1    0.1 CLI TX|%XJEIFLH|)Xspa8P
***  v1    0.1 CLI RX  106
**** v1    0.1 CLI RX|Message from VCC-compiler:
**** v1    0.1 CLI RX|Variable 'obj.http.x-cache' is read only.
**** v1    0.1 CLI RX|At: ('<vcl.inline>' Line 6 Pos 21)
**** v1    0.1 CLI RX|                set obj.http.x-cache = "hit";
**** v1    0.1 CLI RX|--------------------################---------
**** v1    0.1 CLI RX|
**** v1    0.1 CLI RX|Running VCC-compiler failed, exited with 2
**** v1    0.1 CLI RX|VCL compilation failed
**   v1    0.1 VCL compilation failed (as expected)
***  v1    0.1 Found expected string: ("Variable 'obj.http.x-cache' is read only.")
*    top   0.1 RESETTING after ../../../bin/varnishtest/tests/r00310.vtc
**   v1    0.1 Wait
**** v1    0.1 CLI TX|backend.list
***  v1    0.1 CLI RX  101
**** v1    0.1 CLI RX|Unknown request in manager process (child not running).
**** v1    0.1 CLI RX|Type 'help' for more info.
**   v1    0.1 Stop
**** v1    0.1 CLI TX|stop
***  v1    0.2 CLI RX  300
**** v1    0.2 CLI RX|Child in state stopped
**** v1    0.2 CLI TX|status
***  v1    0.2 CLI RX  200
**** v1    0.2 CLI RX|Child in state stopped
**** v1    0.2 STDOUT poll 0x10
**   v1    0.2 R 14671 Status: 0000 (u 0.000000 s 0.004000)
*    diag  0.0 ............................................................
#    top  TEST ../../../bin/varnishtest/tests/r00310.vtc TIMED OUT (kill -9)
#    top  TEST ../../../bin/varnishtest/tests/r00310.vtc FAILED (60.001) signal=9

1 @ SunOS 5.11 i86pc 1.04 64_sun12.4 uplex

*    top   0.0 TEST ../../../bin/varnishtest/tests/r00310.vtc starting
[...]
*    top   0.0 TEST Test obj.http.x-cache in vcl_hit
[...]
**** v1    0.1 CLI TX|vcl.inline vcl1 << %XJEIFLH|)Xspa8P
**** v1    0.1 CLI TX|vcl 4.0;
**** v1    0.1 CLI TX|
**** v1    0.1 CLI TX|\tbackend foo { .host = "127.0.0.1"; }
**** v1    0.1 CLI TX|
**** v1    0.1 CLI TX|\tsub vcl_hit {
**** v1    0.1 CLI TX|\t\tset obj.http.x-cache = "hit";
**** v1    0.1 CLI TX|\t}
**** v1    0.1 CLI TX|
**** v1    0.1 CLI TX|%XJEIFLH|)Xspa8P
***  v1    0.1 CLI RX  106
**** v1    0.1 CLI RX|Message from VCC-compiler:
**** v1    0.1 CLI RX|Security: Privilege proc_setid missing, will not change uid/gid
**** v1    0.1 CLI RX|Variable 'obj.http.x-cache' is read only.
**** v1    0.1 CLI RX|At: ('<vcl.inline>' Line 6 Pos 21)
**** v1    0.1 CLI RX|                set obj.http.x-cache = "hit";
**** v1    0.1 CLI RX|--------------------################---------
**** v1    0.1 CLI RX|
**** v1    0.1 CLI RX|Running VCC-compiler failed, exited with 2
**** v1    0.1 CLI RX|VCL compilation failed
**   v1    0.1 VCL compilation failed (as expected)
***  v1    0.1 Found expected string: ("Variable 'obj.http.x-cache' is read only.")
*    top   0.1 RESETTING after ../../../bin/varnishtest/tests/r00310.vtc
**   v1    0.1 Wait
**** v1    0.1 CLI TX|backend.list
***  v1    0.1 CLI RX  101
**** v1    0.1 CLI RX|Unknown request in manager process (child not running).
**** v1    0.1 CLI RX|Type 'help' for more info.
**   v1    0.1 Stop
**** v1    0.1 CLI TX|stop
***  v1    0.1 CLI RX  300
**** v1    0.1 CLI RX|Child in state stopped
**** v1    0.1 CLI TX|status
***  v1    0.1 CLI RX  200
**** v1    0.1 CLI RX|Child in state stopped
**** v1    0.1 STDOUT poll 0x10
**   v1    0.1 R 15647 Status: 0000 (u 0.007000 s 0.023000)
*    diag  0.0 ............................................................
#    top  TEST ../../../bin/varnishtest/tests/r00310.vtc TIMED OUT (kill -9)
#    top  TEST ../../../bin/varnishtest/tests/r00310.vtc FAILED (60.004) signal=9

1 @ SunOS 5.11 i86pc 1.04 32_gcc4.7 uplex

*    top   0.0 TEST ../../../bin/varnishtest/tests/r00310.vtc starting
[...]
*    top   0.0 TEST Test obj.http.x-cache in vcl_hit
[...]
**** v1    0.1 CLI TX|vcl.inline vcl1 << %XJEIFLH|)Xspa8P
**** v1    0.1 CLI TX|vcl 4.0;
**** v1    0.1 CLI TX|
**** v1    0.1 CLI TX|\tbackend foo { .host = "127.0.0.1"; }
**** v1    0.1 CLI TX|
**** v1    0.1 CLI TX|\tsub vcl_hit {
**** v1    0.1 CLI TX|\t\tset obj.http.x-cache = "hit";
**** v1    0.1 CLI TX|\t}
**** v1    0.1 CLI TX|
**** v1    0.1 CLI TX|%XJEIFLH|)Xspa8P
***  v1    0.1 CLI RX  106
**** v1    0.1 CLI RX|Message from VCC-compiler:
**** v1    0.1 CLI RX|Security: Privilege proc_setid missing, will not change uid/gid
**** v1    0.1 CLI RX|Variable 'obj.http.x-cache' is read only.
**** v1    0.1 CLI RX|At: ('<vcl.inline>' Line 6 Pos 21)
**** v1    0.1 CLI RX|                set obj.http.x-cache = "hit";
**** v1    0.1 CLI RX|--------------------################---------
**** v1    0.1 CLI RX|
**** v1    0.1 CLI RX|Running VCC-compiler failed, exited with 2
**** v1    0.1 CLI RX|VCL compilation failed
**   v1    0.1 VCL compilation failed (as expected)
***  v1    0.1 Found expected string: ("Variable 'obj.http.x-cache' is read only.")
*    top   0.1 RESETTING after ../../../bin/varnishtest/tests/r00310.vtc
**   v1    0.1 Wait
**** v1    0.1 CLI TX|backend.list
***  v1    0.1 CLI RX  101
**** v1    0.1 CLI RX|Unknown request in manager process (child not running).
**** v1    0.1 CLI RX|Type 'help' for more info.
**   v1    0.1 Stop
**** v1    0.1 CLI TX|stop
***  v1    0.1 CLI RX  300
**** v1    0.1 CLI RX|Child in state stopped
**** v1    0.1 CLI TX|status
***  v1    0.1 CLI RX  200
**** v1    0.1 CLI RX|Child in state stopped
**** v1    0.1 STDOUT poll 0x10
**   v1    0.1 R 66488 Status: 0000 (u 0.005000 s 0.020000)
*    diag  0.0 ............................................................
#    top  TEST ../../../bin/varnishtest/tests/r00310.vtc TIMED OUT (kill -9)
#    top  TEST ../../../bin/varnishtest/tests/r00310.vtc FAILED (60.003) signal=9

1 @ SunOS 5.11 i86pc 1.04 32_gcc4.7 uplex

*    top   0.0 TEST ../../../bin/varnishtest/tests/r00310.vtc starting
[...]
*    top   0.0 TEST Test obj.http.x-cache in vcl_hit
[...]
**** v1    0.1 CLI TX|vcl.inline vcl1 << %XJEIFLH|)Xspa8P
**** v1    0.1 CLI TX|vcl 4.0;
**** v1    0.1 CLI TX|
**** v1    0.1 CLI TX|\tbackend foo { .host = "127.0.0.1"; }
**** v1    0.1 CLI TX|
**** v1    0.1 CLI TX|\tsub vcl_hit {
**** v1    0.1 CLI TX|\t\tset obj.http.x-cache = "hit";
**** v1    0.1 CLI TX|\t}
**** v1    0.1 CLI TX|
**** v1    0.1 CLI TX|%XJEIFLH|)Xspa8P
***  v1    0.1 CLI RX  106
**** v1    0.1 CLI RX|Message from VCC-compiler:
**** v1    0.1 CLI RX|Security: Privilege proc_setid missing, will not change uid/gid
**** v1    0.1 CLI RX|Variable 'obj.http.x-cache' is read only.
**** v1    0.1 CLI RX|At: ('<vcl.inline>' Line 6 Pos 21)
**** v1    0.1 CLI RX|                set obj.http.x-cache = "hit";
**** v1    0.1 CLI RX|--------------------################---------
**** v1    0.1 CLI RX|
**** v1    0.1 CLI RX|Running VCC-compiler failed, exited with 2
**** v1    0.1 CLI RX|VCL compilation failed
**   v1    0.1 VCL compilation failed (as expected)
***  v1    0.1 Found expected string: ("Variable 'obj.http.x-cache' is read only.")
*    top   0.1 RESETTING after ../../../bin/varnishtest/tests/r00310.vtc
**   v1    0.1 Wait
**** v1    0.1 CLI TX|backend.list
***  v1    0.1 CLI RX  101
**** v1    0.1 CLI RX|Unknown request in manager process (child not running).
**** v1    0.1 CLI RX|Type 'help' for more info.
**   v1    0.1 Stop
**** v1    0.1 CLI TX|stop
***  v1    0.1 CLI RX  300
**** v1    0.1 CLI RX|Child in state stopped
**** v1    0.1 CLI TX|status
***  v1    0.1 CLI RX  200
**** v1    0.1 CLI RX|Child in state stopped
**** v1    0.1 STDOUT poll 0x10
**   v1    0.1 R 64848 Status: 0000 (u 0.004000 s 0.016000)
*    diag  0.0 ............................................................
#    top  TEST ../../../bin/varnishtest/tests/r00310.vtc TIMED OUT (kill -9)
#    top  TEST ../../../bin/varnishtest/tests/r00310.vtc FAILED (60.002) signal=9

1 @ SunOS 5.11 i86pc 1.04 32_gcc4.7 uplex

*    top   0.0 TEST ../../../bin/varnishtest/tests/r00310.vtc starting
[...]
*    top   0.0 TEST Test obj.http.x-cache in vcl_hit
[...]
**** v1    0.1 CLI TX|vcl.inline vcl1 << %XJEIFLH|)Xspa8P
**** v1    0.1 CLI TX|vcl 4.0;
**** v1    0.1 CLI TX|
**** v1    0.1 CLI TX|\tbackend foo { .host = "127.0.0.1"; }
**** v1    0.1 CLI TX|
**** v1    0.1 CLI TX|\tsub vcl_hit {
**** v1    0.1 CLI TX|\t\tset obj.http.x-cache = "hit";
**** v1    0.1 CLI TX|\t}
**** v1    0.1 CLI TX|
**** v1    0.1 CLI TX|%XJEIFLH|)Xspa8P
***  v1    0.1 CLI RX  106
**** v1    0.1 CLI RX|Message from VCC-compiler:
**** v1    0.1 CLI RX|Security: Privilege proc_setid missing, will not change uid/gid
**** v1    0.1 CLI RX|Variable 'obj.http.x-cache' is read only.
**** v1    0.1 CLI RX|At: ('<vcl.inline>' Line 6 Pos 21)
**** v1    0.1 CLI RX|                set obj.http.x-cache = "hit";
**** v1    0.1 CLI RX|--------------------################---------
**** v1    0.1 CLI RX|
**** v1    0.1 CLI RX|Running VCC-compiler failed, exited with 2
**** v1    0.1 CLI RX|VCL compilation failed
**   v1    0.1 VCL compilation failed (as expected)
***  v1    0.1 Found expected string: ("Variable 'obj.http.x-cache' is read only.")
*    top   0.1 RESETTING after ../../../bin/varnishtest/tests/r00310.vtc
**   v1    0.1 Wait
**** v1    0.1 CLI TX|backend.list
***  v1    0.1 CLI RX  101
**** v1    0.1 CLI RX|Unknown request in manager process (child not running).
**** v1    0.1 CLI RX|Type 'help' for more info.
**   v1    0.1 Stop
**** v1    0.1 CLI TX|stop
***  v1    0.1 CLI RX  300
**** v1    0.1 CLI RX|Child in state stopped
**** v1    0.1 CLI TX|status
***  v1    0.1 CLI RX  200
**** v1    0.1 CLI RX|Child in state stopped
**** v1    0.1 STDOUT poll 0x10
**   v1    0.1 R 12373 Status: 0000 (u 0.004000 s 0.016000)
*    diag  0.0 ............................................................
#    top  TEST ../../../bin/varnishtest/tests/r00310.vtc TIMED OUT (kill -9)
#    top  TEST ../../../bin/varnishtest/tests/r00310.vtc FAILED (60.002) signal=9

1 @ SunOS 5.11 i86pc 1.04 64_gcc4.7 uplex

*    top   0.0 TEST ../../../bin/varnishtest/tests/r00310.vtc starting
[...]
*    top   0.0 TEST Test obj.http.x-cache in vcl_hit
[...]
**** v1    0.1 CLI TX|vcl.inline vcl1 << %XJEIFLH|)Xspa8P
**** v1    0.1 CLI TX|vcl 4.0;
**** v1    0.1 CLI TX|
**** v1    0.1 CLI TX|\tbackend foo { .host = "127.0.0.1"; }
**** v1    0.1 CLI TX|
**** v1    0.1 CLI TX|\tsub vcl_hit {
**** v1    0.1 CLI TX|\t\tset obj.http.x-cache = "hit";
**** v1    0.1 CLI TX|\t}
**** v1    0.1 CLI TX|
**** v1    0.1 CLI TX|%XJEIFLH|)Xspa8P
***  v1    0.1 CLI RX  106
**** v1    0.1 CLI RX|Message from VCC-compiler:
**** v1    0.1 CLI RX|Security: Privilege proc_setid missing, will not change uid/gid
**** v1    0.1 CLI RX|Variable 'obj.http.x-cache' is read only.
**** v1    0.1 CLI RX|At: ('<vcl.inline>' Line 6 Pos 21)
**** v1    0.1 CLI RX|                set obj.http.x-cache = "hit";
**** v1    0.1 CLI RX|--------------------################---------
**** v1    0.1 CLI RX|
**** v1    0.1 CLI RX|Running VCC-compiler failed, exited with 2
**** v1    0.1 CLI RX|VCL compilation failed
**   v1    0.1 VCL compilation failed (as expected)
***  v1    0.1 Found expected string: ("Variable 'obj.http.x-cache' is read only.")
*    top   0.1 RESETTING after ../../../bin/varnishtest/tests/r00310.vtc
**   v1    0.1 Wait
**** v1    0.1 CLI TX|backend.list
***  v1    0.1 CLI RX  101
**** v1    0.1 CLI RX|Unknown request in manager process (child not running).
**** v1    0.1 CLI RX|Type 'help' for more info.
**   v1    0.1 Stop
**** v1    0.1 CLI TX|stop
***  v1    0.1 CLI RX  300
**** v1    0.1 CLI RX|Child in state stopped
**** v1    0.1 CLI TX|status
***  v1    0.1 CLI RX  200
**** v1    0.1 CLI RX|Child in state stopped
**** v1    0.1 STDOUT poll 0x10
**   v1    0.1 R 64121 Status: 0000 (u 0.007000 s 0.023000)
*    diag  0.0 ............................................................
#    top  TEST ../../../bin/varnishtest/tests/r00310.vtc TIMED OUT (kill -9)
#    top  TEST ../../../bin/varnishtest/tests/r00310.vtc FAILED (60.004) signal=9

1 @ Linux 3.10.0 x86_64 1.02 mblissett

*    top   0.0 TEST ../../../bin/varnishtest/tests/r00310.vtc starting
[...]
*    top   0.0 TEST Test obj.http.x-cache in vcl_hit
[...]
**** v1    0.1 CLI RX|Type 'start' to launch worker process.
**** v1    0.1 CLI TX|vcl.inline vcl1 << %XJEIFLH|)Xspa8P
**** v1    0.1 CLI TX|vcl 4.0;
**** v1    0.1 CLI TX|
**** v1    0.1 CLI TX|\tbackend foo { .host = "127.0.0.1"; }
**** v1    0.1 CLI TX|
**** v1    0.1 CLI TX|\tsub vcl_hit {
**** v1    0.1 CLI TX|\t\tset obj.http.x-cache = "hit";
**** v1    0.1 CLI TX|\t}
**** v1    0.1 CLI TX|
**** v1    0.1 CLI TX|%XJEIFLH|)Xspa8P
***  v1    0.1 CLI RX  106
**** v1    0.1 CLI RX|Message from VCC-compiler:
**** v1    0.1 CLI RX|Variable 'obj.http.x-cache' is read only.
**** v1    0.1 CLI RX|At: ('<vcl.inline>' Line 6 Pos 21)
**** v1    0.1 CLI RX|                set obj.http.x-cache = "hit";
**** v1    0.1 CLI RX|--------------------################---------
**** v1    0.1 CLI RX|
**** v1    0.1 CLI RX|Running VCC-compiler failed, exited with 2
**** v1    0.1 CLI RX|VCL compilation failed
**   v1    0.1 VCL compilation failed (as expected)
***  v1    0.1 Found expected string: ("Variable 'obj.http.x-cache' is read only.")
*    top   0.1 RESETTING after ../../../bin/varnishtest/tests/r00310.vtc
**   v1    0.1 Wait
**** v1    0.1 CLI TX|backend.list
***  v1    0.2 CLI RX  101
**** v1    0.2 CLI RX|Unknown request in manager process (child not running).
**** v1    0.2 CLI RX|Type 'help' for more info.
**   v1    0.2 Stop
**** v1    0.2 CLI TX|stop
***  v1    0.2 CLI RX  300
**** v1    0.2 CLI RX|Child in state stopped
**** v1    0.2 CLI TX|status
***  v1    0.2 CLI RX  200
**** v1    0.2 CLI RX|Child in state stopped
**** v1    0.2 STDOUT poll 0x10
**   v1    0.2 R 7116 Status: 0000 (u 0.004360 s 0.009891)
*    diag  0.0 ............................................................
#    top  TEST ../../../bin/varnishtest/tests/r00310.vtc TIMED OUT (kill -9)
#    top  TEST ../../../bin/varnishtest/tests/r00310.vtc FAILED (60.001) signal=9

1 @ SunOS 5.11 i86pc 1.04 32_gcc4.7 uplex

*    top   0.0 TEST ../../../bin/varnishtest/tests/r00310.vtc starting
[...]
*    top   0.0 TEST Test obj.http.x-cache in vcl_hit
[...]
**** v1    0.1 CLI TX|vcl.inline vcl1 << %XJEIFLH|)Xspa8P
**** v1    0.1 CLI TX|vcl 4.0;
**** v1    0.1 CLI TX|
**** v1    0.1 CLI TX|\tbackend foo { .host = "127.0.0.1"; }
**** v1    0.1 CLI TX|
**** v1    0.1 CLI TX|\tsub vcl_hit {
**** v1    0.1 CLI TX|\t\tset obj.http.x-cache = "hit";
**** v1    0.1 CLI TX|\t}
**** v1    0.1 CLI TX|
**** v1    0.1 CLI TX|%XJEIFLH|)Xspa8P
***  v1    0.1 CLI RX  106
**** v1    0.1 CLI RX|Message from VCC-compiler:
**** v1    0.1 CLI RX|Security: Privilege proc_setid missing, will not change uid/gid
**** v1    0.1 CLI RX|Variable 'obj.http.x-cache' is read only.
**** v1    0.1 CLI RX|At: ('<vcl.inline>' Line 6 Pos 21)
**** v1    0.1 CLI RX|                set obj.http.x-cache = "hit";
**** v1    0.1 CLI RX|--------------------################---------
**** v1    0.1 CLI RX|
**** v1    0.1 CLI RX|Running VCC-compiler failed, exited with 2
**** v1    0.1 CLI RX|VCL compilation failed
**   v1    0.1 VCL compilation failed (as expected)
***  v1    0.1 Found expected string: ("Variable 'obj.http.x-cache' is read only.")
*    top   0.1 RESETTING after ../../../bin/varnishtest/tests/r00310.vtc
**   v1    0.1 Wait
**** v1    0.1 CLI TX|backend.list
***  v1    0.1 CLI RX  101
**** v1    0.1 CLI RX|Unknown request in manager process (child not running).
**** v1    0.1 CLI RX|Type 'help' for more info.
**   v1    0.1 Stop
**** v1    0.1 CLI TX|stop
***  v1    0.1 CLI RX  300
**** v1    0.1 CLI RX|Child in state stopped
**** v1    0.1 CLI TX|status
***  v1    0.1 CLI RX  200
**** v1    0.1 CLI RX|Child in state stopped
**** v1    0.1 STDOUT poll 0x10
**   v1    0.1 R 46287 Status: 0000 (u 0.004000 s 0.020000)
*    diag  0.0 ............................................................
#    top  TEST ../../../bin/varnishtest/tests/r00310.vtc TIMED OUT (kill -9)
#    top  TEST ../../../bin/varnishtest/tests/r00310.vtc FAILED (60.002) signal=9

1 @ SunOS 5.11 i86pc 1.04 32_gcc4.7 uplex

*    top   0.0 TEST ../../../bin/varnishtest/tests/r00310.vtc starting
[...]
*    top   0.0 TEST Test obj.http.x-cache in vcl_hit
[...]
**** v1    0.1 CLI TX|vcl.inline vcl1 << %XJEIFLH|)Xspa8P
**** v1    0.1 CLI TX|vcl 4.0;
**** v1    0.1 CLI TX|
**** v1    0.1 CLI TX|\tbackend foo { .host = "127.0.0.1"; }
**** v1    0.1 CLI TX|
**** v1    0.1 CLI TX|\tsub vcl_hit {
**** v1    0.1 CLI TX|\t\tset obj.http.x-cache = "hit";
**** v1    0.1 CLI TX|\t}
**** v1    0.1 CLI TX|
**** v1    0.1 CLI TX|%XJEIFLH|)Xspa8P
***  v1    0.1 CLI RX  106
**** v1    0.1 CLI RX|Message from VCC-compiler:
**** v1    0.1 CLI RX|Security: Privilege proc_setid missing, will not change uid/gid
**** v1    0.1 CLI RX|Variable 'obj.http.x-cache' is read only.
**** v1    0.1 CLI RX|At: ('<vcl.inline>' Line 6 Pos 21)
**** v1    0.1 CLI RX|                set obj.http.x-cache = "hit";
**** v1    0.1 CLI RX|--------------------################---------
**** v1    0.1 CLI RX|
**** v1    0.1 CLI RX|Running VCC-compiler failed, exited with 2
**** v1    0.1 CLI RX|VCL compilation failed
**   v1    0.1 VCL compilation failed (as expected)
***  v1    0.1 Found expected string: ("Variable 'obj.http.x-cache' is read only.")
*    top   0.1 RESETTING after ../../../bin/varnishtest/tests/r00310.vtc
**   v1    0.1 Wait
**** v1    0.1 CLI TX|backend.list
***  v1    0.1 CLI RX  101
**** v1    0.1 CLI RX|Unknown request in manager process (child not running).
**** v1    0.1 CLI RX|Type 'help' for more info.
**   v1    0.1 Stop
**** v1    0.1 CLI TX|stop
***  v1    0.1 CLI RX  300
**** v1    0.1 CLI RX|Child in state stopped
**** v1    0.1 CLI TX|status
***  v1    0.1 CLI RX  200
**** v1    0.1 CLI RX|Child in state stopped
**** v1    0.1 STDOUT poll 0x10
**   v1    0.1 R 85948 Status: 0000 (u 0.004000 s 0.018000)
*    diag  0.0 ............................................................
#    top  TEST ../../../bin/varnishtest/tests/r00310.vtc TIMED OUT (kill -9)
#    top  TEST ../../../bin/varnishtest/tests/r00310.vtc FAILED (60.002) signal=9