r00409

8bbbdfa

1 @ SunOS 5.11 i86pc 1.04 64_sun12.4 uplex

*    top   0.0 TEST ../../../bin/varnishtest/tests/r00409.vtc starting
[...]
*    top   0.0 TEST Regression test for ticket 409
[...]
**** v1    0.1 CLI TX|
**** v1    0.1 CLI TX|\tbackend b { .host = "127.0.0.1"; }
**** v1    0.1 CLI TX|\tsub vcl_recv {
**** v1    0.1 CLI TX|\t\tif ( req.url ~ ! "\.(png|jpg|gif|js|css)$" ) {
**** v1    0.1 CLI TX|\t\t\treturn (pass);
**** v1    0.1 CLI TX|\t\t}
**** v1    0.1 CLI TX|\t}
**** v1    0.1 CLI TX|
**** v1    0.1 CLI TX|%XJEIFLH|)Xspa8P
***  v1    0.1 CLI RX  106
**** v1    0.1 CLI RX|Message from VCC-compiler:
**** v1    0.1 CLI RX|Security: Privilege proc_setid missing, will not change uid/gid
**** v1    0.1 CLI RX|Expected CSTR got '!'
**** v1    0.1 CLI RX|(program line 1193), at
**** v1    0.1 CLI RX|('<vcl.inline>' Line 5 Pos 32)
**** v1    0.1 CLI RX|                if ( req.url ~ ! "\.(png|jpg|gif|js|css)$" ) {
**** v1    0.1 CLI RX|-------------------------------#------------------------------
**** v1    0.1 CLI RX|
**** v1    0.1 CLI RX|Running VCC-compiler failed, exited with 2
**** v1    0.1 CLI RX|VCL compilation failed
**   v1    0.1 VCL compilation failed (as expected)
***  v1    0.1 Found expected string: ("Expected CSTR got '!'")
*    top   0.1 RESETTING after ../../../bin/varnishtest/tests/r00409.vtc
**   v1    0.1 Wait
**** v1    0.1 CLI TX|backend.list
***  v1    0.1 CLI RX  101
**** v1    0.1 CLI RX|Unknown request in manager process (child not running).
**** v1    0.1 CLI RX|Type 'help' for more info.
**   v1    0.1 Stop
**** v1    0.1 CLI TX|stop
***  v1    0.1 CLI RX  300
**** v1    0.1 CLI RX|Child in state stopped
**** v1    0.1 CLI TX|status
***  v1    0.1 CLI RX  200
**** v1    0.1 CLI RX|Child in state stopped
**** v1    0.1 STDOUT poll 0x10
**   v1    0.1 R 57496 Status: 0000 (u 0.007000 s 0.023000)
*    diag  0.0 ............................................................
#    top  TEST ../../../bin/varnishtest/tests/r00409.vtc TIMED OUT (kill -9)
#    top  TEST ../../../bin/varnishtest/tests/r00409.vtc FAILED (60.004) signal=9

1 @ SunOS 5.11 i86pc 1.04 64_sun12.4 uplex

*    top   0.0 TEST ../../../bin/varnishtest/tests/r00409.vtc starting
[...]
*    top   0.0 TEST Regression test for ticket 409
[...]
**** v1    0.1 CLI TX|
**** v1    0.1 CLI TX|\tbackend b { .host = "127.0.0.1"; }
**** v1    0.1 CLI TX|\tsub vcl_recv {
**** v1    0.1 CLI TX|\t\tif ( req.url ~ ! "\.(png|jpg|gif|js|css)$" ) {
**** v1    0.1 CLI TX|\t\t\treturn (pass);
**** v1    0.1 CLI TX|\t\t}
**** v1    0.1 CLI TX|\t}
**** v1    0.1 CLI TX|
**** v1    0.1 CLI TX|%XJEIFLH|)Xspa8P
***  v1    0.1 CLI RX  106
**** v1    0.1 CLI RX|Message from VCC-compiler:
**** v1    0.1 CLI RX|Security: Privilege proc_setid missing, will not change uid/gid
**** v1    0.1 CLI RX|Expected CSTR got '!'
**** v1    0.1 CLI RX|(program line 1193), at
**** v1    0.1 CLI RX|('<vcl.inline>' Line 5 Pos 32)
**** v1    0.1 CLI RX|                if ( req.url ~ ! "\.(png|jpg|gif|js|css)$" ) {
**** v1    0.1 CLI RX|-------------------------------#------------------------------
**** v1    0.1 CLI RX|
**** v1    0.1 CLI RX|Running VCC-compiler failed, exited with 2
**** v1    0.1 CLI RX|VCL compilation failed
**   v1    0.1 VCL compilation failed (as expected)
***  v1    0.1 Found expected string: ("Expected CSTR got '!'")
*    top   0.1 RESETTING after ../../../bin/varnishtest/tests/r00409.vtc
**   v1    0.1 Wait
**** v1    0.1 CLI TX|backend.list
***  v1    0.1 CLI RX  101
**** v1    0.1 CLI RX|Unknown request in manager process (child not running).
**** v1    0.1 CLI RX|Type 'help' for more info.
**   v1    0.1 Stop
**** v1    0.1 CLI TX|stop
***  v1    0.1 CLI RX  300
**** v1    0.1 CLI RX|Child in state stopped
**** v1    0.1 CLI TX|status
***  v1    0.1 CLI RX  200
**** v1    0.1 CLI RX|Child in state stopped
**** v1    0.1 STDOUT poll 0x10
**   v1    0.1 R 19029 Status: 0000 (u 0.007000 s 0.026000)
*    diag  0.0 ............................................................
#    top  TEST ../../../bin/varnishtest/tests/r00409.vtc TIMED OUT (kill -9)
#    top  TEST ../../../bin/varnishtest/tests/r00409.vtc FAILED (60.004) signal=9

1 @ Ubuntu LTS i686 1.04 fgs

*    top   0.0 TEST ../../../bin/varnishtest/tests/r00409.vtc starting
[...]
*    top   0.0 TEST Regression test for ticket 409
[...]
**** v1    0.1 CLI TX|vcl 4.0;
**** v1    0.1 CLI TX|
**** v1    0.1 CLI TX|\tbackend b { .host = "127.0.0.1"; }
**** v1    0.1 CLI TX|\tsub vcl_recv {
**** v1    0.1 CLI TX|\t\tif ( req.url ~ ! "\.(png|jpg|gif|js|css)$" ) {
**** v1    0.1 CLI TX|\t\t\treturn (pass);
**** v1    0.1 CLI TX|\t\t}
**** v1    0.1 CLI TX|\t}
**** v1    0.1 CLI TX|
**** v1    0.1 CLI TX|%XJEIFLH|)Xspa8P
***  v1    0.1 CLI RX  106
**** v1    0.1 CLI RX|Message from VCC-compiler:
**** v1    0.1 CLI RX|Expected CSTR got '!'
**** v1    0.1 CLI RX|(program line 1193), at
**** v1    0.1 CLI RX|('<vcl.inline>' Line 5 Pos 32)
**** v1    0.1 CLI RX|                if ( req.url ~ ! "\.(png|jpg|gif|js|css)$" ) {
**** v1    0.1 CLI RX|-------------------------------#------------------------------
**** v1    0.1 CLI RX|
**** v1    0.1 CLI RX|Running VCC-compiler failed, exited with 2
**** v1    0.1 CLI RX|VCL compilation failed
**   v1    0.1 VCL compilation failed (as expected)
***  v1    0.1 Found expected string: ("Expected CSTR got '!'")
*    top   0.1 RESETTING after ../../../bin/varnishtest/tests/r00409.vtc
**   v1    0.1 Wait
**** v1    0.1 CLI TX|backend.list
***  v1    0.1 CLI RX  101
**** v1    0.1 CLI RX|Unknown request in manager process (child not running).
**** v1    0.1 CLI RX|Type 'help' for more info.
**   v1    0.1 Stop
**** v1    0.1 CLI TX|stop
***  v1    0.2 CLI RX  300
**** v1    0.2 CLI RX|Child in state stopped
**** v1    0.2 CLI TX|status
***  v1    0.2 CLI RX  200
**** v1    0.2 CLI RX|Child in state stopped
**** v1    0.2 STDOUT poll 0x10
**   v1    0.2 R 3405 Status: 0000 (u 0.000000 s 0.004000)
*    diag  0.0 ............................................................
#    top  TEST ../../../bin/varnishtest/tests/r00409.vtc TIMED OUT (kill -9)
#    top  TEST ../../../bin/varnishtest/tests/r00409.vtc FAILED (60.001) signal=9

1 @ SunOS 5.11 i86pc 1.04 64_sun12.4 uplex

*    top   0.0 TEST ../../../bin/varnishtest/tests/r00409.vtc starting
[...]
*    top   0.0 TEST Regression test for ticket 409
[...]
**** v1    0.1 CLI TX|
**** v1    0.1 CLI TX|\tbackend b { .host = "127.0.0.1"; }
**** v1    0.1 CLI TX|\tsub vcl_recv {
**** v1    0.1 CLI TX|\t\tif ( req.url ~ ! "\.(png|jpg|gif|js|css)$" ) {
**** v1    0.1 CLI TX|\t\t\treturn (pass);
**** v1    0.1 CLI TX|\t\t}
**** v1    0.1 CLI TX|\t}
**** v1    0.1 CLI TX|
**** v1    0.1 CLI TX|%XJEIFLH|)Xspa8P
***  v1    0.1 CLI RX  106
**** v1    0.1 CLI RX|Message from VCC-compiler:
**** v1    0.1 CLI RX|Security: Privilege proc_setid missing, will not change uid/gid
**** v1    0.1 CLI RX|Expected CSTR got '!'
**** v1    0.1 CLI RX|(program line 1193), at
**** v1    0.1 CLI RX|('<vcl.inline>' Line 5 Pos 32)
**** v1    0.1 CLI RX|                if ( req.url ~ ! "\.(png|jpg|gif|js|css)$" ) {
**** v1    0.1 CLI RX|-------------------------------#------------------------------
**** v1    0.1 CLI RX|
**** v1    0.1 CLI RX|Running VCC-compiler failed, exited with 2
**** v1    0.1 CLI RX|VCL compilation failed
**   v1    0.1 VCL compilation failed (as expected)
***  v1    0.1 Found expected string: ("Expected CSTR got '!'")
*    top   0.1 RESETTING after ../../../bin/varnishtest/tests/r00409.vtc
**   v1    0.1 Wait
**** v1    0.1 CLI TX|backend.list
***  v1    0.1 CLI RX  101
**** v1    0.1 CLI RX|Unknown request in manager process (child not running).
**** v1    0.1 CLI RX|Type 'help' for more info.
**   v1    0.1 Stop
**** v1    0.1 CLI TX|stop
***  v1    0.1 CLI RX  300
**** v1    0.1 CLI RX|Child in state stopped
**** v1    0.1 CLI TX|status
***  v1    0.1 CLI RX  200
**** v1    0.1 CLI RX|Child in state stopped
**** v1    0.1 STDOUT poll 0x10
**   v1    0.1 R 8637 Status: 0000 (u 0.007000 s 0.025000)
*    diag  0.0 ............................................................
#    top  TEST ../../../bin/varnishtest/tests/r00409.vtc TIMED OUT (kill -9)
#    top  TEST ../../../bin/varnishtest/tests/r00409.vtc FAILED (60.004) signal=9

1 @ Linux 3.10.0 x86_64 1.02 mblissett

*    top   0.0 TEST ../../../bin/varnishtest/tests/r00409.vtc starting
[...]
*    top   0.0 TEST Regression test for ticket 409
[...]
**** v1    0.1 CLI TX|vcl 4.0;
**** v1    0.1 CLI TX|
**** v1    0.1 CLI TX|\tbackend b { .host = "127.0.0.1"; }
**** v1    0.1 CLI TX|\tsub vcl_recv {
**** v1    0.1 CLI TX|\t\tif ( req.url ~ ! "\.(png|jpg|gif|js|css)$" ) {
**** v1    0.1 CLI TX|\t\t\treturn (pass);
**** v1    0.1 CLI TX|\t\t}
**** v1    0.1 CLI TX|\t}
**** v1    0.1 CLI TX|
**** v1    0.1 CLI TX|%XJEIFLH|)Xspa8P
***  v1    0.1 CLI RX  106
**** v1    0.1 CLI RX|Message from VCC-compiler:
**** v1    0.1 CLI RX|Expected CSTR got '!'
**** v1    0.1 CLI RX|(program line 1193), at
**** v1    0.1 CLI RX|('<vcl.inline>' Line 5 Pos 32)
**** v1    0.1 CLI RX|                if ( req.url ~ ! "\.(png|jpg|gif|js|css)$" ) {
**** v1    0.1 CLI RX|-------------------------------#------------------------------
**** v1    0.1 CLI RX|
**** v1    0.1 CLI RX|Running VCC-compiler failed, exited with 2
**** v1    0.1 CLI RX|VCL compilation failed
**   v1    0.1 VCL compilation failed (as expected)
***  v1    0.1 Found expected string: ("Expected CSTR got '!'")
*    top   0.1 RESETTING after ../../../bin/varnishtest/tests/r00409.vtc
**   v1    0.1 Wait
**** v1    0.1 CLI TX|backend.list
***  v1    0.2 CLI RX  101
**** v1    0.2 CLI RX|Unknown request in manager process (child not running).
**** v1    0.2 CLI RX|Type 'help' for more info.
**   v1    0.2 Stop
**** v1    0.2 CLI TX|stop
***  v1    0.2 CLI RX  300
**** v1    0.2 CLI RX|Child in state stopped
**** v1    0.2 CLI TX|status
***  v1    0.2 CLI RX  200
**** v1    0.2 CLI RX|Child in state stopped
**** v1    0.2 STDOUT poll 0x10
**   v1    0.2 R 10424 Status: 0000 (u 0.004158 s 0.018044)
*    diag  0.0 ............................................................
#    top  TEST ../../../bin/varnishtest/tests/r00409.vtc TIMED OUT (kill -9)
#    top  TEST ../../../bin/varnishtest/tests/r00409.vtc FAILED (60.001) signal=9

1 @ SunOS 5.11 i86pc 1.04 32_gcc4.7 uplex

*    top   0.0 TEST ../../../bin/varnishtest/tests/r00409.vtc starting
[...]
*    top   0.0 TEST Regression test for ticket 409
[...]
**** v1    0.1 CLI TX|
**** v1    0.1 CLI TX|\tbackend b { .host = "127.0.0.1"; }
**** v1    0.1 CLI TX|\tsub vcl_recv {
**** v1    0.1 CLI TX|\t\tif ( req.url ~ ! "\.(png|jpg|gif|js|css)$" ) {
**** v1    0.1 CLI TX|\t\t\treturn (pass);
**** v1    0.1 CLI TX|\t\t}
**** v1    0.1 CLI TX|\t}
**** v1    0.1 CLI TX|
**** v1    0.1 CLI TX|%XJEIFLH|)Xspa8P
***  v1    0.1 CLI RX  106
**** v1    0.1 CLI RX|Message from VCC-compiler:
**** v1    0.1 CLI RX|Security: Privilege proc_setid missing, will not change uid/gid
**** v1    0.1 CLI RX|Expected CSTR got '!'
**** v1    0.1 CLI RX|(program line 1193), at
**** v1    0.1 CLI RX|('<vcl.inline>' Line 5 Pos 32)
**** v1    0.1 CLI RX|                if ( req.url ~ ! "\.(png|jpg|gif|js|css)$" ) {
**** v1    0.1 CLI RX|-------------------------------#------------------------------
**** v1    0.1 CLI RX|
**** v1    0.1 CLI RX|Running VCC-compiler failed, exited with 2
**** v1    0.1 CLI RX|VCL compilation failed
**   v1    0.1 VCL compilation failed (as expected)
***  v1    0.1 Found expected string: ("Expected CSTR got '!'")
*    top   0.1 RESETTING after ../../../bin/varnishtest/tests/r00409.vtc
**   v1    0.1 Wait
**** v1    0.1 CLI TX|backend.list
***  v1    0.1 CLI RX  101
**** v1    0.1 CLI RX|Unknown request in manager process (child not running).
**** v1    0.1 CLI RX|Type 'help' for more info.
**   v1    0.1 Stop
**** v1    0.1 CLI TX|stop
***  v1    0.1 CLI RX  300
**** v1    0.1 CLI RX|Child in state stopped
**** v1    0.1 CLI TX|status
***  v1    0.1 CLI RX  200
**** v1    0.1 CLI RX|Child in state stopped
**** v1    0.1 STDOUT poll 0x10
**   v1    0.1 R 17750 Status: 0000 (u 0.004000 s 0.016000)
*    diag  0.0 ............................................................
#    top  TEST ../../../bin/varnishtest/tests/r00409.vtc TIMED OUT (kill -9)
#    top  TEST ../../../bin/varnishtest/tests/r00409.vtc FAILED (60.002) signal=9

1 @ SunOS 5.11 i86pc 1.04 64_sun12.4 uplex

*    top   0.0 TEST ../../../bin/varnishtest/tests/r00409.vtc starting
[...]
*    top   0.0 TEST Regression test for ticket 409
[...]
**** v1    0.1 CLI TX|
**** v1    0.1 CLI TX|\tbackend b { .host = "127.0.0.1"; }
**** v1    0.1 CLI TX|\tsub vcl_recv {
**** v1    0.1 CLI TX|\t\tif ( req.url ~ ! "\.(png|jpg|gif|js|css)$" ) {
**** v1    0.1 CLI TX|\t\t\treturn (pass);
**** v1    0.1 CLI TX|\t\t}
**** v1    0.1 CLI TX|\t}
**** v1    0.1 CLI TX|
**** v1    0.1 CLI TX|%XJEIFLH|)Xspa8P
***  v1    0.1 CLI RX  106
**** v1    0.1 CLI RX|Message from VCC-compiler:
**** v1    0.1 CLI RX|Security: Privilege proc_setid missing, will not change uid/gid
**** v1    0.1 CLI RX|Expected CSTR got '!'
**** v1    0.1 CLI RX|(program line 1193), at
**** v1    0.1 CLI RX|('<vcl.inline>' Line 5 Pos 32)
**** v1    0.1 CLI RX|                if ( req.url ~ ! "\.(png|jpg|gif|js|css)$" ) {
**** v1    0.1 CLI RX|-------------------------------#------------------------------
**** v1    0.1 CLI RX|
**** v1    0.1 CLI RX|Running VCC-compiler failed, exited with 2
**** v1    0.1 CLI RX|VCL compilation failed
**   v1    0.1 VCL compilation failed (as expected)
***  v1    0.1 Found expected string: ("Expected CSTR got '!'")
*    top   0.1 RESETTING after ../../../bin/varnishtest/tests/r00409.vtc
**   v1    0.1 Wait
**** v1    0.1 CLI TX|backend.list
***  v1    0.1 CLI RX  101
**** v1    0.1 CLI RX|Unknown request in manager process (child not running).
**** v1    0.1 CLI RX|Type 'help' for more info.
**   v1    0.1 Stop
**** v1    0.1 CLI TX|stop
***  v1    0.1 CLI RX  300
**** v1    0.1 CLI RX|Child in state stopped
**** v1    0.1 CLI TX|status
***  v1    0.1 CLI RX  200
**** v1    0.1 CLI RX|Child in state stopped
**** v1    0.1 STDOUT poll 0x10
**   v1    0.1 R 18254 Status: 0000 (u 0.007000 s 0.026000)
*    diag  0.0 ............................................................
#    top  TEST ../../../bin/varnishtest/tests/r00409.vtc TIMED OUT (kill -9)
#    top  TEST ../../../bin/varnishtest/tests/r00409.vtc FAILED (60.004) signal=9

1 @ Linux 3.10.0 x86_64 1.02 mblissett

*    top   0.0 TEST ../../../bin/varnishtest/tests/r00409.vtc starting
[...]
*    top   0.0 TEST Regression test for ticket 409
[...]
**** v1    0.1 CLI TX|vcl 4.0;
**** v1    0.1 CLI TX|
**** v1    0.1 CLI TX|\tbackend b { .host = "127.0.0.1"; }
**** v1    0.1 CLI TX|\tsub vcl_recv {
**** v1    0.1 CLI TX|\t\tif ( req.url ~ ! "\.(png|jpg|gif|js|css)$" ) {
**** v1    0.1 CLI TX|\t\t\treturn (pass);
**** v1    0.1 CLI TX|\t\t}
**** v1    0.1 CLI TX|\t}
**** v1    0.1 CLI TX|
**** v1    0.1 CLI TX|%XJEIFLH|)Xspa8P
***  v1    0.1 CLI RX  106
**** v1    0.1 CLI RX|Message from VCC-compiler:
**** v1    0.1 CLI RX|Expected CSTR got '!'
**** v1    0.1 CLI RX|(program line 1193), at
**** v1    0.1 CLI RX|('<vcl.inline>' Line 5 Pos 32)
**** v1    0.1 CLI RX|                if ( req.url ~ ! "\.(png|jpg|gif|js|css)$" ) {
**** v1    0.1 CLI RX|-------------------------------#------------------------------
**** v1    0.1 CLI RX|
**** v1    0.1 CLI RX|Running VCC-compiler failed, exited with 2
**** v1    0.1 CLI RX|VCL compilation failed
**   v1    0.1 VCL compilation failed (as expected)
***  v1    0.1 Found expected string: ("Expected CSTR got '!'")
*    top   0.1 RESETTING after ../../../bin/varnishtest/tests/r00409.vtc
**   v1    0.1 Wait
**** v1    0.1 CLI TX|backend.list
***  v1    0.2 CLI RX  101
**** v1    0.2 CLI RX|Unknown request in manager process (child not running).
**** v1    0.2 CLI RX|Type 'help' for more info.
**   v1    0.2 Stop
**** v1    0.2 CLI TX|stop
***  v1    0.2 CLI RX  300
**** v1    0.2 CLI RX|Child in state stopped
**** v1    0.2 CLI TX|status
***  v1    0.2 CLI RX  200
**** v1    0.2 CLI RX|Child in state stopped
**** v1    0.2 STDOUT poll 0x10
**   v1    0.2 R 17424 Status: 0000 (u 0.002422 s 0.017651)
*    diag  0.0 ............................................................
#    top  TEST ../../../bin/varnishtest/tests/r00409.vtc TIMED OUT (kill -9)
#    top  TEST ../../../bin/varnishtest/tests/r00409.vtc FAILED (60.001) signal=9

1 @ SunOS 5.11 i86pc 1.04 64_gcc4.7 uplex

*    top   0.0 TEST ../../../bin/varnishtest/tests/r00409.vtc starting
[...]
*    top   0.0 TEST Regression test for ticket 409
[...]
**** v1    0.1 CLI TX|
**** v1    0.1 CLI TX|\tbackend b { .host = "127.0.0.1"; }
**** v1    0.1 CLI TX|\tsub vcl_recv {
**** v1    0.1 CLI TX|\t\tif ( req.url ~ ! "\.(png|jpg|gif|js|css)$" ) {
**** v1    0.1 CLI TX|\t\t\treturn (pass);
**** v1    0.1 CLI TX|\t\t}
**** v1    0.1 CLI TX|\t}
**** v1    0.1 CLI TX|
**** v1    0.1 CLI TX|%XJEIFLH|)Xspa8P
***  v1    0.1 CLI RX  106
**** v1    0.1 CLI RX|Message from VCC-compiler:
**** v1    0.1 CLI RX|Security: Privilege proc_setid missing, will not change uid/gid
**** v1    0.1 CLI RX|Expected CSTR got '!'
**** v1    0.1 CLI RX|(program line 1193), at
**** v1    0.1 CLI RX|('<vcl.inline>' Line 5 Pos 32)
**** v1    0.1 CLI RX|                if ( req.url ~ ! "\.(png|jpg|gif|js|css)$" ) {
**** v1    0.1 CLI RX|-------------------------------#------------------------------
**** v1    0.1 CLI RX|
**** v1    0.1 CLI RX|Running VCC-compiler failed, exited with 2
**** v1    0.1 CLI RX|VCL compilation failed
**   v1    0.1 VCL compilation failed (as expected)
***  v1    0.1 Found expected string: ("Expected CSTR got '!'")
*    top   0.1 RESETTING after ../../../bin/varnishtest/tests/r00409.vtc
**   v1    0.1 Wait
**** v1    0.1 CLI TX|backend.list
***  v1    0.1 CLI RX  101
**** v1    0.1 CLI RX|Unknown request in manager process (child not running).
**** v1    0.1 CLI RX|Type 'help' for more info.
**   v1    0.1 Stop
**** v1    0.1 CLI TX|stop
***  v1    0.1 CLI RX  300
**** v1    0.1 CLI RX|Child in state stopped
**** v1    0.1 CLI TX|status
***  v1    0.1 CLI RX  200
**** v1    0.1 CLI RX|Child in state stopped
**** v1    0.2 STDOUT poll 0x10
**   v1    0.2 R 45153 Status: 0000 (u 0.008000 s 0.030000)
*    diag  0.0 ............................................................
#    top  TEST ../../../bin/varnishtest/tests/r00409.vtc TIMED OUT (kill -9)
#    top  TEST ../../../bin/varnishtest/tests/r00409.vtc FAILED (60.004) signal=9

1 @ SunOS 5.11 i86pc 1.04 64_gcc4.7 uplex

*    top   0.0 TEST ../../../bin/varnishtest/tests/r00409.vtc starting
[...]
*    top   0.0 TEST Regression test for ticket 409
[...]
**** v1    0.1 CLI TX|
**** v1    0.1 CLI TX|\tbackend b { .host = "127.0.0.1"; }
**** v1    0.1 CLI TX|\tsub vcl_recv {
**** v1    0.1 CLI TX|\t\tif ( req.url ~ ! "\.(png|jpg|gif|js|css)$" ) {
**** v1    0.1 CLI TX|\t\t\treturn (pass);
**** v1    0.1 CLI TX|\t\t}
**** v1    0.1 CLI TX|\t}
**** v1    0.1 CLI TX|
**** v1    0.1 CLI TX|%XJEIFLH|)Xspa8P
***  v1    0.1 CLI RX  106
**** v1    0.1 CLI RX|Message from VCC-compiler:
**** v1    0.1 CLI RX|Security: Privilege proc_setid missing, will not change uid/gid
**** v1    0.1 CLI RX|Expected CSTR got '!'
**** v1    0.1 CLI RX|(program line 1193), at
**** v1    0.1 CLI RX|('<vcl.inline>' Line 5 Pos 32)
**** v1    0.1 CLI RX|                if ( req.url ~ ! "\.(png|jpg|gif|js|css)$" ) {
**** v1    0.1 CLI RX|-------------------------------#------------------------------
**** v1    0.1 CLI RX|
**** v1    0.1 CLI RX|Running VCC-compiler failed, exited with 2
**** v1    0.1 CLI RX|VCL compilation failed
**   v1    0.1 VCL compilation failed (as expected)
***  v1    0.1 Found expected string: ("Expected CSTR got '!'")
*    top   0.1 RESETTING after ../../../bin/varnishtest/tests/r00409.vtc
**   v1    0.1 Wait
**** v1    0.1 CLI TX|backend.list
***  v1    0.1 CLI RX  101
**** v1    0.1 CLI RX|Unknown request in manager process (child not running).
**** v1    0.1 CLI RX|Type 'help' for more info.
**   v1    0.1 Stop
**** v1    0.1 CLI TX|stop
***  v1    0.1 CLI RX  300
**** v1    0.1 CLI RX|Child in state stopped
**** v1    0.1 CLI TX|status
***  v1    0.1 CLI RX  200
**** v1    0.1 CLI RX|Child in state stopped
**** v1    0.1 STDOUT poll 0x10
**   v1    0.1 R 17997 Status: 0000 (u 0.007000 s 0.023000)
*    diag  0.0 ............................................................
#    top  TEST ../../../bin/varnishtest/tests/r00409.vtc TIMED OUT (kill -9)
#    top  TEST ../../../bin/varnishtest/tests/r00409.vtc FAILED (60.003) signal=9

1 @ SunOS 5.11 i86pc 1.04 32_gcc4.7 uplex

*    top   0.0 TEST ../../../bin/varnishtest/tests/r00409.vtc starting
[...]
*    top   0.0 TEST Regression test for ticket 409
[...]
**** v1    0.1 CLI TX|
**** v1    0.1 CLI TX|\tbackend b { .host = "127.0.0.1"; }
**** v1    0.1 CLI TX|\tsub vcl_recv {
**** v1    0.1 CLI TX|\t\tif ( req.url ~ ! "\.(png|jpg|gif|js|css)$" ) {
**** v1    0.1 CLI TX|\t\t\treturn (pass);
**** v1    0.1 CLI TX|\t\t}
**** v1    0.1 CLI TX|\t}
**** v1    0.1 CLI TX|
**** v1    0.1 CLI TX|%XJEIFLH|)Xspa8P
***  v1    0.1 CLI RX  106
**** v1    0.1 CLI RX|Message from VCC-compiler:
**** v1    0.1 CLI RX|Security: Privilege proc_setid missing, will not change uid/gid
**** v1    0.1 CLI RX|Expected CSTR got '!'
**** v1    0.1 CLI RX|(program line 1193), at
**** v1    0.1 CLI RX|('<vcl.inline>' Line 5 Pos 32)
**** v1    0.1 CLI RX|                if ( req.url ~ ! "\.(png|jpg|gif|js|css)$" ) {
**** v1    0.1 CLI RX|-------------------------------#------------------------------
**** v1    0.1 CLI RX|
**** v1    0.1 CLI RX|Running VCC-compiler failed, exited with 2
**** v1    0.1 CLI RX|VCL compilation failed
**   v1    0.1 VCL compilation failed (as expected)
***  v1    0.1 Found expected string: ("Expected CSTR got '!'")
*    top   0.1 RESETTING after ../../../bin/varnishtest/tests/r00409.vtc
**   v1    0.1 Wait
**** v1    0.1 CLI TX|backend.list
***  v1    0.1 CLI RX  101
**** v1    0.1 CLI RX|Unknown request in manager process (child not running).
**** v1    0.1 CLI RX|Type 'help' for more info.
**   v1    0.1 Stop
**** v1    0.1 CLI TX|stop
***  v1    0.1 CLI RX  300
**** v1    0.1 CLI RX|Child in state stopped
**** v1    0.1 CLI TX|status
***  v1    0.1 CLI RX  200
**** v1    0.1 CLI RX|Child in state stopped
**** v1    0.1 STDOUT poll 0x10
**   v1    0.1 R 86783 Status: 0000 (u 0.004000 s 0.018000)
*    diag  0.0 ............................................................
#    top  TEST ../../../bin/varnishtest/tests/r00409.vtc TIMED OUT (kill -9)
#    top  TEST ../../../bin/varnishtest/tests/r00409.vtc FAILED (60.002) signal=9

1 @ SunOS 5.11 i86pc 1.04 32_sun12.4 uplex

*    top   0.0 TEST ../../../bin/varnishtest/tests/r00409.vtc starting
[...]
*    top   0.0 TEST Regression test for ticket 409
[...]
**** v1    0.1 CLI TX|
**** v1    0.1 CLI TX|\tbackend b { .host = "127.0.0.1"; }
**** v1    0.1 CLI TX|\tsub vcl_recv {
**** v1    0.1 CLI TX|\t\tif ( req.url ~ ! "\.(png|jpg|gif|js|css)$" ) {
**** v1    0.1 CLI TX|\t\t\treturn (pass);
**** v1    0.1 CLI TX|\t\t}
**** v1    0.1 CLI TX|\t}
**** v1    0.1 CLI TX|
**** v1    0.1 CLI TX|%XJEIFLH|)Xspa8P
***  v1    0.1 CLI RX  106
**** v1    0.1 CLI RX|Message from VCC-compiler:
**** v1    0.1 CLI RX|Security: Privilege proc_setid missing, will not change uid/gid
**** v1    0.1 CLI RX|Expected CSTR got '!'
**** v1    0.1 CLI RX|(program line 1193), at
**** v1    0.1 CLI RX|('<vcl.inline>' Line 5 Pos 32)
**** v1    0.1 CLI RX|                if ( req.url ~ ! "\.(png|jpg|gif|js|css)$" ) {
**** v1    0.1 CLI RX|-------------------------------#------------------------------
**** v1    0.1 CLI RX|
**** v1    0.1 CLI RX|Running VCC-compiler failed, exited with 2
**** v1    0.1 CLI RX|VCL compilation failed
**   v1    0.1 VCL compilation failed (as expected)
***  v1    0.1 Found expected string: ("Expected CSTR got '!'")
*    top   0.1 RESETTING after ../../../bin/varnishtest/tests/r00409.vtc
**   v1    0.1 Wait
**** v1    0.1 CLI TX|backend.list
***  v1    0.1 CLI RX  101
**** v1    0.1 CLI RX|Unknown request in manager process (child not running).
**** v1    0.1 CLI RX|Type 'help' for more info.
**   v1    0.1 Stop
**** v1    0.1 CLI TX|stop
***  v1    0.1 CLI RX  300
**** v1    0.1 CLI RX|Child in state stopped
**** v1    0.1 CLI TX|status
***  v1    0.1 CLI RX  200
**** v1    0.1 CLI RX|Child in state stopped
**** v1    0.1 STDOUT poll 0x10
**   v1    0.1 R 78912 Status: 0000 (u 0.004000 s 0.017000)
*    diag  0.0 ............................................................
#    top  TEST ../../../bin/varnishtest/tests/r00409.vtc TIMED OUT (kill -9)
#    top  TEST ../../../bin/varnishtest/tests/r00409.vtc FAILED (60.002) signal=9

1 @ Linux 3.10.0 x86_64 1.02 mblissett

*    top   0.0 TEST ../../../bin/varnishtest/tests/r00409.vtc starting
[...]
*    top   0.0 TEST Regression test for ticket 409
[...]
**** v1    0.1 CLI TX|vcl 4.0;
**** v1    0.1 CLI TX|
**** v1    0.1 CLI TX|\tbackend b { .host = "127.0.0.1"; }
**** v1    0.1 CLI TX|\tsub vcl_recv {
**** v1    0.1 CLI TX|\t\tif ( req.url ~ ! "\.(png|jpg|gif|js|css)$" ) {
**** v1    0.1 CLI TX|\t\t\treturn (pass);
**** v1    0.1 CLI TX|\t\t}
**** v1    0.1 CLI TX|\t}
**** v1    0.1 CLI TX|
**** v1    0.1 CLI TX|%XJEIFLH|)Xspa8P
***  v1    0.1 CLI RX  106
**** v1    0.1 CLI RX|Message from VCC-compiler:
**** v1    0.1 CLI RX|Expected CSTR got '!'
**** v1    0.1 CLI RX|(program line 1193), at
**** v1    0.1 CLI RX|('<vcl.inline>' Line 5 Pos 32)
**** v1    0.1 CLI RX|                if ( req.url ~ ! "\.(png|jpg|gif|js|css)$" ) {
**** v1    0.1 CLI RX|-------------------------------#------------------------------
**** v1    0.1 CLI RX|
**** v1    0.1 CLI RX|Running VCC-compiler failed, exited with 2
**** v1    0.1 CLI RX|VCL compilation failed
**   v1    0.1 VCL compilation failed (as expected)
***  v1    0.1 Found expected string: ("Expected CSTR got '!'")
*    top   0.1 RESETTING after ../../../bin/varnishtest/tests/r00409.vtc
**   v1    0.1 Wait
**** v1    0.1 CLI TX|backend.list
***  v1    0.2 CLI RX  101
**** v1    0.2 CLI RX|Unknown request in manager process (child not running).
**** v1    0.2 CLI RX|Type 'help' for more info.
**   v1    0.2 Stop
**** v1    0.2 CLI TX|stop
***  v1    0.2 CLI RX  300
**** v1    0.2 CLI RX|Child in state stopped
**** v1    0.2 CLI TX|status
***  v1    0.2 CLI RX  200
**** v1    0.2 CLI RX|Child in state stopped
**** v1    0.2 STDOUT poll 0x10
**   v1    0.2 R 26923 Status: 0000 (u 0.007099 s 0.015173)
*    diag  0.0 ............................................................
#    top  TEST ../../../bin/varnishtest/tests/r00409.vtc TIMED OUT (kill -9)
#    top  TEST ../../../bin/varnishtest/tests/r00409.vtc FAILED (60.001) signal=9

1 @ SunOS 5.11 i86pc 1.04 64_gcc4.7 uplex

*    top   0.0 TEST ../../../bin/varnishtest/tests/r00409.vtc starting
[...]
*    top   0.0 TEST Regression test for ticket 409
[...]
**** v1    0.1 CLI TX|
**** v1    0.1 CLI TX|\tbackend b { .host = "127.0.0.1"; }
**** v1    0.1 CLI TX|\tsub vcl_recv {
**** v1    0.1 CLI TX|\t\tif ( req.url ~ ! "\.(png|jpg|gif|js|css)$" ) {
**** v1    0.1 CLI TX|\t\t\treturn (pass);
**** v1    0.1 CLI TX|\t\t}
**** v1    0.1 CLI TX|\t}
**** v1    0.1 CLI TX|
**** v1    0.1 CLI TX|%XJEIFLH|)Xspa8P
***  v1    0.1 CLI RX  106
**** v1    0.1 CLI RX|Message from VCC-compiler:
**** v1    0.1 CLI RX|Security: Privilege proc_setid missing, will not change uid/gid
**** v1    0.1 CLI RX|Expected CSTR got '!'
**** v1    0.1 CLI RX|(program line 1193), at
**** v1    0.1 CLI RX|('<vcl.inline>' Line 5 Pos 32)
**** v1    0.1 CLI RX|                if ( req.url ~ ! "\.(png|jpg|gif|js|css)$" ) {
**** v1    0.1 CLI RX|-------------------------------#------------------------------
**** v1    0.1 CLI RX|
**** v1    0.1 CLI RX|Running VCC-compiler failed, exited with 2
**** v1    0.1 CLI RX|VCL compilation failed
**   v1    0.1 VCL compilation failed (as expected)
***  v1    0.1 Found expected string: ("Expected CSTR got '!'")
*    top   0.1 RESETTING after ../../../bin/varnishtest/tests/r00409.vtc
**   v1    0.1 Wait
**** v1    0.1 CLI TX|backend.list
***  v1    0.1 CLI RX  101
**** v1    0.1 CLI RX|Unknown request in manager process (child not running).
**** v1    0.1 CLI RX|Type 'help' for more info.
**   v1    0.1 Stop
**** v1    0.1 CLI TX|stop
***  v1    0.1 CLI RX  300
**** v1    0.1 CLI RX|Child in state stopped
**** v1    0.1 CLI TX|status
***  v1    0.1 CLI RX  200
**** v1    0.1 CLI RX|Child in state stopped
**** v1    0.1 STDOUT poll 0x10
**   v1    0.1 R 90064 Status: 0000 (u 0.007000 s 0.022000)
*    diag  0.0 ............................................................
#    top  TEST ../../../bin/varnishtest/tests/r00409.vtc TIMED OUT (kill -9)
#    top  TEST ../../../bin/varnishtest/tests/r00409.vtc FAILED (60.003) signal=9

1 @ SunOS 5.11 i86pc 1.04 32_gcc4.7 uplex

*    top   0.0 TEST ../../../bin/varnishtest/tests/r00409.vtc starting
[...]
*    top   0.0 TEST Regression test for ticket 409
[...]
**** v1    0.1 CLI TX|
**** v1    0.1 CLI TX|\tbackend b { .host = "127.0.0.1"; }
**** v1    0.1 CLI TX|\tsub vcl_recv {
**** v1    0.1 CLI TX|\t\tif ( req.url ~ ! "\.(png|jpg|gif|js|css)$" ) {
**** v1    0.1 CLI TX|\t\t\treturn (pass);
**** v1    0.1 CLI TX|\t\t}
**** v1    0.1 CLI TX|\t}
**** v1    0.1 CLI TX|
**** v1    0.1 CLI TX|%XJEIFLH|)Xspa8P
***  v1    0.1 CLI RX  106
**** v1    0.1 CLI RX|Message from VCC-compiler:
**** v1    0.1 CLI RX|Security: Privilege proc_setid missing, will not change uid/gid
**** v1    0.1 CLI RX|Expected CSTR got '!'
**** v1    0.1 CLI RX|(program line 1193), at
**** v1    0.1 CLI RX|('<vcl.inline>' Line 5 Pos 32)
**** v1    0.1 CLI RX|                if ( req.url ~ ! "\.(png|jpg|gif|js|css)$" ) {
**** v1    0.1 CLI RX|-------------------------------#------------------------------
**** v1    0.1 CLI RX|
**** v1    0.1 CLI RX|Running VCC-compiler failed, exited with 2
**** v1    0.1 CLI RX|VCL compilation failed
**   v1    0.1 VCL compilation failed (as expected)
***  v1    0.1 Found expected string: ("Expected CSTR got '!'")
*    top   0.1 RESETTING after ../../../bin/varnishtest/tests/r00409.vtc
**   v1    0.1 Wait
**** v1    0.1 CLI TX|backend.list
***  v1    0.1 CLI RX  101
**** v1    0.1 CLI RX|Unknown request in manager process (child not running).
**** v1    0.1 CLI RX|Type 'help' for more info.
**   v1    0.1 Stop
**** v1    0.1 CLI TX|stop
***  v1    0.1 CLI RX  300
**** v1    0.1 CLI RX|Child in state stopped
**** v1    0.1 CLI TX|status
***  v1    0.1 CLI RX  200
**** v1    0.1 CLI RX|Child in state stopped
**** v1    0.1 STDOUT poll 0x10
**   v1    0.1 R 66310 Status: 0000 (u 0.004000 s 0.017000)
*    diag  0.0 ............................................................
#    top  TEST ../../../bin/varnishtest/tests/r00409.vtc TIMED OUT (kill -9)
#    top  TEST ../../../bin/varnishtest/tests/r00409.vtc FAILED (60.002) signal=9

1 @ Linux 3.10.0 x86_64 1.02 mblissett

*    top   0.0 TEST ../../../bin/varnishtest/tests/r00409.vtc starting
[...]
*    top   0.0 TEST Regression test for ticket 409
[...]
**** v1    0.1 CLI TX|vcl 4.0;
**** v1    0.1 CLI TX|
**** v1    0.1 CLI TX|\tbackend b { .host = "127.0.0.1"; }
**** v1    0.1 CLI TX|\tsub vcl_recv {
**** v1    0.1 CLI TX|\t\tif ( req.url ~ ! "\.(png|jpg|gif|js|css)$" ) {
**** v1    0.1 CLI TX|\t\t\treturn (pass);
**** v1    0.1 CLI TX|\t\t}
**** v1    0.1 CLI TX|\t}
**** v1    0.1 CLI TX|
**** v1    0.1 CLI TX|%XJEIFLH|)Xspa8P
***  v1    0.1 CLI RX  106
**** v1    0.1 CLI RX|Message from VCC-compiler:
**** v1    0.1 CLI RX|Expected CSTR got '!'
**** v1    0.1 CLI RX|(program line 1193), at
**** v1    0.1 CLI RX|('<vcl.inline>' Line 5 Pos 32)
**** v1    0.1 CLI RX|                if ( req.url ~ ! "\.(png|jpg|gif|js|css)$" ) {
**** v1    0.1 CLI RX|-------------------------------#------------------------------
**** v1    0.1 CLI RX|
**** v1    0.1 CLI RX|Running VCC-compiler failed, exited with 2
**** v1    0.1 CLI RX|VCL compilation failed
**   v1    0.1 VCL compilation failed (as expected)
***  v1    0.1 Found expected string: ("Expected CSTR got '!'")
*    top   0.1 RESETTING after ../../../bin/varnishtest/tests/r00409.vtc
**   v1    0.1 Wait
**** v1    0.1 CLI TX|backend.list
***  v1    0.2 CLI RX  101
**** v1    0.2 CLI RX|Unknown request in manager process (child not running).
**** v1    0.2 CLI RX|Type 'help' for more info.
**   v1    0.2 Stop
**** v1    0.2 CLI TX|stop
***  v1    0.2 CLI RX  300
**** v1    0.2 CLI RX|Child in state stopped
**** v1    0.2 CLI TX|status
***  v1    0.2 CLI RX  200
**** v1    0.2 CLI RX|Child in state stopped
**** v1    0.2 STDOUT poll 0x10
**   v1    0.2 R 30038 Status: 0000 (u 0.003993 s 0.019912)
*    diag  0.0 ............................................................
#    top  TEST ../../../bin/varnishtest/tests/r00409.vtc TIMED OUT (kill -9)
#    top  TEST ../../../bin/varnishtest/tests/r00409.vtc FAILED (60.001) signal=9

1 @ SunOS 5.11 i86pc 1.04 64_sun12.4 uplex

*    top   0.0 TEST ../../../bin/varnishtest/tests/r00409.vtc starting
[...]
*    top   0.0 TEST Regression test for ticket 409
[...]
**** v1    0.1 CLI TX|
**** v1    0.1 CLI TX|\tbackend b { .host = "127.0.0.1"; }
**** v1    0.1 CLI TX|\tsub vcl_recv {
**** v1    0.1 CLI TX|\t\tif ( req.url ~ ! "\.(png|jpg|gif|js|css)$" ) {
**** v1    0.1 CLI TX|\t\t\treturn (pass);
**** v1    0.1 CLI TX|\t\t}
**** v1    0.1 CLI TX|\t}
**** v1    0.1 CLI TX|
**** v1    0.1 CLI TX|%XJEIFLH|)Xspa8P
***  v1    0.1 CLI RX  106
**** v1    0.1 CLI RX|Message from VCC-compiler:
**** v1    0.1 CLI RX|Security: Privilege proc_setid missing, will not change uid/gid
**** v1    0.1 CLI RX|Expected CSTR got '!'
**** v1    0.1 CLI RX|(program line 1193), at
**** v1    0.1 CLI RX|('<vcl.inline>' Line 5 Pos 32)
**** v1    0.1 CLI RX|                if ( req.url ~ ! "\.(png|jpg|gif|js|css)$" ) {
**** v1    0.1 CLI RX|-------------------------------#------------------------------
**** v1    0.1 CLI RX|
**** v1    0.1 CLI RX|Running VCC-compiler failed, exited with 2
**** v1    0.1 CLI RX|VCL compilation failed
**   v1    0.1 VCL compilation failed (as expected)
***  v1    0.1 Found expected string: ("Expected CSTR got '!'")
*    top   0.1 RESETTING after ../../../bin/varnishtest/tests/r00409.vtc
**   v1    0.1 Wait
**** v1    0.1 CLI TX|backend.list
***  v1    0.1 CLI RX  101
**** v1    0.1 CLI RX|Unknown request in manager process (child not running).
**** v1    0.1 CLI RX|Type 'help' for more info.
**   v1    0.1 Stop
**** v1    0.1 CLI TX|stop
***  v1    0.1 CLI RX  300
**** v1    0.1 CLI RX|Child in state stopped
**** v1    0.1 CLI TX|status
***  v1    0.1 CLI RX  200
**** v1    0.1 CLI RX|Child in state stopped
**** v1    0.1 STDOUT poll 0x10
**   v1    0.1 R 77608 Status: 0000 (u 0.007000 s 0.022000)
*    diag  0.0 ............................................................
#    top  TEST ../../../bin/varnishtest/tests/r00409.vtc TIMED OUT (kill -9)
#    top  TEST ../../../bin/varnishtest/tests/r00409.vtc FAILED (60.004) signal=9

1 @ Linux 3.10.0 x86_64 1.02 mblissett

*    top   0.0 TEST ../../../bin/varnishtest/tests/r00409.vtc starting
[...]
*    top   0.0 TEST Regression test for ticket 409
[...]
**** v1    0.1 CLI TX|vcl 4.0;
**** v1    0.1 CLI TX|
**** v1    0.1 CLI TX|\tbackend b { .host = "127.0.0.1"; }
**** v1    0.1 CLI TX|\tsub vcl_recv {
**** v1    0.1 CLI TX|\t\tif ( req.url ~ ! "\.(png|jpg|gif|js|css)$" ) {
**** v1    0.1 CLI TX|\t\t\treturn (pass);
**** v1    0.1 CLI TX|\t\t}
**** v1    0.1 CLI TX|\t}
**** v1    0.1 CLI TX|
**** v1    0.1 CLI TX|%XJEIFLH|)Xspa8P
***  v1    0.1 CLI RX  106
**** v1    0.1 CLI RX|Message from VCC-compiler:
**** v1    0.1 CLI RX|Expected CSTR got '!'
**** v1    0.1 CLI RX|(program line 1193), at
**** v1    0.1 CLI RX|('<vcl.inline>' Line 5 Pos 32)
**** v1    0.1 CLI RX|                if ( req.url ~ ! "\.(png|jpg|gif|js|css)$" ) {
**** v1    0.1 CLI RX|-------------------------------#------------------------------
**** v1    0.1 CLI RX|
**** v1    0.1 CLI RX|Running VCC-compiler failed, exited with 2
**** v1    0.1 CLI RX|VCL compilation failed
**   v1    0.1 VCL compilation failed (as expected)
***  v1    0.1 Found expected string: ("Expected CSTR got '!'")
*    top   0.1 RESETTING after ../../../bin/varnishtest/tests/r00409.vtc
**   v1    0.1 Wait
**** v1    0.1 CLI TX|backend.list
***  v1    0.2 CLI RX  101
**** v1    0.2 CLI RX|Unknown request in manager process (child not running).
**** v1    0.2 CLI RX|Type 'help' for more info.
**   v1    0.2 Stop
**** v1    0.2 CLI TX|stop
***  v1    0.2 CLI RX  300
**** v1    0.2 CLI RX|Child in state stopped
**** v1    0.2 CLI TX|status
***  v1    0.2 CLI RX  200
**** v1    0.2 CLI RX|Child in state stopped
**** v1    0.2 STDOUT poll 0x10
**   v1    0.2 R 782 Status: 0000 (u 0.004354 s 0.018559)
*    diag  0.0 ............................................................
#    top  TEST ../../../bin/varnishtest/tests/r00409.vtc TIMED OUT (kill -9)
#    top  TEST ../../../bin/varnishtest/tests/r00409.vtc FAILED (60.001) signal=9

1 @ SunOS 5.11 i86pc 1.04 64_gcc4.7 uplex

*    top   0.0 TEST ../../../bin/varnishtest/tests/r00409.vtc starting
[...]
*    top   0.0 TEST Regression test for ticket 409
[...]
**** v1    0.1 CLI TX|
**** v1    0.1 CLI TX|\tbackend b { .host = "127.0.0.1"; }
**** v1    0.1 CLI TX|\tsub vcl_recv {
**** v1    0.1 CLI TX|\t\tif ( req.url ~ ! "\.(png|jpg|gif|js|css)$" ) {
**** v1    0.1 CLI TX|\t\t\treturn (pass);
**** v1    0.1 CLI TX|\t\t}
**** v1    0.1 CLI TX|\t}
**** v1    0.1 CLI TX|
**** v1    0.1 CLI TX|%XJEIFLH|)Xspa8P
***  v1    0.1 CLI RX  106
**** v1    0.1 CLI RX|Message from VCC-compiler:
**** v1    0.1 CLI RX|Security: Privilege proc_setid missing, will not change uid/gid
**** v1    0.1 CLI RX|Expected CSTR got '!'
**** v1    0.1 CLI RX|(program line 1193), at
**** v1    0.1 CLI RX|('<vcl.inline>' Line 5 Pos 32)
**** v1    0.1 CLI RX|                if ( req.url ~ ! "\.(png|jpg|gif|js|css)$" ) {
**** v1    0.1 CLI RX|-------------------------------#------------------------------
**** v1    0.1 CLI RX|
**** v1    0.1 CLI RX|Running VCC-compiler failed, exited with 2
**** v1    0.1 CLI RX|VCL compilation failed
**   v1    0.1 VCL compilation failed (as expected)
***  v1    0.1 Found expected string: ("Expected CSTR got '!'")
*    top   0.1 RESETTING after ../../../bin/varnishtest/tests/r00409.vtc
**   v1    0.1 Wait
**** v1    0.1 CLI TX|backend.list
***  v1    0.1 CLI RX  101
**** v1    0.1 CLI RX|Unknown request in manager process (child not running).
**** v1    0.1 CLI RX|Type 'help' for more info.
**   v1    0.1 Stop
**** v1    0.1 CLI TX|stop
***  v1    0.1 CLI RX  300
**** v1    0.1 CLI RX|Child in state stopped
**** v1    0.1 CLI TX|status
***  v1    0.1 CLI RX  200
**** v1    0.1 CLI RX|Child in state stopped
**** v1    0.1 STDOUT poll 0x10
**   v1    0.1 R 65188 Status: 0000 (u 0.007000 s 0.025000)
*    diag  0.0 ............................................................
#    top  TEST ../../../bin/varnishtest/tests/r00409.vtc TIMED OUT (kill -9)
#    top  TEST ../../../bin/varnishtest/tests/r00409.vtc FAILED (60.005) signal=9

1 @ SunOS 5.11 i86pc 1.04 32_gcc4.7 uplex

*    top   0.0 TEST ../../../bin/varnishtest/tests/r00409.vtc starting
[...]
*    top   0.0 TEST Regression test for ticket 409
[...]
**** v1    0.1 CLI TX|
**** v1    0.1 CLI TX|\tbackend b { .host = "127.0.0.1"; }
**** v1    0.1 CLI TX|\tsub vcl_recv {
**** v1    0.1 CLI TX|\t\tif ( req.url ~ ! "\.(png|jpg|gif|js|css)$" ) {
**** v1    0.1 CLI TX|\t\t\treturn (pass);
**** v1    0.1 CLI TX|\t\t}
**** v1    0.1 CLI TX|\t}
**** v1    0.1 CLI TX|
**** v1    0.1 CLI TX|%XJEIFLH|)Xspa8P
***  v1    0.1 CLI RX  106
**** v1    0.1 CLI RX|Message from VCC-compiler:
**** v1    0.1 CLI RX|Security: Privilege proc_setid missing, will not change uid/gid
**** v1    0.1 CLI RX|Expected CSTR got '!'
**** v1    0.1 CLI RX|(program line 1193), at
**** v1    0.1 CLI RX|('<vcl.inline>' Line 5 Pos 32)
**** v1    0.1 CLI RX|                if ( req.url ~ ! "\.(png|jpg|gif|js|css)$" ) {
**** v1    0.1 CLI RX|-------------------------------#------------------------------
**** v1    0.1 CLI RX|
**** v1    0.1 CLI RX|Running VCC-compiler failed, exited with 2
**** v1    0.1 CLI RX|VCL compilation failed
**   v1    0.1 VCL compilation failed (as expected)
***  v1    0.1 Found expected string: ("Expected CSTR got '!'")
*    top   0.1 RESETTING after ../../../bin/varnishtest/tests/r00409.vtc
**   v1    0.1 Wait
**** v1    0.1 CLI TX|backend.list
***  v1    0.1 CLI RX  101
**** v1    0.1 CLI RX|Unknown request in manager process (child not running).
**** v1    0.1 CLI RX|Type 'help' for more info.
**   v1    0.1 Stop
**** v1    0.1 CLI TX|stop
***  v1    0.1 CLI RX  300
**** v1    0.1 CLI RX|Child in state stopped
**** v1    0.1 CLI TX|status
***  v1    0.1 CLI RX  200
**** v1    0.1 CLI RX|Child in state stopped
**** v1    0.1 STDOUT poll 0x10
**   v1    0.1 R 48520 Status: 0000 (u 0.005000 s 0.021000)
*    diag  0.0 ............................................................
#    top  TEST ../../../bin/varnishtest/tests/r00409.vtc TIMED OUT (kill -9)
#    top  TEST ../../../bin/varnishtest/tests/r00409.vtc FAILED (60.003) signal=9

1 @ Ubuntu LTS i686 1.04 fgs

*    top   0.0 TEST ../../../bin/varnishtest/tests/r00409.vtc starting
[...]
*    top   0.0 TEST Regression test for ticket 409
[...]
**** v1    0.1 CLI TX|vcl 4.0;
**** v1    0.1 CLI TX|
**** v1    0.1 CLI TX|\tbackend b { .host = "127.0.0.1"; }
**** v1    0.1 CLI TX|\tsub vcl_recv {
**** v1    0.1 CLI TX|\t\tif ( req.url ~ ! "\.(png|jpg|gif|js|css)$" ) {
**** v1    0.1 CLI TX|\t\t\treturn (pass);
**** v1    0.1 CLI TX|\t\t}
**** v1    0.1 CLI TX|\t}
**** v1    0.1 CLI TX|
**** v1    0.1 CLI TX|%XJEIFLH|)Xspa8P
***  v1    0.1 CLI RX  106
**** v1    0.1 CLI RX|Message from VCC-compiler:
**** v1    0.1 CLI RX|Expected CSTR got '!'
**** v1    0.1 CLI RX|(program line 1193), at
**** v1    0.1 CLI RX|('<vcl.inline>' Line 5 Pos 32)
**** v1    0.1 CLI RX|                if ( req.url ~ ! "\.(png|jpg|gif|js|css)$" ) {
**** v1    0.1 CLI RX|-------------------------------#------------------------------
**** v1    0.1 CLI RX|
**** v1    0.1 CLI RX|Running VCC-compiler failed, exited with 2
**** v1    0.1 CLI RX|VCL compilation failed
**   v1    0.1 VCL compilation failed (as expected)
***  v1    0.1 Found expected string: ("Expected CSTR got '!'")
*    top   0.1 RESETTING after ../../../bin/varnishtest/tests/r00409.vtc
**   v1    0.1 Wait
**** v1    0.1 CLI TX|backend.list
***  v1    0.1 CLI RX  101
**** v1    0.1 CLI RX|Unknown request in manager process (child not running).
**** v1    0.1 CLI RX|Type 'help' for more info.
**   v1    0.1 Stop
**** v1    0.1 CLI TX|stop
***  v1    0.2 CLI RX  300
**** v1    0.2 CLI RX|Child in state stopped
**** v1    0.2 CLI TX|status
***  v1    0.2 CLI RX  200
**** v1    0.2 CLI RX|Child in state stopped
**** v1    0.2 STDOUT poll 0x10
**   v1    0.2 R 4459 Status: 0000 (u 0.000000 s 0.004000)
*    diag  0.0 ............................................................
#    top  TEST ../../../bin/varnishtest/tests/r00409.vtc TIMED OUT (kill -9)
#    top  TEST ../../../bin/varnishtest/tests/r00409.vtc FAILED (60.001) signal=9

1 @ SunOS 5.11 i86pc 1.04 64_gcc4.7 uplex

*    top   0.0 TEST ../../../bin/varnishtest/tests/r00409.vtc starting
[...]
*    top   0.0 TEST Regression test for ticket 409
[...]
**** v1    0.2 CLI TX|
**** v1    0.2 CLI TX|\tbackend b { .host = "127.0.0.1"; }
**** v1    0.2 CLI TX|\tsub vcl_recv {
**** v1    0.2 CLI TX|\t\tif ( req.url ~ ! "\.(png|jpg|gif|js|css)$" ) {
**** v1    0.2 CLI TX|\t\t\treturn (pass);
**** v1    0.2 CLI TX|\t\t}
**** v1    0.2 CLI TX|\t}
**** v1    0.2 CLI TX|
**** v1    0.2 CLI TX|%XJEIFLH|)Xspa8P
***  v1    0.2 CLI RX  106
**** v1    0.2 CLI RX|Message from VCC-compiler:
**** v1    0.2 CLI RX|Security: Privilege proc_setid missing, will not change uid/gid
**** v1    0.2 CLI RX|Expected CSTR got '!'
**** v1    0.2 CLI RX|(program line 1193), at
**** v1    0.2 CLI RX|('<vcl.inline>' Line 5 Pos 32)
**** v1    0.2 CLI RX|                if ( req.url ~ ! "\.(png|jpg|gif|js|css)$" ) {
**** v1    0.2 CLI RX|-------------------------------#------------------------------
**** v1    0.2 CLI RX|
**** v1    0.2 CLI RX|Running VCC-compiler failed, exited with 2
**** v1    0.2 CLI RX|VCL compilation failed
**   v1    0.2 VCL compilation failed (as expected)
***  v1    0.2 Found expected string: ("Expected CSTR got '!'")
*    top   0.2 RESETTING after ../../../bin/varnishtest/tests/r00409.vtc
**   v1    0.2 Wait
**** v1    0.2 CLI TX|backend.list
***  v1    0.2 CLI RX  101
**** v1    0.2 CLI RX|Unknown request in manager process (child not running).
**** v1    0.2 CLI RX|Type 'help' for more info.
**   v1    0.2 Stop
**** v1    0.2 CLI TX|stop
***  v1    0.2 CLI RX  300
**** v1    0.2 CLI RX|Child in state stopped
**** v1    0.2 CLI TX|status
***  v1    0.2 CLI RX  200
**** v1    0.2 CLI RX|Child in state stopped
**** v1    0.2 STDOUT poll 0x10
**   v1    0.2 R 77480 Status: 0000 (u 0.009000 s 0.040000)
*    diag  0.0 ............................................................
#    top  TEST ../../../bin/varnishtest/tests/r00409.vtc TIMED OUT (kill -9)
#    top  TEST ../../../bin/varnishtest/tests/r00409.vtc FAILED (60.005) signal=9

1 @ Ubuntu LTS i686 1.04 fgs

*    top   0.0 TEST ../../../bin/varnishtest/tests/r00409.vtc starting
[...]
*    top   0.0 TEST Regression test for ticket 409
[...]
**** v1    0.1 CLI TX|vcl 4.0;
**** v1    0.1 CLI TX|
**** v1    0.1 CLI TX|\tbackend b { .host = "127.0.0.1"; }
**** v1    0.1 CLI TX|\tsub vcl_recv {
**** v1    0.1 CLI TX|\t\tif ( req.url ~ ! "\.(png|jpg|gif|js|css)$" ) {
**** v1    0.1 CLI TX|\t\t\treturn (pass);
**** v1    0.1 CLI TX|\t\t}
**** v1    0.1 CLI TX|\t}
**** v1    0.1 CLI TX|
**** v1    0.1 CLI TX|%XJEIFLH|)Xspa8P
***  v1    0.1 CLI RX  106
**** v1    0.1 CLI RX|Message from VCC-compiler:
**** v1    0.1 CLI RX|Expected CSTR got '!'
**** v1    0.1 CLI RX|(program line 1193), at
**** v1    0.1 CLI RX|('<vcl.inline>' Line 5 Pos 32)
**** v1    0.1 CLI RX|                if ( req.url ~ ! "\.(png|jpg|gif|js|css)$" ) {
**** v1    0.1 CLI RX|-------------------------------#------------------------------
**** v1    0.1 CLI RX|
**** v1    0.1 CLI RX|Running VCC-compiler failed, exited with 2
**** v1    0.1 CLI RX|VCL compilation failed
**   v1    0.1 VCL compilation failed (as expected)
***  v1    0.1 Found expected string: ("Expected CSTR got '!'")
*    top   0.1 RESETTING after ../../../bin/varnishtest/tests/r00409.vtc
**   v1    0.1 Wait
**** v1    0.1 CLI TX|backend.list
***  v1    0.1 CLI RX  101
**** v1    0.1 CLI RX|Unknown request in manager process (child not running).
**** v1    0.1 CLI RX|Type 'help' for more info.
**   v1    0.1 Stop
**** v1    0.1 CLI TX|stop
***  v1    0.2 CLI RX  300
**** v1    0.2 CLI RX|Child in state stopped
**** v1    0.2 CLI TX|status
***  v1    0.2 CLI RX  200
**** v1    0.2 CLI RX|Child in state stopped
**** v1    0.2 STDOUT poll 0x10
**   v1    0.2 R 15270 Status: 0000 (u 0.000000 s 0.004000)
*    diag  0.0 ............................................................
#    top  TEST ../../../bin/varnishtest/tests/r00409.vtc TIMED OUT (kill -9)
#    top  TEST ../../../bin/varnishtest/tests/r00409.vtc FAILED (60.001) signal=9

1 @ SunOS 5.11 i86pc 1.04 64_sun12.4 uplex

*    top   0.0 TEST ../../../bin/varnishtest/tests/r00409.vtc starting
[...]
*    top   0.0 TEST Regression test for ticket 409
[...]
**** v1    0.1 CLI TX|
**** v1    0.1 CLI TX|\tbackend b { .host = "127.0.0.1"; }
**** v1    0.1 CLI TX|\tsub vcl_recv {
**** v1    0.1 CLI TX|\t\tif ( req.url ~ ! "\.(png|jpg|gif|js|css)$" ) {
**** v1    0.1 CLI TX|\t\t\treturn (pass);
**** v1    0.1 CLI TX|\t\t}
**** v1    0.1 CLI TX|\t}
**** v1    0.1 CLI TX|
**** v1    0.1 CLI TX|%XJEIFLH|)Xspa8P
***  v1    0.1 CLI RX  106
**** v1    0.1 CLI RX|Message from VCC-compiler:
**** v1    0.1 CLI RX|Security: Privilege proc_setid missing, will not change uid/gid
**** v1    0.1 CLI RX|Expected CSTR got '!'
**** v1    0.1 CLI RX|(program line 1193), at
**** v1    0.1 CLI RX|('<vcl.inline>' Line 5 Pos 32)
**** v1    0.1 CLI RX|                if ( req.url ~ ! "\.(png|jpg|gif|js|css)$" ) {
**** v1    0.1 CLI RX|-------------------------------#------------------------------
**** v1    0.1 CLI RX|
**** v1    0.1 CLI RX|Running VCC-compiler failed, exited with 2
**** v1    0.1 CLI RX|VCL compilation failed
**   v1    0.1 VCL compilation failed (as expected)
***  v1    0.1 Found expected string: ("Expected CSTR got '!'")
*    top   0.1 RESETTING after ../../../bin/varnishtest/tests/r00409.vtc
**   v1    0.1 Wait
**** v1    0.1 CLI TX|backend.list
***  v1    0.1 CLI RX  101
**** v1    0.1 CLI RX|Unknown request in manager process (child not running).
**** v1    0.1 CLI RX|Type 'help' for more info.
**   v1    0.1 Stop
**** v1    0.1 CLI TX|stop
***  v1    0.1 CLI RX  300
**** v1    0.1 CLI RX|Child in state stopped
**** v1    0.1 CLI TX|status
***  v1    0.1 CLI RX  200
**** v1    0.1 CLI RX|Child in state stopped
**** v1    0.1 STDOUT poll 0x10
**   v1    0.1 R 79427 Status: 0000 (u 0.006000 s 0.021000)
*    diag  0.0 ............................................................
#    top  TEST ../../../bin/varnishtest/tests/r00409.vtc TIMED OUT (kill -9)
#    top  TEST ../../../bin/varnishtest/tests/r00409.vtc FAILED (60.003) signal=9

1 @ SunOS 5.11 i86pc 1.04 64_gcc4.7 uplex

*    top   0.0 TEST ../../../bin/varnishtest/tests/r00409.vtc starting
[...]
*    top   0.0 TEST Regression test for ticket 409
[...]
**** v1    0.1 CLI TX|
**** v1    0.1 CLI TX|\tbackend b { .host = "127.0.0.1"; }
**** v1    0.1 CLI TX|\tsub vcl_recv {
**** v1    0.1 CLI TX|\t\tif ( req.url ~ ! "\.(png|jpg|gif|js|css)$" ) {
**** v1    0.1 CLI TX|\t\t\treturn (pass);
**** v1    0.1 CLI TX|\t\t}
**** v1    0.1 CLI TX|\t}
**** v1    0.1 CLI TX|
**** v1    0.1 CLI TX|%XJEIFLH|)Xspa8P
***  v1    0.1 CLI RX  106
**** v1    0.1 CLI RX|Message from VCC-compiler:
**** v1    0.1 CLI RX|Security: Privilege proc_setid missing, will not change uid/gid
**** v1    0.1 CLI RX|Expected CSTR got '!'
**** v1    0.1 CLI RX|(program line 1193), at
**** v1    0.1 CLI RX|('<vcl.inline>' Line 5 Pos 32)
**** v1    0.1 CLI RX|                if ( req.url ~ ! "\.(png|jpg|gif|js|css)$" ) {
**** v1    0.1 CLI RX|-------------------------------#------------------------------
**** v1    0.1 CLI RX|
**** v1    0.1 CLI RX|Running VCC-compiler failed, exited with 2
**** v1    0.1 CLI RX|VCL compilation failed
**   v1    0.1 VCL compilation failed (as expected)
***  v1    0.1 Found expected string: ("Expected CSTR got '!'")
*    top   0.1 RESETTING after ../../../bin/varnishtest/tests/r00409.vtc
**   v1    0.1 Wait
**** v1    0.1 CLI TX|backend.list
***  v1    0.1 CLI RX  101
**** v1    0.1 CLI RX|Unknown request in manager process (child not running).
**** v1    0.1 CLI RX|Type 'help' for more info.
**   v1    0.1 Stop
**** v1    0.1 CLI TX|stop
***  v1    0.1 CLI RX  300
**** v1    0.1 CLI RX|Child in state stopped
**** v1    0.1 CLI TX|status
***  v1    0.1 CLI RX  200
**** v1    0.1 CLI RX|Child in state stopped
**** v1    0.1 STDOUT poll 0x10
**   v1    0.1 R 11272 Status: 0000 (u 0.007000 s 0.024000)
*    diag  0.0 ............................................................
#    top  TEST ../../../bin/varnishtest/tests/r00409.vtc TIMED OUT (kill -9)
#    top  TEST ../../../bin/varnishtest/tests/r00409.vtc FAILED (60.004) signal=9

1 @ SunOS 5.11 i86pc 1.04 32_gcc4.7 uplex

*    top   0.0 TEST ../../../bin/varnishtest/tests/r00409.vtc starting
[...]
*    top   0.0 TEST Regression test for ticket 409
[...]
**** v1    0.1 CLI TX|
**** v1    0.1 CLI TX|\tbackend b { .host = "127.0.0.1"; }
**** v1    0.1 CLI TX|\tsub vcl_recv {
**** v1    0.1 CLI TX|\t\tif ( req.url ~ ! "\.(png|jpg|gif|js|css)$" ) {
**** v1    0.1 CLI TX|\t\t\treturn (pass);
**** v1    0.1 CLI TX|\t\t}
**** v1    0.1 CLI TX|\t}
**** v1    0.1 CLI TX|
**** v1    0.1 CLI TX|%XJEIFLH|)Xspa8P
***  v1    0.1 CLI RX  106
**** v1    0.1 CLI RX|Message from VCC-compiler:
**** v1    0.1 CLI RX|Security: Privilege proc_setid missing, will not change uid/gid
**** v1    0.1 CLI RX|Expected CSTR got '!'
**** v1    0.1 CLI RX|(program line 1193), at
**** v1    0.1 CLI RX|('<vcl.inline>' Line 5 Pos 32)
**** v1    0.1 CLI RX|                if ( req.url ~ ! "\.(png|jpg|gif|js|css)$" ) {
**** v1    0.1 CLI RX|-------------------------------#------------------------------
**** v1    0.1 CLI RX|
**** v1    0.1 CLI RX|Running VCC-compiler failed, exited with 2
**** v1    0.1 CLI RX|VCL compilation failed
**   v1    0.1 VCL compilation failed (as expected)
***  v1    0.1 Found expected string: ("Expected CSTR got '!'")
*    top   0.1 RESETTING after ../../../bin/varnishtest/tests/r00409.vtc
**   v1    0.1 Wait
**** v1    0.1 CLI TX|backend.list
***  v1    0.1 CLI RX  101
**** v1    0.1 CLI RX|Unknown request in manager process (child not running).
**** v1    0.1 CLI RX|Type 'help' for more info.
**   v1    0.1 Stop
**** v1    0.1 CLI TX|stop
***  v1    0.1 CLI RX  300
**** v1    0.1 CLI RX|Child in state stopped
**** v1    0.1 CLI TX|status
***  v1    0.1 CLI RX  200
**** v1    0.1 CLI RX|Child in state stopped
**** v1    0.1 STDOUT poll 0x10
**   v1    0.1 R 34306 Status: 0000 (u 0.004000 s 0.019000)
*    diag  0.0 ............................................................
#    top  TEST ../../../bin/varnishtest/tests/r00409.vtc TIMED OUT (kill -9)
#    top  TEST ../../../bin/varnishtest/tests/r00409.vtc FAILED (60.003) signal=9

1 @ SunOS 5.11 i86pc 1.04 32_sun12.4 uplex

*    top   0.0 TEST ../../../bin/varnishtest/tests/r00409.vtc starting
[...]
*    top   0.0 TEST Regression test for ticket 409
[...]
**** v1    0.1 CLI TX|
**** v1    0.1 CLI TX|\tbackend b { .host = "127.0.0.1"; }
**** v1    0.1 CLI TX|\tsub vcl_recv {
**** v1    0.1 CLI TX|\t\tif ( req.url ~ ! "\.(png|jpg|gif|js|css)$" ) {
**** v1    0.1 CLI TX|\t\t\treturn (pass);
**** v1    0.1 CLI TX|\t\t}
**** v1    0.1 CLI TX|\t}
**** v1    0.1 CLI TX|
**** v1    0.1 CLI TX|%XJEIFLH|)Xspa8P
***  v1    0.1 CLI RX  106
**** v1    0.1 CLI RX|Message from VCC-compiler:
**** v1    0.1 CLI RX|Security: Privilege proc_setid missing, will not change uid/gid
**** v1    0.1 CLI RX|Expected CSTR got '!'
**** v1    0.1 CLI RX|(program line 1193), at
**** v1    0.1 CLI RX|('<vcl.inline>' Line 5 Pos 32)
**** v1    0.1 CLI RX|                if ( req.url ~ ! "\.(png|jpg|gif|js|css)$" ) {
**** v1    0.1 CLI RX|-------------------------------#------------------------------
**** v1    0.1 CLI RX|
**** v1    0.1 CLI RX|Running VCC-compiler failed, exited with 2
**** v1    0.1 CLI RX|VCL compilation failed
**   v1    0.1 VCL compilation failed (as expected)
***  v1    0.1 Found expected string: ("Expected CSTR got '!'")
*    top   0.1 RESETTING after ../../../bin/varnishtest/tests/r00409.vtc
**   v1    0.1 Wait
**** v1    0.1 CLI TX|backend.list
***  v1    0.1 CLI RX  101
**** v1    0.1 CLI RX|Unknown request in manager process (child not running).
**** v1    0.1 CLI RX|Type 'help' for more info.
**   v1    0.1 Stop
**** v1    0.1 CLI TX|stop
***  v1    0.1 CLI RX  300
**** v1    0.1 CLI RX|Child in state stopped
**** v1    0.1 CLI TX|status
***  v1    0.1 CLI RX  200
**** v1    0.1 CLI RX|Child in state stopped
**** v1    0.1 STDOUT poll 0x10
**   v1    0.1 R 89080 Status: 0000 (u 0.007000 s 0.027000)
*    diag  0.0 ............................................................
#    top  TEST ../../../bin/varnishtest/tests/r00409.vtc TIMED OUT (kill -9)
#    top  TEST ../../../bin/varnishtest/tests/r00409.vtc FAILED (60.003) signal=9

1 @ SunOS 5.11 i86pc 1.04 64_gcc4.7 uplex

*    top   0.0 TEST ../../../bin/varnishtest/tests/r00409.vtc starting
[...]
*    top   0.0 TEST Regression test for ticket 409
[...]
**** v1    0.2 CLI TX|
**** v1    0.2 CLI TX|\tbackend b { .host = "127.0.0.1"; }
**** v1    0.2 CLI TX|\tsub vcl_recv {
**** v1    0.2 CLI TX|\t\tif ( req.url ~ ! "\.(png|jpg|gif|js|css)$" ) {
**** v1    0.2 CLI TX|\t\t\treturn (pass);
**** v1    0.2 CLI TX|\t\t}
**** v1    0.2 CLI TX|\t}
**** v1    0.2 CLI TX|
**** v1    0.2 CLI TX|%XJEIFLH|)Xspa8P
***  v1    0.2 CLI RX  106
**** v1    0.2 CLI RX|Message from VCC-compiler:
**** v1    0.2 CLI RX|Security: Privilege proc_setid missing, will not change uid/gid
**** v1    0.2 CLI RX|Expected CSTR got '!'
**** v1    0.2 CLI RX|(program line 1193), at
**** v1    0.2 CLI RX|('<vcl.inline>' Line 5 Pos 32)
**** v1    0.2 CLI RX|                if ( req.url ~ ! "\.(png|jpg|gif|js|css)$" ) {
**** v1    0.2 CLI RX|-------------------------------#------------------------------
**** v1    0.2 CLI RX|
**** v1    0.2 CLI RX|Running VCC-compiler failed, exited with 2
**** v1    0.2 CLI RX|VCL compilation failed
**   v1    0.2 VCL compilation failed (as expected)
***  v1    0.2 Found expected string: ("Expected CSTR got '!'")
*    top   0.2 RESETTING after ../../../bin/varnishtest/tests/r00409.vtc
**   v1    0.2 Wait
**** v1    0.2 CLI TX|backend.list
***  v1    0.2 CLI RX  101
**** v1    0.2 CLI RX|Unknown request in manager process (child not running).
**** v1    0.2 CLI RX|Type 'help' for more info.
**   v1    0.2 Stop
**** v1    0.2 CLI TX|stop
***  v1    0.2 CLI RX  300
**** v1    0.2 CLI RX|Child in state stopped
**** v1    0.2 CLI TX|status
***  v1    0.2 CLI RX  200
**** v1    0.2 CLI RX|Child in state stopped
**** v1    0.2 STDOUT poll 0x10
**   v1    0.2 R 92603 Status: 0000 (u 0.010000 s 0.035000)
*    diag  0.0 ............................................................
#    top  TEST ../../../bin/varnishtest/tests/r00409.vtc TIMED OUT (kill -9)
#    top  TEST ../../../bin/varnishtest/tests/r00409.vtc FAILED (60.005) signal=9

1 @ SunOS 5.11 i86pc 1.04 64_gcc4.7 uplex

*    top   0.0 TEST ../../../bin/varnishtest/tests/r00409.vtc starting
[...]
*    top   0.0 TEST Regression test for ticket 409
[...]
**** v1    0.1 CLI TX|
**** v1    0.1 CLI TX|\tbackend b { .host = "127.0.0.1"; }
**** v1    0.1 CLI TX|\tsub vcl_recv {
**** v1    0.1 CLI TX|\t\tif ( req.url ~ ! "\.(png|jpg|gif|js|css)$" ) {
**** v1    0.1 CLI TX|\t\t\treturn (pass);
**** v1    0.1 CLI TX|\t\t}
**** v1    0.1 CLI TX|\t}
**** v1    0.1 CLI TX|
**** v1    0.1 CLI TX|%XJEIFLH|)Xspa8P
***  v1    0.1 CLI RX  106
**** v1    0.1 CLI RX|Message from VCC-compiler:
**** v1    0.1 CLI RX|Security: Privilege proc_setid missing, will not change uid/gid
**** v1    0.1 CLI RX|Expected CSTR got '!'
**** v1    0.1 CLI RX|(program line 1193), at
**** v1    0.1 CLI RX|('<vcl.inline>' Line 5 Pos 32)
**** v1    0.1 CLI RX|                if ( req.url ~ ! "\.(png|jpg|gif|js|css)$" ) {
**** v1    0.1 CLI RX|-------------------------------#------------------------------
**** v1    0.1 CLI RX|
**** v1    0.1 CLI RX|Running VCC-compiler failed, exited with 2
**** v1    0.1 CLI RX|VCL compilation failed
**   v1    0.1 VCL compilation failed (as expected)
***  v1    0.1 Found expected string: ("Expected CSTR got '!'")
*    top   0.1 RESETTING after ../../../bin/varnishtest/tests/r00409.vtc
**   v1    0.1 Wait
**** v1    0.1 CLI TX|backend.list
***  v1    0.1 CLI RX  101
**** v1    0.1 CLI RX|Unknown request in manager process (child not running).
**** v1    0.1 CLI RX|Type 'help' for more info.
**   v1    0.1 Stop
**** v1    0.1 CLI TX|stop
***  v1    0.1 CLI RX  300
**** v1    0.1 CLI RX|Child in state stopped
**** v1    0.1 CLI TX|status
***  v1    0.1 CLI RX  200
**** v1    0.1 CLI RX|Child in state stopped
**** v1    0.1 STDOUT poll 0x10
**   v1    0.1 R 1824 Status: 0000 (u 0.006000 s 0.022000)
*    diag  0.0 ............................................................
#    top  TEST ../../../bin/varnishtest/tests/r00409.vtc TIMED OUT (kill -9)
#    top  TEST ../../../bin/varnishtest/tests/r00409.vtc FAILED (60.004) signal=9

1 @ SunOS 5.11 i86pc 1.04 64_sun12.4 uplex

*    top   0.0 TEST ../../../bin/varnishtest/tests/r00409.vtc starting
[...]
*    top   0.0 TEST Regression test for ticket 409
[...]
**** v1    0.1 CLI TX|
**** v1    0.1 CLI TX|\tbackend b { .host = "127.0.0.1"; }
**** v1    0.1 CLI TX|\tsub vcl_recv {
**** v1    0.1 CLI TX|\t\tif ( req.url ~ ! "\.(png|jpg|gif|js|css)$" ) {
**** v1    0.1 CLI TX|\t\t\treturn (pass);
**** v1    0.1 CLI TX|\t\t}
**** v1    0.1 CLI TX|\t}
**** v1    0.1 CLI TX|
**** v1    0.1 CLI TX|%XJEIFLH|)Xspa8P
***  v1    0.1 CLI RX  106
**** v1    0.1 CLI RX|Message from VCC-compiler:
**** v1    0.1 CLI RX|Security: Privilege proc_setid missing, will not change uid/gid
**** v1    0.1 CLI RX|Expected CSTR got '!'
**** v1    0.1 CLI RX|(program line 1193), at
**** v1    0.1 CLI RX|('<vcl.inline>' Line 5 Pos 32)
**** v1    0.1 CLI RX|                if ( req.url ~ ! "\.(png|jpg|gif|js|css)$" ) {
**** v1    0.1 CLI RX|-------------------------------#------------------------------
**** v1    0.1 CLI RX|
**** v1    0.1 CLI RX|Running VCC-compiler failed, exited with 2
**** v1    0.1 CLI RX|VCL compilation failed
**   v1    0.1 VCL compilation failed (as expected)
***  v1    0.1 Found expected string: ("Expected CSTR got '!'")
*    top   0.1 RESETTING after ../../../bin/varnishtest/tests/r00409.vtc
**   v1    0.1 Wait
**** v1    0.1 CLI TX|backend.list
***  v1    0.1 CLI RX  101
**** v1    0.1 CLI RX|Unknown request in manager process (child not running).
**** v1    0.1 CLI RX|Type 'help' for more info.
**   v1    0.1 Stop
**** v1    0.1 CLI TX|stop
***  v1    0.1 CLI RX  300
**** v1    0.1 CLI RX|Child in state stopped
**** v1    0.1 CLI TX|status
***  v1    0.1 CLI RX  200
**** v1    0.1 CLI RX|Child in state stopped
**** v1    0.1 STDOUT poll 0x10
**   v1    0.1 R 25476 Status: 0000 (u 0.007000 s 0.022000)
*    diag  0.0 ............................................................
#    top  TEST ../../../bin/varnishtest/tests/r00409.vtc TIMED OUT (kill -9)
#    top  TEST ../../../bin/varnishtest/tests/r00409.vtc FAILED (60.003) signal=9

1 @ Ubuntu LTS i686 1.04 fgs

*    top   0.0 TEST ../../../bin/varnishtest/tests/r00409.vtc starting
[...]
*    top   0.0 TEST Regression test for ticket 409
[...]
**** v1    0.1 CLI TX|vcl 4.0;
**** v1    0.1 CLI TX|
**** v1    0.1 CLI TX|\tbackend b { .host = "127.0.0.1"; }
**** v1    0.1 CLI TX|\tsub vcl_recv {
**** v1    0.1 CLI TX|\t\tif ( req.url ~ ! "\.(png|jpg|gif|js|css)$" ) {
**** v1    0.1 CLI TX|\t\t\treturn (pass);
**** v1    0.1 CLI TX|\t\t}
**** v1    0.1 CLI TX|\t}
**** v1    0.1 CLI TX|
**** v1    0.1 CLI TX|%XJEIFLH|)Xspa8P
***  v1    0.1 CLI RX  106
**** v1    0.1 CLI RX|Message from VCC-compiler:
**** v1    0.1 CLI RX|Expected CSTR got '!'
**** v1    0.1 CLI RX|(program line 1193), at
**** v1    0.1 CLI RX|('<vcl.inline>' Line 5 Pos 32)
**** v1    0.1 CLI RX|                if ( req.url ~ ! "\.(png|jpg|gif|js|css)$" ) {
**** v1    0.1 CLI RX|-------------------------------#------------------------------
**** v1    0.1 CLI RX|
**** v1    0.1 CLI RX|Running VCC-compiler failed, exited with 2
**** v1    0.1 CLI RX|VCL compilation failed
**   v1    0.1 VCL compilation failed (as expected)
***  v1    0.1 Found expected string: ("Expected CSTR got '!'")
*    top   0.1 RESETTING after ../../../bin/varnishtest/tests/r00409.vtc
**   v1    0.1 Wait
**** v1    0.1 CLI TX|backend.list
***  v1    0.1 CLI RX  101
**** v1    0.1 CLI RX|Unknown request in manager process (child not running).
**** v1    0.1 CLI RX|Type 'help' for more info.
**   v1    0.1 Stop
**** v1    0.1 CLI TX|stop
***  v1    0.2 CLI RX  300
**** v1    0.2 CLI RX|Child in state stopped
**** v1    0.2 CLI TX|status
***  v1    0.2 CLI RX  200
**** v1    0.2 CLI RX|Child in state stopped
**** v1    0.2 STDOUT poll 0x10
**   v1    0.2 R 6392 Status: 0000 (u 0.000000 s 0.004000)
*    diag  0.0 ............................................................
#    top  TEST ../../../bin/varnishtest/tests/r00409.vtc TIMED OUT (kill -9)
#    top  TEST ../../../bin/varnishtest/tests/r00409.vtc FAILED (60.001) signal=9

1 @ SunOS 5.11 i86pc 1.04 64_sun12.4 uplex

*    top   0.0 TEST ../../../bin/varnishtest/tests/r00409.vtc starting
[...]
*    top   0.0 TEST Regression test for ticket 409
[...]
**** v1    0.1 CLI TX|
**** v1    0.1 CLI TX|\tbackend b { .host = "127.0.0.1"; }
**** v1    0.1 CLI TX|\tsub vcl_recv {
**** v1    0.1 CLI TX|\t\tif ( req.url ~ ! "\.(png|jpg|gif|js|css)$" ) {
**** v1    0.1 CLI TX|\t\t\treturn (pass);
**** v1    0.1 CLI TX|\t\t}
**** v1    0.1 CLI TX|\t}
**** v1    0.1 CLI TX|
**** v1    0.1 CLI TX|%XJEIFLH|)Xspa8P
***  v1    0.1 CLI RX  106
**** v1    0.1 CLI RX|Message from VCC-compiler:
**** v1    0.1 CLI RX|Security: Privilege proc_setid missing, will not change uid/gid
**** v1    0.1 CLI RX|Expected CSTR got '!'
**** v1    0.1 CLI RX|(program line 1193), at
**** v1    0.1 CLI RX|('<vcl.inline>' Line 5 Pos 32)
**** v1    0.1 CLI RX|                if ( req.url ~ ! "\.(png|jpg|gif|js|css)$" ) {
**** v1    0.1 CLI RX|-------------------------------#------------------------------
**** v1    0.1 CLI RX|
**** v1    0.1 CLI RX|Running VCC-compiler failed, exited with 2
**** v1    0.1 CLI RX|VCL compilation failed
**   v1    0.1 VCL compilation failed (as expected)
***  v1    0.1 Found expected string: ("Expected CSTR got '!'")
*    top   0.1 RESETTING after ../../../bin/varnishtest/tests/r00409.vtc
**   v1    0.1 Wait
**** v1    0.1 CLI TX|backend.list
***  v1    0.1 CLI RX  101
**** v1    0.1 CLI RX|Unknown request in manager process (child not running).
**** v1    0.1 CLI RX|Type 'help' for more info.
**   v1    0.1 Stop
**** v1    0.1 CLI TX|stop
***  v1    0.1 CLI RX  300
**** v1    0.1 CLI RX|Child in state stopped
**** v1    0.1 CLI TX|status
***  v1    0.1 CLI RX  200
**** v1    0.1 CLI RX|Child in state stopped
**** v1    0.1 STDOUT poll 0x10
**   v1    0.1 R 18001 Status: 0000 (u 0.007000 s 0.022000)
*    diag  0.0 ............................................................
#    top  TEST ../../../bin/varnishtest/tests/r00409.vtc TIMED OUT (kill -9)
#    top  TEST ../../../bin/varnishtest/tests/r00409.vtc FAILED (60.005) signal=9

1 @ SunOS 5.11 i86pc 1.04 64_sun12.4 uplex

*    top   0.0 TEST ../../../bin/varnishtest/tests/r00409.vtc starting
[...]
*    top   0.0 TEST Regression test for ticket 409
[...]
**** v1    0.1 CLI TX|
**** v1    0.1 CLI TX|\tbackend b { .host = "127.0.0.1"; }
**** v1    0.1 CLI TX|\tsub vcl_recv {
**** v1    0.1 CLI TX|\t\tif ( req.url ~ ! "\.(png|jpg|gif|js|css)$" ) {
**** v1    0.1 CLI TX|\t\t\treturn (pass);
**** v1    0.1 CLI TX|\t\t}
**** v1    0.1 CLI TX|\t}
**** v1    0.1 CLI TX|
**** v1    0.1 CLI TX|%XJEIFLH|)Xspa8P
***  v1    0.1 CLI RX  106
**** v1    0.1 CLI RX|Message from VCC-compiler:
**** v1    0.1 CLI RX|Security: Privilege proc_setid missing, will not change uid/gid
**** v1    0.1 CLI RX|Expected CSTR got '!'
**** v1    0.1 CLI RX|(program line 1193), at
**** v1    0.1 CLI RX|('<vcl.inline>' Line 5 Pos 32)
**** v1    0.1 CLI RX|                if ( req.url ~ ! "\.(png|jpg|gif|js|css)$" ) {
**** v1    0.1 CLI RX|-------------------------------#------------------------------
**** v1    0.1 CLI RX|
**** v1    0.1 CLI RX|Running VCC-compiler failed, exited with 2
**** v1    0.1 CLI RX|VCL compilation failed
**   v1    0.1 VCL compilation failed (as expected)
***  v1    0.1 Found expected string: ("Expected CSTR got '!'")
*    top   0.1 RESETTING after ../../../bin/varnishtest/tests/r00409.vtc
**   v1    0.1 Wait
**** v1    0.1 CLI TX|backend.list
***  v1    0.1 CLI RX  101
**** v1    0.1 CLI RX|Unknown request in manager process (child not running).
**** v1    0.1 CLI RX|Type 'help' for more info.
**   v1    0.1 Stop
**** v1    0.1 CLI TX|stop
***  v1    0.1 CLI RX  300
**** v1    0.1 CLI RX|Child in state stopped
**** v1    0.1 CLI TX|status
***  v1    0.1 CLI RX  200
**** v1    0.1 CLI RX|Child in state stopped
**** v1    0.1 STDOUT poll 0x10
**   v1    0.1 R 11490 Status: 0000 (u 0.006000 s 0.022000)
*    diag  0.0 ............................................................
#    top  TEST ../../../bin/varnishtest/tests/r00409.vtc TIMED OUT (kill -9)
#    top  TEST ../../../bin/varnishtest/tests/r00409.vtc FAILED (60.003) signal=9

1 @ SunOS 5.11 i86pc 1.04 32_sun12.4 uplex

*    top   0.0 TEST ../../../bin/varnishtest/tests/r00409.vtc starting
[...]
*    top   0.0 TEST Regression test for ticket 409
[...]
**** v1    0.1 CLI TX|
**** v1    0.1 CLI TX|\tbackend b { .host = "127.0.0.1"; }
**** v1    0.1 CLI TX|\tsub vcl_recv {
**** v1    0.1 CLI TX|\t\tif ( req.url ~ ! "\.(png|jpg|gif|js|css)$" ) {
**** v1    0.1 CLI TX|\t\t\treturn (pass);
**** v1    0.1 CLI TX|\t\t}
**** v1    0.1 CLI TX|\t}
**** v1    0.1 CLI TX|
**** v1    0.1 CLI TX|%XJEIFLH|)Xspa8P
***  v1    0.1 CLI RX  106
**** v1    0.1 CLI RX|Message from VCC-compiler:
**** v1    0.1 CLI RX|Security: Privilege proc_setid missing, will not change uid/gid
**** v1    0.1 CLI RX|Expected CSTR got '!'
**** v1    0.1 CLI RX|(program line 1193), at
**** v1    0.1 CLI RX|('<vcl.inline>' Line 5 Pos 32)
**** v1    0.1 CLI RX|                if ( req.url ~ ! "\.(png|jpg|gif|js|css)$" ) {
**** v1    0.1 CLI RX|-------------------------------#------------------------------
**** v1    0.1 CLI RX|
**** v1    0.1 CLI RX|Running VCC-compiler failed, exited with 2
**** v1    0.1 CLI RX|VCL compilation failed
**   v1    0.1 VCL compilation failed (as expected)
***  v1    0.1 Found expected string: ("Expected CSTR got '!'")
*    top   0.1 RESETTING after ../../../bin/varnishtest/tests/r00409.vtc
**   v1    0.1 Wait
**** v1    0.1 CLI TX|backend.list
***  v1    0.1 CLI RX  101
**** v1    0.1 CLI RX|Unknown request in manager process (child not running).
**** v1    0.1 CLI RX|Type 'help' for more info.
**   v1    0.1 Stop
**** v1    0.1 CLI TX|stop
***  v1    0.1 CLI RX  300
**** v1    0.1 CLI RX|Child in state stopped
**** v1    0.1 CLI TX|status
***  v1    0.1 CLI RX  200
**** v1    0.1 CLI RX|Child in state stopped
**** v1    0.1 STDOUT poll 0x10
**   v1    0.1 R 75659 Status: 0000 (u 0.005000 s 0.020000)
*    diag  0.0 ............................................................
#    top  TEST ../../../bin/varnishtest/tests/r00409.vtc TIMED OUT (kill -9)
#    top  TEST ../../../bin/varnishtest/tests/r00409.vtc FAILED (60.002) signal=9

1 @ SunOS 5.11 i86pc 1.04 64_gcc4.7 uplex

*    top   0.0 TEST ../../../bin/varnishtest/tests/r00409.vtc starting
[...]
*    top   0.0 TEST Regression test for ticket 409
[...]
**** v1    0.1 CLI TX|
**** v1    0.1 CLI TX|\tbackend b { .host = "127.0.0.1"; }
**** v1    0.1 CLI TX|\tsub vcl_recv {
**** v1    0.1 CLI TX|\t\tif ( req.url ~ ! "\.(png|jpg|gif|js|css)$" ) {
**** v1    0.1 CLI TX|\t\t\treturn (pass);
**** v1    0.1 CLI TX|\t\t}
**** v1    0.1 CLI TX|\t}
**** v1    0.1 CLI TX|
**** v1    0.1 CLI TX|%XJEIFLH|)Xspa8P
***  v1    0.1 CLI RX  106
**** v1    0.1 CLI RX|Message from VCC-compiler:
**** v1    0.1 CLI RX|Security: Privilege proc_setid missing, will not change uid/gid
**** v1    0.1 CLI RX|Expected CSTR got '!'
**** v1    0.1 CLI RX|(program line 1193), at
**** v1    0.1 CLI RX|('<vcl.inline>' Line 5 Pos 32)
**** v1    0.1 CLI RX|                if ( req.url ~ ! "\.(png|jpg|gif|js|css)$" ) {
**** v1    0.1 CLI RX|-------------------------------#------------------------------
**** v1    0.1 CLI RX|
**** v1    0.1 CLI RX|Running VCC-compiler failed, exited with 2
**** v1    0.1 CLI RX|VCL compilation failed
**   v1    0.1 VCL compilation failed (as expected)
***  v1    0.1 Found expected string: ("Expected CSTR got '!'")
*    top   0.1 RESETTING after ../../../bin/varnishtest/tests/r00409.vtc
**   v1    0.1 Wait
**** v1    0.1 CLI TX|backend.list
***  v1    0.1 CLI RX  101
**** v1    0.1 CLI RX|Unknown request in manager process (child not running).
**** v1    0.1 CLI RX|Type 'help' for more info.
**   v1    0.1 Stop
**** v1    0.1 CLI TX|stop
***  v1    0.1 CLI RX  300
**** v1    0.1 CLI RX|Child in state stopped
**** v1    0.1 CLI TX|status
***  v1    0.1 CLI RX  200
**** v1    0.1 CLI RX|Child in state stopped
**** v1    0.1 STDOUT poll 0x10
**   v1    0.1 R 34176 Status: 0000 (u 0.006000 s 0.022000)
*    diag  0.0 ............................................................
#    top  TEST ../../../bin/varnishtest/tests/r00409.vtc TIMED OUT (kill -9)
#    top  TEST ../../../bin/varnishtest/tests/r00409.vtc FAILED (60.003) signal=9

1 @ SunOS 5.11 i86pc 1.04 32_gcc4.7 uplex

*    top   0.0 TEST ../../../bin/varnishtest/tests/r00409.vtc starting
[...]
*    top   0.0 TEST Regression test for ticket 409
[...]
**** v1    0.1 CLI TX|
**** v1    0.1 CLI TX|\tbackend b { .host = "127.0.0.1"; }
**** v1    0.1 CLI TX|\tsub vcl_recv {
**** v1    0.1 CLI TX|\t\tif ( req.url ~ ! "\.(png|jpg|gif|js|css)$" ) {
**** v1    0.1 CLI TX|\t\t\treturn (pass);
**** v1    0.1 CLI TX|\t\t}
**** v1    0.1 CLI TX|\t}
**** v1    0.1 CLI TX|
**** v1    0.1 CLI TX|%XJEIFLH|)Xspa8P
***  v1    0.1 CLI RX  106
**** v1    0.1 CLI RX|Message from VCC-compiler:
**** v1    0.1 CLI RX|Security: Privilege proc_setid missing, will not change uid/gid
**** v1    0.1 CLI RX|Expected CSTR got '!'
**** v1    0.1 CLI RX|(program line 1193), at
**** v1    0.1 CLI RX|('<vcl.inline>' Line 5 Pos 32)
**** v1    0.1 CLI RX|                if ( req.url ~ ! "\.(png|jpg|gif|js|css)$" ) {
**** v1    0.1 CLI RX|-------------------------------#------------------------------
**** v1    0.1 CLI RX|
**** v1    0.1 CLI RX|Running VCC-compiler failed, exited with 2
**** v1    0.1 CLI RX|VCL compilation failed
**   v1    0.1 VCL compilation failed (as expected)
***  v1    0.1 Found expected string: ("Expected CSTR got '!'")
*    top   0.1 RESETTING after ../../../bin/varnishtest/tests/r00409.vtc
**   v1    0.1 Wait
**** v1    0.1 CLI TX|backend.list
***  v1    0.1 CLI RX  101
**** v1    0.1 CLI RX|Unknown request in manager process (child not running).
**** v1    0.1 CLI RX|Type 'help' for more info.
**   v1    0.1 Stop
**** v1    0.1 CLI TX|stop
***  v1    0.1 CLI RX  300
**** v1    0.1 CLI RX|Child in state stopped
**** v1    0.1 CLI TX|status
***  v1    0.1 CLI RX  200
**** v1    0.1 CLI RX|Child in state stopped
**** v1    0.1 STDOUT poll 0x10
**   v1    0.1 R 51028 Status: 0000 (u 0.004000 s 0.018000)
*    diag  0.0 ............................................................
#    top  TEST ../../../bin/varnishtest/tests/r00409.vtc TIMED OUT (kill -9)
#    top  TEST ../../../bin/varnishtest/tests/r00409.vtc FAILED (60.002) signal=9

1 @ Ubuntu LTS i686 1.04 fgs

*    top   0.0 TEST ../../../bin/varnishtest/tests/r00409.vtc starting
[...]
*    top   0.0 TEST Regression test for ticket 409
[...]
**** v1    0.1 CLI TX|vcl 4.0;
**** v1    0.1 CLI TX|
**** v1    0.1 CLI TX|\tbackend b { .host = "127.0.0.1"; }
**** v1    0.1 CLI TX|\tsub vcl_recv {
**** v1    0.1 CLI TX|\t\tif ( req.url ~ ! "\.(png|jpg|gif|js|css)$" ) {
**** v1    0.1 CLI TX|\t\t\treturn (pass);
**** v1    0.1 CLI TX|\t\t}
**** v1    0.1 CLI TX|\t}
**** v1    0.1 CLI TX|
**** v1    0.1 CLI TX|%XJEIFLH|)Xspa8P
***  v1    0.1 CLI RX  106
**** v1    0.1 CLI RX|Message from VCC-compiler:
**** v1    0.1 CLI RX|Expected CSTR got '!'
**** v1    0.1 CLI RX|(program line 1193), at
**** v1    0.1 CLI RX|('<vcl.inline>' Line 5 Pos 32)
**** v1    0.1 CLI RX|                if ( req.url ~ ! "\.(png|jpg|gif|js|css)$" ) {
**** v1    0.1 CLI RX|-------------------------------#------------------------------
**** v1    0.1 CLI RX|
**** v1    0.1 CLI RX|Running VCC-compiler failed, exited with 2
**** v1    0.1 CLI RX|VCL compilation failed
**   v1    0.1 VCL compilation failed (as expected)
***  v1    0.1 Found expected string: ("Expected CSTR got '!'")
*    top   0.1 RESETTING after ../../../bin/varnishtest/tests/r00409.vtc
**   v1    0.1 Wait
**** v1    0.1 CLI TX|backend.list
***  v1    0.1 CLI RX  101
**** v1    0.1 CLI RX|Unknown request in manager process (child not running).
**** v1    0.1 CLI RX|Type 'help' for more info.
**   v1    0.1 Stop
**** v1    0.1 CLI TX|stop
***  v1    0.2 CLI RX  300
**** v1    0.2 CLI RX|Child in state stopped
**** v1    0.2 CLI TX|status
***  v1    0.2 CLI RX  200
**** v1    0.2 CLI RX|Child in state stopped
**** v1    0.2 STDOUT poll 0x10
**   v1    0.2 R 9414 Status: 0000 (u 0.000000 s 0.004000)
*    diag  0.0 ............................................................
#    top  TEST ../../../bin/varnishtest/tests/r00409.vtc TIMED OUT (kill -9)
#    top  TEST ../../../bin/varnishtest/tests/r00409.vtc FAILED (60.001) signal=9

1 @ SunOS 5.11 i86pc 1.04 32_gcc4.7 uplex

*    top   0.0 TEST ../../../bin/varnishtest/tests/r00409.vtc starting
[...]
*    top   0.0 TEST Regression test for ticket 409
[...]
**** v1    0.1 CLI TX|
**** v1    0.1 CLI TX|\tbackend b { .host = "127.0.0.1"; }
**** v1    0.1 CLI TX|\tsub vcl_recv {
**** v1    0.1 CLI TX|\t\tif ( req.url ~ ! "\.(png|jpg|gif|js|css)$" ) {
**** v1    0.1 CLI TX|\t\t\treturn (pass);
**** v1    0.1 CLI TX|\t\t}
**** v1    0.1 CLI TX|\t}
**** v1    0.1 CLI TX|
**** v1    0.1 CLI TX|%XJEIFLH|)Xspa8P
***  v1    0.1 CLI RX  106
**** v1    0.1 CLI RX|Message from VCC-compiler:
**** v1    0.1 CLI RX|Security: Privilege proc_setid missing, will not change uid/gid
**** v1    0.1 CLI RX|Expected CSTR got '!'
**** v1    0.1 CLI RX|(program line 1193), at
**** v1    0.1 CLI RX|('<vcl.inline>' Line 5 Pos 32)
**** v1    0.1 CLI RX|                if ( req.url ~ ! "\.(png|jpg|gif|js|css)$" ) {
**** v1    0.1 CLI RX|-------------------------------#------------------------------
**** v1    0.1 CLI RX|
**** v1    0.1 CLI RX|Running VCC-compiler failed, exited with 2
**** v1    0.1 CLI RX|VCL compilation failed
**   v1    0.1 VCL compilation failed (as expected)
***  v1    0.1 Found expected string: ("Expected CSTR got '!'")
*    top   0.1 RESETTING after ../../../bin/varnishtest/tests/r00409.vtc
**   v1    0.1 Wait
**** v1    0.1 CLI TX|backend.list
***  v1    0.1 CLI RX  101
**** v1    0.1 CLI RX|Unknown request in manager process (child not running).
**** v1    0.1 CLI RX|Type 'help' for more info.
**   v1    0.1 Stop
**** v1    0.1 CLI TX|stop
***  v1    0.1 CLI RX  300
**** v1    0.1 CLI RX|Child in state stopped
**** v1    0.1 CLI TX|status
***  v1    0.1 CLI RX  200
**** v1    0.1 CLI RX|Child in state stopped
**** v1    0.1 STDOUT poll 0x10
**   v1    0.1 R 13065 Status: 0000 (u 0.004000 s 0.017000)
*    diag  0.0 ............................................................
#    top  TEST ../../../bin/varnishtest/tests/r00409.vtc TIMED OUT (kill -9)
#    top  TEST ../../../bin/varnishtest/tests/r00409.vtc FAILED (60.002) signal=9

1 @ Linux 3.10.0 x86_64 1.02 mblissett

*    top   0.0 TEST ../../../bin/varnishtest/tests/r00409.vtc starting
[...]
*    top   0.0 TEST Regression test for ticket 409
[...]
**** v1    0.1 CLI TX|vcl 4.0;
**** v1    0.1 CLI TX|
**** v1    0.1 CLI TX|\tbackend b { .host = "127.0.0.1"; }
**** v1    0.1 CLI TX|\tsub vcl_recv {
**** v1    0.1 CLI TX|\t\tif ( req.url ~ ! "\.(png|jpg|gif|js|css)$" ) {
**** v1    0.1 CLI TX|\t\t\treturn (pass);
**** v1    0.1 CLI TX|\t\t}
**** v1    0.1 CLI TX|\t}
**** v1    0.1 CLI TX|
**** v1    0.1 CLI TX|%XJEIFLH|)Xspa8P
***  v1    0.1 CLI RX  106
**** v1    0.1 CLI RX|Message from VCC-compiler:
**** v1    0.1 CLI RX|Expected CSTR got '!'
**** v1    0.1 CLI RX|(program line 1193), at
**** v1    0.1 CLI RX|('<vcl.inline>' Line 5 Pos 32)
**** v1    0.1 CLI RX|                if ( req.url ~ ! "\.(png|jpg|gif|js|css)$" ) {
**** v1    0.1 CLI RX|-------------------------------#------------------------------
**** v1    0.1 CLI RX|
**** v1    0.1 CLI RX|Running VCC-compiler failed, exited with 2
**** v1    0.1 CLI RX|VCL compilation failed
**   v1    0.1 VCL compilation failed (as expected)
***  v1    0.1 Found expected string: ("Expected CSTR got '!'")
*    top   0.1 RESETTING after ../../../bin/varnishtest/tests/r00409.vtc
**   v1    0.1 Wait
**** v1    0.1 CLI TX|backend.list
***  v1    0.2 CLI RX  101
**** v1    0.2 CLI RX|Unknown request in manager process (child not running).
**** v1    0.2 CLI RX|Type 'help' for more info.
**   v1    0.2 Stop
**** v1    0.2 CLI TX|stop
***  v1    0.2 CLI RX  300
**** v1    0.2 CLI RX|Child in state stopped
**** v1    0.2 CLI TX|status
***  v1    0.2 CLI RX  200
**** v1    0.2 CLI RX|Child in state stopped
**** v1    0.2 STDOUT poll 0x10
**   v1    0.2 R 20582 Status: 0000 (u 0.002160 s 0.016442)
*    diag  0.0 ............................................................
#    top  TEST ../../../bin/varnishtest/tests/r00409.vtc TIMED OUT (kill -9)
#    top  TEST ../../../bin/varnishtest/tests/r00409.vtc FAILED (60.001) signal=9

1 @ SunOS 5.11 i86pc 1.04 32_gcc4.7 uplex

*    top   0.0 TEST ../../../bin/varnishtest/tests/r00409.vtc starting
[...]
*    top   0.0 TEST Regression test for ticket 409
[...]
**** v1    0.1 CLI TX|
**** v1    0.1 CLI TX|\tbackend b { .host = "127.0.0.1"; }
**** v1    0.1 CLI TX|\tsub vcl_recv {
**** v1    0.1 CLI TX|\t\tif ( req.url ~ ! "\.(png|jpg|gif|js|css)$" ) {
**** v1    0.1 CLI TX|\t\t\treturn (pass);
**** v1    0.1 CLI TX|\t\t}
**** v1    0.1 CLI TX|\t}
**** v1    0.1 CLI TX|
**** v1    0.1 CLI TX|%XJEIFLH|)Xspa8P
***  v1    0.1 CLI RX  106
**** v1    0.1 CLI RX|Message from VCC-compiler:
**** v1    0.1 CLI RX|Security: Privilege proc_setid missing, will not change uid/gid
**** v1    0.1 CLI RX|Expected CSTR got '!'
**** v1    0.1 CLI RX|(program line 1193), at
**** v1    0.1 CLI RX|('<vcl.inline>' Line 5 Pos 32)
**** v1    0.1 CLI RX|                if ( req.url ~ ! "\.(png|jpg|gif|js|css)$" ) {
**** v1    0.1 CLI RX|-------------------------------#------------------------------
**** v1    0.1 CLI RX|
**** v1    0.1 CLI RX|Running VCC-compiler failed, exited with 2
**** v1    0.1 CLI RX|VCL compilation failed
**   v1    0.1 VCL compilation failed (as expected)
***  v1    0.1 Found expected string: ("Expected CSTR got '!'")
*    top   0.1 RESETTING after ../../../bin/varnishtest/tests/r00409.vtc
**   v1    0.1 Wait
**** v1    0.1 CLI TX|backend.list
***  v1    0.1 CLI RX  101
**** v1    0.1 CLI RX|Unknown request in manager process (child not running).
**** v1    0.1 CLI RX|Type 'help' for more info.
**   v1    0.1 Stop
**** v1    0.1 CLI TX|stop
***  v1    0.1 CLI RX  300
**** v1    0.1 CLI RX|Child in state stopped
**** v1    0.1 CLI TX|status
***  v1    0.1 CLI RX  200
**** v1    0.1 CLI RX|Child in state stopped
**** v1    0.1 STDOUT poll 0x10
**   v1    0.1 R 39113 Status: 0000 (u 0.006000 s 0.026000)
*    diag  0.0 ............................................................
#    top  TEST ../../../bin/varnishtest/tests/r00409.vtc TIMED OUT (kill -9)
#    top  TEST ../../../bin/varnishtest/tests/r00409.vtc FAILED (60.003) signal=9

1 @ SunOS 5.11 i86pc 1.04 32_sun12.4 uplex

*    top   0.0 TEST ../../../bin/varnishtest/tests/r00409.vtc starting
[...]
*    top   0.0 TEST Regression test for ticket 409
[...]
**** v1    0.1 CLI TX|
**** v1    0.1 CLI TX|\tbackend b { .host = "127.0.0.1"; }
**** v1    0.1 CLI TX|\tsub vcl_recv {
**** v1    0.1 CLI TX|\t\tif ( req.url ~ ! "\.(png|jpg|gif|js|css)$" ) {
**** v1    0.1 CLI TX|\t\t\treturn (pass);
**** v1    0.1 CLI TX|\t\t}
**** v1    0.1 CLI TX|\t}
**** v1    0.1 CLI TX|
**** v1    0.1 CLI TX|%XJEIFLH|)Xspa8P
***  v1    0.1 CLI RX  106
**** v1    0.1 CLI RX|Message from VCC-compiler:
**** v1    0.1 CLI RX|Security: Privilege proc_setid missing, will not change uid/gid
**** v1    0.1 CLI RX|Expected CSTR got '!'
**** v1    0.1 CLI RX|(program line 1193), at
**** v1    0.1 CLI RX|('<vcl.inline>' Line 5 Pos 32)
**** v1    0.1 CLI RX|                if ( req.url ~ ! "\.(png|jpg|gif|js|css)$" ) {
**** v1    0.1 CLI RX|-------------------------------#------------------------------
**** v1    0.1 CLI RX|
**** v1    0.1 CLI RX|Running VCC-compiler failed, exited with 2
**** v1    0.1 CLI RX|VCL compilation failed
**   v1    0.1 VCL compilation failed (as expected)
***  v1    0.1 Found expected string: ("Expected CSTR got '!'")
*    top   0.1 RESETTING after ../../../bin/varnishtest/tests/r00409.vtc
**   v1    0.1 Wait
**** v1    0.1 CLI TX|backend.list
***  v1    0.1 CLI RX  101
**** v1    0.1 CLI RX|Unknown request in manager process (child not running).
**** v1    0.1 CLI RX|Type 'help' for more info.
**   v1    0.1 Stop
**** v1    0.1 CLI TX|stop
***  v1    0.1 CLI RX  300
**** v1    0.1 CLI RX|Child in state stopped
**** v1    0.1 CLI TX|status
***  v1    0.1 CLI RX  200
**** v1    0.1 CLI RX|Child in state stopped
**** v1    0.1 STDOUT poll 0x10
**   v1    0.1 R 91193 Status: 0000 (u 0.004000 s 0.017000)
*    diag  0.0 ............................................................
#    top  TEST ../../../bin/varnishtest/tests/r00409.vtc TIMED OUT (kill -9)
#    top  TEST ../../../bin/varnishtest/tests/r00409.vtc FAILED (60.002) signal=9

1 @ SunOS 5.11 i86pc 1.04 64_sun12.4 uplex

*    top   0.0 TEST ../../../bin/varnishtest/tests/r00409.vtc starting
[...]
*    top   0.0 TEST Regression test for ticket 409
[...]
**** v1    0.1 CLI TX|
**** v1    0.1 CLI TX|\tbackend b { .host = "127.0.0.1"; }
**** v1    0.1 CLI TX|\tsub vcl_recv {
**** v1    0.1 CLI TX|\t\tif ( req.url ~ ! "\.(png|jpg|gif|js|css)$" ) {
**** v1    0.1 CLI TX|\t\t\treturn (pass);
**** v1    0.1 CLI TX|\t\t}
**** v1    0.1 CLI TX|\t}
**** v1    0.1 CLI TX|
**** v1    0.1 CLI TX|%XJEIFLH|)Xspa8P
***  v1    0.1 CLI RX  106
**** v1    0.1 CLI RX|Message from VCC-compiler:
**** v1    0.1 CLI RX|Security: Privilege proc_setid missing, will not change uid/gid
**** v1    0.1 CLI RX|Expected CSTR got '!'
**** v1    0.1 CLI RX|(program line 1193), at
**** v1    0.1 CLI RX|('<vcl.inline>' Line 5 Pos 32)
**** v1    0.1 CLI RX|                if ( req.url ~ ! "\.(png|jpg|gif|js|css)$" ) {
**** v1    0.1 CLI RX|-------------------------------#------------------------------
**** v1    0.1 CLI RX|
**** v1    0.1 CLI RX|Running VCC-compiler failed, exited with 2
**** v1    0.1 CLI RX|VCL compilation failed
**   v1    0.1 VCL compilation failed (as expected)
***  v1    0.1 Found expected string: ("Expected CSTR got '!'")
*    top   0.1 RESETTING after ../../../bin/varnishtest/tests/r00409.vtc
**   v1    0.1 Wait
**** v1    0.1 CLI TX|backend.list
***  v1    0.1 CLI RX  101
**** v1    0.1 CLI RX|Unknown request in manager process (child not running).
**** v1    0.1 CLI RX|Type 'help' for more info.
**   v1    0.1 Stop
**** v1    0.1 CLI TX|stop
***  v1    0.1 CLI RX  300
**** v1    0.1 CLI RX|Child in state stopped
**** v1    0.1 CLI TX|status
***  v1    0.1 CLI RX  200
**** v1    0.1 CLI RX|Child in state stopped
**** v1    0.1 STDOUT poll 0x10
**   v1    0.1 R 18820 Status: 0000 (u 0.007000 s 0.022000)
*    diag  0.0 ............................................................
#    top  TEST ../../../bin/varnishtest/tests/r00409.vtc TIMED OUT (kill -9)
#    top  TEST ../../../bin/varnishtest/tests/r00409.vtc FAILED (60.004) signal=9

1 @ SunOS 5.11 i86pc 1.04 64_sun12.4 uplex

*    top   0.0 TEST ../../../bin/varnishtest/tests/r00409.vtc starting
[...]
*    top   0.0 TEST Regression test for ticket 409
[...]
**** v1    0.1 CLI TX|
**** v1    0.1 CLI TX|\tbackend b { .host = "127.0.0.1"; }
**** v1    0.1 CLI TX|\tsub vcl_recv {
**** v1    0.1 CLI TX|\t\tif ( req.url ~ ! "\.(png|jpg|gif|js|css)$" ) {
**** v1    0.1 CLI TX|\t\t\treturn (pass);
**** v1    0.1 CLI TX|\t\t}
**** v1    0.1 CLI TX|\t}
**** v1    0.1 CLI TX|
**** v1    0.1 CLI TX|%XJEIFLH|)Xspa8P
***  v1    0.1 CLI RX  106
**** v1    0.1 CLI RX|Message from VCC-compiler:
**** v1    0.1 CLI RX|Security: Privilege proc_setid missing, will not change uid/gid
**** v1    0.1 CLI RX|Expected CSTR got '!'
**** v1    0.1 CLI RX|(program line 1193), at
**** v1    0.1 CLI RX|('<vcl.inline>' Line 5 Pos 32)
**** v1    0.1 CLI RX|                if ( req.url ~ ! "\.(png|jpg|gif|js|css)$" ) {
**** v1    0.1 CLI RX|-------------------------------#------------------------------
**** v1    0.1 CLI RX|
**** v1    0.1 CLI RX|Running VCC-compiler failed, exited with 2
**** v1    0.1 CLI RX|VCL compilation failed
**   v1    0.1 VCL compilation failed (as expected)
***  v1    0.1 Found expected string: ("Expected CSTR got '!'")
*    top   0.1 RESETTING after ../../../bin/varnishtest/tests/r00409.vtc
**   v1    0.1 Wait
**** v1    0.1 CLI TX|backend.list
***  v1    0.1 CLI RX  101
**** v1    0.1 CLI RX|Unknown request in manager process (child not running).
**** v1    0.1 CLI RX|Type 'help' for more info.
**   v1    0.1 Stop
**** v1    0.1 CLI TX|stop
***  v1    0.1 CLI RX  300
**** v1    0.1 CLI RX|Child in state stopped
**** v1    0.1 CLI TX|status
***  v1    0.1 CLI RX  200
**** v1    0.1 CLI RX|Child in state stopped
**** v1    0.1 STDOUT poll 0x10
**   v1    0.1 R 63608 Status: 0000 (u 0.007000 s 0.022000)
*    diag  0.0 ............................................................
#    top  TEST ../../../bin/varnishtest/tests/r00409.vtc TIMED OUT (kill -9)
#    top  TEST ../../../bin/varnishtest/tests/r00409.vtc FAILED (60.004) signal=9

1 @ SunOS 5.11 i86pc 1.04 32_gcc4.7 uplex

*    top   0.0 TEST ../../../bin/varnishtest/tests/r00409.vtc starting
[...]
*    top   0.0 TEST Regression test for ticket 409
[...]
**** v1    0.1 CLI TX|
**** v1    0.1 CLI TX|\tbackend b { .host = "127.0.0.1"; }
**** v1    0.1 CLI TX|\tsub vcl_recv {
**** v1    0.1 CLI TX|\t\tif ( req.url ~ ! "\.(png|jpg|gif|js|css)$" ) {
**** v1    0.1 CLI TX|\t\t\treturn (pass);
**** v1    0.1 CLI TX|\t\t}
**** v1    0.1 CLI TX|\t}
**** v1    0.1 CLI TX|
**** v1    0.1 CLI TX|%XJEIFLH|)Xspa8P
***  v1    0.1 CLI RX  106
**** v1    0.1 CLI RX|Message from VCC-compiler:
**** v1    0.1 CLI RX|Security: Privilege proc_setid missing, will not change uid/gid
**** v1    0.1 CLI RX|Expected CSTR got '!'
**** v1    0.1 CLI RX|(program line 1193), at
**** v1    0.1 CLI RX|('<vcl.inline>' Line 5 Pos 32)
**** v1    0.1 CLI RX|                if ( req.url ~ ! "\.(png|jpg|gif|js|css)$" ) {
**** v1    0.1 CLI RX|-------------------------------#------------------------------
**** v1    0.1 CLI RX|
**** v1    0.1 CLI RX|Running VCC-compiler failed, exited with 2
**** v1    0.1 CLI RX|VCL compilation failed
**   v1    0.1 VCL compilation failed (as expected)
***  v1    0.1 Found expected string: ("Expected CSTR got '!'")
*    top   0.1 RESETTING after ../../../bin/varnishtest/tests/r00409.vtc
**   v1    0.1 Wait
**** v1    0.1 CLI TX|backend.list
***  v1    0.1 CLI RX  101
**** v1    0.1 CLI RX|Unknown request in manager process (child not running).
**** v1    0.1 CLI RX|Type 'help' for more info.
**   v1    0.1 Stop
**** v1    0.1 CLI TX|stop
***  v1    0.1 CLI RX  300
**** v1    0.1 CLI RX|Child in state stopped
**** v1    0.1 CLI TX|status
***  v1    0.1 CLI RX  200
**** v1    0.1 CLI RX|Child in state stopped
**** v1    0.1 STDOUT poll 0x10
**   v1    0.1 R 12497 Status: 0000 (u 0.004000 s 0.018000)
*    diag  0.0 ............................................................
#    top  TEST ../../../bin/varnishtest/tests/r00409.vtc TIMED OUT (kill -9)
#    top  TEST ../../../bin/varnishtest/tests/r00409.vtc FAILED (60.002) signal=9

1 @ SunOS 5.11 i86pc 1.04 32_sun12.4 uplex

*    top   0.0 TEST ../../../bin/varnishtest/tests/r00409.vtc starting
[...]
*    top   0.0 TEST Regression test for ticket 409
[...]
**** v1    0.1 CLI TX|
**** v1    0.1 CLI TX|\tbackend b { .host = "127.0.0.1"; }
**** v1    0.1 CLI TX|\tsub vcl_recv {
**** v1    0.1 CLI TX|\t\tif ( req.url ~ ! "\.(png|jpg|gif|js|css)$" ) {
**** v1    0.1 CLI TX|\t\t\treturn (pass);
**** v1    0.1 CLI TX|\t\t}
**** v1    0.1 CLI TX|\t}
**** v1    0.1 CLI TX|
**** v1    0.1 CLI TX|%XJEIFLH|)Xspa8P
***  v1    0.1 CLI RX  106
**** v1    0.1 CLI RX|Message from VCC-compiler:
**** v1    0.1 CLI RX|Security: Privilege proc_setid missing, will not change uid/gid
**** v1    0.1 CLI RX|Expected CSTR got '!'
**** v1    0.1 CLI RX|(program line 1193), at
**** v1    0.1 CLI RX|('<vcl.inline>' Line 5 Pos 32)
**** v1    0.1 CLI RX|                if ( req.url ~ ! "\.(png|jpg|gif|js|css)$" ) {
**** v1    0.1 CLI RX|-------------------------------#------------------------------
**** v1    0.1 CLI RX|
**** v1    0.1 CLI RX|Running VCC-compiler failed, exited with 2
**** v1    0.1 CLI RX|VCL compilation failed
**   v1    0.1 VCL compilation failed (as expected)
***  v1    0.1 Found expected string: ("Expected CSTR got '!'")
*    top   0.1 RESETTING after ../../../bin/varnishtest/tests/r00409.vtc
**   v1    0.1 Wait
**** v1    0.1 CLI TX|backend.list
***  v1    0.1 CLI RX  101
**** v1    0.1 CLI RX|Unknown request in manager process (child not running).
**** v1    0.1 CLI RX|Type 'help' for more info.
**   v1    0.1 Stop
**** v1    0.1 CLI TX|stop
***  v1    0.1 CLI RX  300
**** v1    0.1 CLI RX|Child in state stopped
**** v1    0.1 CLI TX|status
***  v1    0.1 CLI RX  200
**** v1    0.1 CLI RX|Child in state stopped
**** v1    0.1 STDOUT poll 0x10
**   v1    0.1 R 33925 Status: 0000 (u 0.006000 s 0.021000)
*    diag  0.0 ............................................................
#    top  TEST ../../../bin/varnishtest/tests/r00409.vtc TIMED OUT (kill -9)
#    top  TEST ../../../bin/varnishtest/tests/r00409.vtc FAILED (60.002) signal=9

1 @ Ubuntu LTS i686 1.04 fgs

*    top   0.0 TEST ../../../bin/varnishtest/tests/r00409.vtc starting
[...]
*    top   0.0 TEST Regression test for ticket 409
[...]
**** v1    0.1 CLI TX|vcl 4.0;
**** v1    0.1 CLI TX|
**** v1    0.1 CLI TX|\tbackend b { .host = "127.0.0.1"; }
**** v1    0.1 CLI TX|\tsub vcl_recv {
**** v1    0.1 CLI TX|\t\tif ( req.url ~ ! "\.(png|jpg|gif|js|css)$" ) {
**** v1    0.1 CLI TX|\t\t\treturn (pass);
**** v1    0.1 CLI TX|\t\t}
**** v1    0.1 CLI TX|\t}
**** v1    0.1 CLI TX|
**** v1    0.1 CLI TX|%XJEIFLH|)Xspa8P
***  v1    0.1 CLI RX  106
**** v1    0.1 CLI RX|Message from VCC-compiler:
**** v1    0.1 CLI RX|Expected CSTR got '!'
**** v1    0.1 CLI RX|(program line 1193), at
**** v1    0.1 CLI RX|('<vcl.inline>' Line 5 Pos 32)
**** v1    0.1 CLI RX|                if ( req.url ~ ! "\.(png|jpg|gif|js|css)$" ) {
**** v1    0.1 CLI RX|-------------------------------#------------------------------
**** v1    0.1 CLI RX|
**** v1    0.1 CLI RX|Running VCC-compiler failed, exited with 2
**** v1    0.1 CLI RX|VCL compilation failed
**   v1    0.1 VCL compilation failed (as expected)
***  v1    0.1 Found expected string: ("Expected CSTR got '!'")
*    top   0.1 RESETTING after ../../../bin/varnishtest/tests/r00409.vtc
**   v1    0.1 Wait
**** v1    0.1 CLI TX|backend.list
***  v1    0.1 CLI RX  101
**** v1    0.1 CLI RX|Unknown request in manager process (child not running).
**** v1    0.1 CLI RX|Type 'help' for more info.
**   v1    0.1 Stop
**** v1    0.1 CLI TX|stop
***  v1    0.2 CLI RX  300
**** v1    0.2 CLI RX|Child in state stopped
**** v1    0.2 CLI TX|status
***  v1    0.2 CLI RX  200
**** v1    0.2 CLI RX|Child in state stopped
**** v1    0.2 STDOUT poll 0x10
**   v1    0.2 R 27722 Status: 0000 (u 0.004000 s 0.000000)
*    diag  0.0 ............................................................
#    top  TEST ../../../bin/varnishtest/tests/r00409.vtc TIMED OUT (kill -9)
#    top  TEST ../../../bin/varnishtest/tests/r00409.vtc FAILED (60.001) signal=9

1 @ SunOS 5.11 i86pc 1.04 64_sun12.4 uplex

*    top   0.0 TEST ../../../bin/varnishtest/tests/r00409.vtc starting
[...]
*    top   0.0 TEST Regression test for ticket 409
[...]
**** v1    0.1 CLI TX|
**** v1    0.1 CLI TX|\tbackend b { .host = "127.0.0.1"; }
**** v1    0.1 CLI TX|\tsub vcl_recv {
**** v1    0.1 CLI TX|\t\tif ( req.url ~ ! "\.(png|jpg|gif|js|css)$" ) {
**** v1    0.1 CLI TX|\t\t\treturn (pass);
**** v1    0.1 CLI TX|\t\t}
**** v1    0.1 CLI TX|\t}
**** v1    0.1 CLI TX|
**** v1    0.1 CLI TX|%XJEIFLH|)Xspa8P
***  v1    0.2 CLI RX  106
**** v1    0.2 CLI RX|Message from VCC-compiler:
**** v1    0.2 CLI RX|Security: Privilege proc_setid missing, will not change uid/gid
**** v1    0.2 CLI RX|Expected CSTR got '!'
**** v1    0.2 CLI RX|(program line 1193), at
**** v1    0.2 CLI RX|('<vcl.inline>' Line 5 Pos 32)
**** v1    0.2 CLI RX|                if ( req.url ~ ! "\.(png|jpg|gif|js|css)$" ) {
**** v1    0.2 CLI RX|-------------------------------#------------------------------
**** v1    0.2 CLI RX|
**** v1    0.2 CLI RX|Running VCC-compiler failed, exited with 2
**** v1    0.2 CLI RX|VCL compilation failed
**   v1    0.2 VCL compilation failed (as expected)
***  v1    0.2 Found expected string: ("Expected CSTR got '!'")
*    top   0.2 RESETTING after ../../../bin/varnishtest/tests/r00409.vtc
**   v1    0.2 Wait
**** v1    0.2 CLI TX|backend.list
***  v1    0.2 CLI RX  101
**** v1    0.2 CLI RX|Unknown request in manager process (child not running).
**** v1    0.2 CLI RX|Type 'help' for more info.
**   v1    0.2 Stop
**** v1    0.2 CLI TX|stop
***  v1    0.2 CLI RX  300
**** v1    0.2 CLI RX|Child in state stopped
**** v1    0.2 CLI TX|status
***  v1    0.2 CLI RX  200
**** v1    0.2 CLI RX|Child in state stopped
**** v1    0.2 STDOUT poll 0x10
**   v1    0.2 R 7743 Status: 0000 (u 0.009000 s 0.033000)
*    diag  0.0 ............................................................
#    top  TEST ../../../bin/varnishtest/tests/r00409.vtc TIMED OUT (kill -9)
#    top  TEST ../../../bin/varnishtest/tests/r00409.vtc FAILED (60.005) signal=9

1 @ SunOS 5.11 i86pc 1.04 64_gcc4.7 uplex

*    top   0.0 TEST ../../../bin/varnishtest/tests/r00409.vtc starting
[...]
*    top   0.0 TEST Regression test for ticket 409
[...]
**** v1    0.1 CLI TX|
**** v1    0.1 CLI TX|\tbackend b { .host = "127.0.0.1"; }
**** v1    0.1 CLI TX|\tsub vcl_recv {
**** v1    0.1 CLI TX|\t\tif ( req.url ~ ! "\.(png|jpg|gif|js|css)$" ) {
**** v1    0.1 CLI TX|\t\t\treturn (pass);
**** v1    0.1 CLI TX|\t\t}
**** v1    0.1 CLI TX|\t}
**** v1    0.1 CLI TX|
**** v1    0.1 CLI TX|%XJEIFLH|)Xspa8P
***  v1    0.1 CLI RX  106
**** v1    0.1 CLI RX|Message from VCC-compiler:
**** v1    0.1 CLI RX|Security: Privilege proc_setid missing, will not change uid/gid
**** v1    0.1 CLI RX|Expected CSTR got '!'
**** v1    0.1 CLI RX|(program line 1193), at
**** v1    0.1 CLI RX|('<vcl.inline>' Line 5 Pos 32)
**** v1    0.1 CLI RX|                if ( req.url ~ ! "\.(png|jpg|gif|js|css)$" ) {
**** v1    0.1 CLI RX|-------------------------------#------------------------------
**** v1    0.1 CLI RX|
**** v1    0.1 CLI RX|Running VCC-compiler failed, exited with 2
**** v1    0.1 CLI RX|VCL compilation failed
**   v1    0.1 VCL compilation failed (as expected)
***  v1    0.1 Found expected string: ("Expected CSTR got '!'")
*    top   0.1 RESETTING after ../../../bin/varnishtest/tests/r00409.vtc
**   v1    0.1 Wait
**** v1    0.1 CLI TX|backend.list
***  v1    0.1 CLI RX  101
**** v1    0.1 CLI RX|Unknown request in manager process (child not running).
**** v1    0.1 CLI RX|Type 'help' for more info.
**   v1    0.1 Stop
**** v1    0.1 CLI TX|stop
***  v1    0.1 CLI RX  300
**** v1    0.1 CLI RX|Child in state stopped
**** v1    0.1 CLI TX|status
***  v1    0.1 CLI RX  200
**** v1    0.1 CLI RX|Child in state stopped
**** v1    0.1 STDOUT poll 0x10
**   v1    0.1 R 75670 Status: 0000 (u 0.007000 s 0.023000)
*    diag  0.0 ............................................................
#    top  TEST ../../../bin/varnishtest/tests/r00409.vtc TIMED OUT (kill -9)
#    top  TEST ../../../bin/varnishtest/tests/r00409.vtc FAILED (60.004) signal=9

1 @ SunOS 5.11 i86pc 1.04 64_sun12.4 uplex

*    top   0.0 TEST ../../../bin/varnishtest/tests/r00409.vtc starting
[...]
*    top   0.0 TEST Regression test for ticket 409
[...]
**** v1    0.1 CLI TX|
**** v1    0.1 CLI TX|\tbackend b { .host = "127.0.0.1"; }
**** v1    0.1 CLI TX|\tsub vcl_recv {
**** v1    0.1 CLI TX|\t\tif ( req.url ~ ! "\.(png|jpg|gif|js|css)$" ) {
**** v1    0.1 CLI TX|\t\t\treturn (pass);
**** v1    0.1 CLI TX|\t\t}
**** v1    0.1 CLI TX|\t}
**** v1    0.1 CLI TX|
**** v1    0.1 CLI TX|%XJEIFLH|)Xspa8P
***  v1    0.1 CLI RX  106
**** v1    0.1 CLI RX|Message from VCC-compiler:
**** v1    0.1 CLI RX|Security: Privilege proc_setid missing, will not change uid/gid
**** v1    0.1 CLI RX|Expected CSTR got '!'
**** v1    0.1 CLI RX|(program line 1193), at
**** v1    0.1 CLI RX|('<vcl.inline>' Line 5 Pos 32)
**** v1    0.1 CLI RX|                if ( req.url ~ ! "\.(png|jpg|gif|js|css)$" ) {
**** v1    0.1 CLI RX|-------------------------------#------------------------------
**** v1    0.1 CLI RX|
**** v1    0.1 CLI RX|Running VCC-compiler failed, exited with 2
**** v1    0.1 CLI RX|VCL compilation failed
**   v1    0.1 VCL compilation failed (as expected)
***  v1    0.1 Found expected string: ("Expected CSTR got '!'")
*    top   0.1 RESETTING after ../../../bin/varnishtest/tests/r00409.vtc
**   v1    0.1 Wait
**** v1    0.1 CLI TX|backend.list
***  v1    0.1 CLI RX  101
**** v1    0.1 CLI RX|Unknown request in manager process (child not running).
**** v1    0.1 CLI RX|Type 'help' for more info.
**   v1    0.1 Stop
**** v1    0.1 CLI TX|stop
***  v1    0.1 CLI RX  300
**** v1    0.1 CLI RX|Child in state stopped
**** v1    0.1 CLI TX|status
***  v1    0.1 CLI RX  200
**** v1    0.1 CLI RX|Child in state stopped
**** v1    0.1 STDOUT poll 0x10
**   v1    0.1 R 20609 Status: 0000 (u 0.007000 s 0.023000)
*    diag  0.0 ............................................................
#    top  TEST ../../../bin/varnishtest/tests/r00409.vtc TIMED OUT (kill -9)
#    top  TEST ../../../bin/varnishtest/tests/r00409.vtc FAILED (60.004) signal=9

1 @ SunOS 5.11 i86pc 1.04 64_gcc4.7 uplex

*    top   0.0 TEST ../../../bin/varnishtest/tests/r00409.vtc starting
[...]
*    top   0.0 TEST Regression test for ticket 409
[...]
**** v1    0.1 CLI TX|
**** v1    0.1 CLI TX|\tbackend b { .host = "127.0.0.1"; }
**** v1    0.1 CLI TX|\tsub vcl_recv {
**** v1    0.1 CLI TX|\t\tif ( req.url ~ ! "\.(png|jpg|gif|js|css)$" ) {
**** v1    0.1 CLI TX|\t\t\treturn (pass);
**** v1    0.1 CLI TX|\t\t}
**** v1    0.1 CLI TX|\t}
**** v1    0.1 CLI TX|
**** v1    0.1 CLI TX|%XJEIFLH|)Xspa8P
***  v1    0.1 CLI RX  106
**** v1    0.1 CLI RX|Message from VCC-compiler:
**** v1    0.1 CLI RX|Security: Privilege proc_setid missing, will not change uid/gid
**** v1    0.1 CLI RX|Expected CSTR got '!'
**** v1    0.1 CLI RX|(program line 1193), at
**** v1    0.1 CLI RX|('<vcl.inline>' Line 5 Pos 32)
**** v1    0.1 CLI RX|                if ( req.url ~ ! "\.(png|jpg|gif|js|css)$" ) {
**** v1    0.1 CLI RX|-------------------------------#------------------------------
**** v1    0.1 CLI RX|
**** v1    0.1 CLI RX|Running VCC-compiler failed, exited with 2
**** v1    0.1 CLI RX|VCL compilation failed
**   v1    0.1 VCL compilation failed (as expected)
***  v1    0.1 Found expected string: ("Expected CSTR got '!'")
*    top   0.1 RESETTING after ../../../bin/varnishtest/tests/r00409.vtc
**   v1    0.1 Wait
**** v1    0.1 CLI TX|backend.list
***  v1    0.1 CLI RX  101
**** v1    0.1 CLI RX|Unknown request in manager process (child not running).
**** v1    0.1 CLI RX|Type 'help' for more info.
**   v1    0.1 Stop
**** v1    0.1 CLI TX|stop
***  v1    0.1 CLI RX  300
**** v1    0.1 CLI RX|Child in state stopped
**** v1    0.1 CLI TX|status
***  v1    0.1 CLI RX  200
**** v1    0.1 CLI RX|Child in state stopped
**** v1    0.1 STDOUT poll 0x10
**   v1    0.1 R 67516 Status: 0000 (u 0.007000 s 0.023000)
*    diag  0.0 ............................................................
#    top  TEST ../../../bin/varnishtest/tests/r00409.vtc TIMED OUT (kill -9)
#    top  TEST ../../../bin/varnishtest/tests/r00409.vtc FAILED (60.004) signal=9

1 @ SunOS 5.11 i86pc 1.04 64_gcc4.7 uplex

*    top   0.0 TEST ../../../bin/varnishtest/tests/r00409.vtc starting
[...]
*    top   0.0 TEST Regression test for ticket 409
[...]
**** v1    0.1 CLI TX|
**** v1    0.1 CLI TX|\tbackend b { .host = "127.0.0.1"; }
**** v1    0.1 CLI TX|\tsub vcl_recv {
**** v1    0.1 CLI TX|\t\tif ( req.url ~ ! "\.(png|jpg|gif|js|css)$" ) {
**** v1    0.1 CLI TX|\t\t\treturn (pass);
**** v1    0.1 CLI TX|\t\t}
**** v1    0.1 CLI TX|\t}
**** v1    0.1 CLI TX|
**** v1    0.1 CLI TX|%XJEIFLH|)Xspa8P
***  v1    0.1 CLI RX  106
**** v1    0.1 CLI RX|Message from VCC-compiler:
**** v1    0.1 CLI RX|Security: Privilege proc_setid missing, will not change uid/gid
**** v1    0.1 CLI RX|Expected CSTR got '!'
**** v1    0.1 CLI RX|(program line 1193), at
**** v1    0.1 CLI RX|('<vcl.inline>' Line 5 Pos 32)
**** v1    0.1 CLI RX|                if ( req.url ~ ! "\.(png|jpg|gif|js|css)$" ) {
**** v1    0.1 CLI RX|-------------------------------#------------------------------
**** v1    0.1 CLI RX|
**** v1    0.1 CLI RX|Running VCC-compiler failed, exited with 2
**** v1    0.1 CLI RX|VCL compilation failed
**   v1    0.1 VCL compilation failed (as expected)
***  v1    0.1 Found expected string: ("Expected CSTR got '!'")
*    top   0.1 RESETTING after ../../../bin/varnishtest/tests/r00409.vtc
**   v1    0.1 Wait
**** v1    0.1 CLI TX|backend.list
***  v1    0.1 CLI RX  101
**** v1    0.1 CLI RX|Unknown request in manager process (child not running).
**** v1    0.1 CLI RX|Type 'help' for more info.
**   v1    0.1 Stop
**** v1    0.1 CLI TX|stop
***  v1    0.1 CLI RX  300
**** v1    0.1 CLI RX|Child in state stopped
**** v1    0.1 CLI TX|status
***  v1    0.1 CLI RX  200
**** v1    0.1 CLI RX|Child in state stopped
**** v1    0.1 STDOUT poll 0x10
**   v1    0.1 R 34904 Status: 0000 (u 0.008000 s 0.027000)
*    diag  0.0 ............................................................
#    top  TEST ../../../bin/varnishtest/tests/r00409.vtc TIMED OUT (kill -9)
#    top  TEST ../../../bin/varnishtest/tests/r00409.vtc FAILED (60.003) signal=9

1 @ SunOS 5.11 i86pc 1.04 64_gcc4.7 uplex

*    top   0.0 TEST ../../../bin/varnishtest/tests/r00409.vtc starting
[...]
*    top   0.0 TEST Regression test for ticket 409
[...]
**** v1    0.1 CLI TX|
**** v1    0.1 CLI TX|\tbackend b { .host = "127.0.0.1"; }
**** v1    0.1 CLI TX|\tsub vcl_recv {
**** v1    0.1 CLI TX|\t\tif ( req.url ~ ! "\.(png|jpg|gif|js|css)$" ) {
**** v1    0.1 CLI TX|\t\t\treturn (pass);
**** v1    0.1 CLI TX|\t\t}
**** v1    0.1 CLI TX|\t}
**** v1    0.1 CLI TX|
**** v1    0.1 CLI TX|%XJEIFLH|)Xspa8P
***  v1    0.1 CLI RX  106
**** v1    0.1 CLI RX|Message from VCC-compiler:
**** v1    0.1 CLI RX|Security: Privilege proc_setid missing, will not change uid/gid
**** v1    0.1 CLI RX|Expected CSTR got '!'
**** v1    0.1 CLI RX|(program line 1193), at
**** v1    0.1 CLI RX|('<vcl.inline>' Line 5 Pos 32)
**** v1    0.1 CLI RX|                if ( req.url ~ ! "\.(png|jpg|gif|js|css)$" ) {
**** v1    0.1 CLI RX|-------------------------------#------------------------------
**** v1    0.1 CLI RX|
**** v1    0.1 CLI RX|Running VCC-compiler failed, exited with 2
**** v1    0.1 CLI RX|VCL compilation failed
**   v1    0.1 VCL compilation failed (as expected)
***  v1    0.1 Found expected string: ("Expected CSTR got '!'")
*    top   0.1 RESETTING after ../../../bin/varnishtest/tests/r00409.vtc
**   v1    0.1 Wait
**** v1    0.1 CLI TX|backend.list
***  v1    0.1 CLI RX  101
**** v1    0.1 CLI RX|Unknown request in manager process (child not running).
**** v1    0.1 CLI RX|Type 'help' for more info.
**   v1    0.1 Stop
**** v1    0.1 CLI TX|stop
***  v1    0.1 CLI RX  300
**** v1    0.1 CLI RX|Child in state stopped
**** v1    0.1 CLI TX|status
***  v1    0.1 CLI RX  200
**** v1    0.1 CLI RX|Child in state stopped
**** v1    0.1 STDOUT poll 0x10
**   v1    0.1 R 88178 Status: 0000 (u 0.007000 s 0.021000)
*    diag  0.0 ............................................................
#    top  TEST ../../../bin/varnishtest/tests/r00409.vtc TIMED OUT (kill -9)
#    top  TEST ../../../bin/varnishtest/tests/r00409.vtc FAILED (60.003) signal=9

1 @ Ubuntu LTS i686 1.04 fgs

*    top   0.0 TEST ../../../bin/varnishtest/tests/r00409.vtc starting
[...]
*    top   0.0 TEST Regression test for ticket 409
[...]
**** v1    0.1 CLI TX|vcl 4.0;
**** v1    0.1 CLI TX|
**** v1    0.1 CLI TX|\tbackend b { .host = "127.0.0.1"; }
**** v1    0.1 CLI TX|\tsub vcl_recv {
**** v1    0.1 CLI TX|\t\tif ( req.url ~ ! "\.(png|jpg|gif|js|css)$" ) {
**** v1    0.1 CLI TX|\t\t\treturn (pass);
**** v1    0.1 CLI TX|\t\t}
**** v1    0.1 CLI TX|\t}
**** v1    0.1 CLI TX|
**** v1    0.1 CLI TX|%XJEIFLH|)Xspa8P
***  v1    0.1 CLI RX  106
**** v1    0.1 CLI RX|Message from VCC-compiler:
**** v1    0.1 CLI RX|Expected CSTR got '!'
**** v1    0.1 CLI RX|(program line 1193), at
**** v1    0.1 CLI RX|('<vcl.inline>' Line 5 Pos 32)
**** v1    0.1 CLI RX|                if ( req.url ~ ! "\.(png|jpg|gif|js|css)$" ) {
**** v1    0.1 CLI RX|-------------------------------#------------------------------
**** v1    0.1 CLI RX|
**** v1    0.1 CLI RX|Running VCC-compiler failed, exited with 2
**** v1    0.1 CLI RX|VCL compilation failed
**   v1    0.1 VCL compilation failed (as expected)
***  v1    0.1 Found expected string: ("Expected CSTR got '!'")
*    top   0.1 RESETTING after ../../../bin/varnishtest/tests/r00409.vtc
**   v1    0.1 Wait
**** v1    0.1 CLI TX|backend.list
***  v1    0.1 CLI RX  101
**** v1    0.1 CLI RX|Unknown request in manager process (child not running).
**** v1    0.1 CLI RX|Type 'help' for more info.
**   v1    0.1 Stop
**** v1    0.1 CLI TX|stop
***  v1    0.2 CLI RX  300
**** v1    0.2 CLI RX|Child in state stopped
**** v1    0.2 CLI TX|status
***  v1    0.2 CLI RX  200
**** v1    0.2 CLI RX|Child in state stopped
**** v1    0.2 STDOUT poll 0x10
**   v1    0.2 R 21358 Status: 0000 (u 0.004000 s 0.000000)
*    diag  0.0 ............................................................
#    top  TEST ../../../bin/varnishtest/tests/r00409.vtc TIMED OUT (kill -9)
#    top  TEST ../../../bin/varnishtest/tests/r00409.vtc FAILED (60.002) signal=9

1 @ SunOS 5.11 i86pc 1.04 32_gcc4.7 uplex

*    top   0.0 TEST ../../../bin/varnishtest/tests/r00409.vtc starting
[...]
*    top   0.0 TEST Regression test for ticket 409
[...]
**** v1    0.1 CLI TX|
**** v1    0.1 CLI TX|\tbackend b { .host = "127.0.0.1"; }
**** v1    0.1 CLI TX|\tsub vcl_recv {
**** v1    0.1 CLI TX|\t\tif ( req.url ~ ! "\.(png|jpg|gif|js|css)$" ) {
**** v1    0.1 CLI TX|\t\t\treturn (pass);
**** v1    0.1 CLI TX|\t\t}
**** v1    0.1 CLI TX|\t}
**** v1    0.1 CLI TX|
**** v1    0.1 CLI TX|%XJEIFLH|)Xspa8P
***  v1    0.1 CLI RX  106
**** v1    0.1 CLI RX|Message from VCC-compiler:
**** v1    0.1 CLI RX|Security: Privilege proc_setid missing, will not change uid/gid
**** v1    0.1 CLI RX|Expected CSTR got '!'
**** v1    0.1 CLI RX|(program line 1193), at
**** v1    0.1 CLI RX|('<vcl.inline>' Line 5 Pos 32)
**** v1    0.1 CLI RX|                if ( req.url ~ ! "\.(png|jpg|gif|js|css)$" ) {
**** v1    0.1 CLI RX|-------------------------------#------------------------------
**** v1    0.1 CLI RX|
**** v1    0.1 CLI RX|Running VCC-compiler failed, exited with 2
**** v1    0.1 CLI RX|VCL compilation failed
**   v1    0.1 VCL compilation failed (as expected)
***  v1    0.1 Found expected string: ("Expected CSTR got '!'")
*    top   0.1 RESETTING after ../../../bin/varnishtest/tests/r00409.vtc
**   v1    0.1 Wait
**** v1    0.1 CLI TX|backend.list
***  v1    0.1 CLI RX  101
**** v1    0.1 CLI RX|Unknown request in manager process (child not running).
**** v1    0.1 CLI RX|Type 'help' for more info.
**   v1    0.1 Stop
**** v1    0.1 CLI TX|stop
***  v1    0.1 CLI RX  300
**** v1    0.1 CLI RX|Child in state stopped
**** v1    0.1 CLI TX|status
***  v1    0.1 CLI RX  200
**** v1    0.1 CLI RX|Child in state stopped
**** v1    0.1 STDOUT poll 0x10
**   v1    0.1 R 56448 Status: 0000 (u 0.004000 s 0.017000)
*    diag  0.0 ............................................................
#    top  TEST ../../../bin/varnishtest/tests/r00409.vtc TIMED OUT (kill -9)
#    top  TEST ../../../bin/varnishtest/tests/r00409.vtc FAILED (60.002) signal=9

1 @ Ubuntu LTS i686 1.04 fgs

*    top   0.0 TEST ../../../bin/varnishtest/tests/r00409.vtc starting
[...]
*    top   0.0 TEST Regression test for ticket 409
[...]
**** v1    0.1 CLI TX|vcl 4.0;
**** v1    0.1 CLI TX|
**** v1    0.1 CLI TX|\tbackend b { .host = "127.0.0.1"; }
**** v1    0.1 CLI TX|\tsub vcl_recv {
**** v1    0.1 CLI TX|\t\tif ( req.url ~ ! "\.(png|jpg|gif|js|css)$" ) {
**** v1    0.1 CLI TX|\t\t\treturn (pass);
**** v1    0.1 CLI TX|\t\t}
**** v1    0.1 CLI TX|\t}
**** v1    0.1 CLI TX|
**** v1    0.1 CLI TX|%XJEIFLH|)Xspa8P
***  v1    0.1 CLI RX  106
**** v1    0.1 CLI RX|Message from VCC-compiler:
**** v1    0.1 CLI RX|Expected CSTR got '!'
**** v1    0.1 CLI RX|(program line 1193), at
**** v1    0.1 CLI RX|('<vcl.inline>' Line 5 Pos 32)
**** v1    0.1 CLI RX|                if ( req.url ~ ! "\.(png|jpg|gif|js|css)$" ) {
**** v1    0.1 CLI RX|-------------------------------#------------------------------
**** v1    0.1 CLI RX|
**** v1    0.1 CLI RX|Running VCC-compiler failed, exited with 2
**** v1    0.1 CLI RX|VCL compilation failed
**   v1    0.1 VCL compilation failed (as expected)
***  v1    0.1 Found expected string: ("Expected CSTR got '!'")
*    top   0.1 RESETTING after ../../../bin/varnishtest/tests/r00409.vtc
**   v1    0.1 Wait
**** v1    0.1 CLI TX|backend.list
***  v1    0.1 CLI RX  101
**** v1    0.1 CLI RX|Unknown request in manager process (child not running).
**** v1    0.1 CLI RX|Type 'help' for more info.
**   v1    0.1 Stop
**** v1    0.1 CLI TX|stop
***  v1    0.2 CLI RX  300
**** v1    0.2 CLI RX|Child in state stopped
**** v1    0.2 CLI TX|status
***  v1    0.2 CLI RX  200
**** v1    0.2 CLI RX|Child in state stopped
**** v1    0.2 STDOUT poll 0x10
**   v1    0.2 R 12330 Status: 0000 (u 0.004000 s 0.000000)
*    diag  0.0 ............................................................
#    top  TEST ../../../bin/varnishtest/tests/r00409.vtc TIMED OUT (kill -9)
#    top  TEST ../../../bin/varnishtest/tests/r00409.vtc FAILED (60.001) signal=9

1 @ SunOS 5.11 i86pc 1.04 64_gcc4.7 uplex

*    top   0.0 TEST ../../../bin/varnishtest/tests/r00409.vtc starting
[...]
*    top   0.0 TEST Regression test for ticket 409
[...]
**** v1    0.1 CLI TX|
**** v1    0.1 CLI TX|\tbackend b { .host = "127.0.0.1"; }
**** v1    0.1 CLI TX|\tsub vcl_recv {
**** v1    0.1 CLI TX|\t\tif ( req.url ~ ! "\.(png|jpg|gif|js|css)$" ) {
**** v1    0.1 CLI TX|\t\t\treturn (pass);
**** v1    0.1 CLI TX|\t\t}
**** v1    0.1 CLI TX|\t}
**** v1    0.1 CLI TX|
**** v1    0.1 CLI TX|%XJEIFLH|)Xspa8P
***  v1    0.1 CLI RX  106
**** v1    0.1 CLI RX|Message from VCC-compiler:
**** v1    0.1 CLI RX|Security: Privilege proc_setid missing, will not change uid/gid
**** v1    0.1 CLI RX|Expected CSTR got '!'
**** v1    0.1 CLI RX|(program line 1193), at
**** v1    0.1 CLI RX|('<vcl.inline>' Line 5 Pos 32)
**** v1    0.1 CLI RX|                if ( req.url ~ ! "\.(png|jpg|gif|js|css)$" ) {
**** v1    0.1 CLI RX|-------------------------------#------------------------------
**** v1    0.1 CLI RX|
**** v1    0.1 CLI RX|Running VCC-compiler failed, exited with 2
**** v1    0.1 CLI RX|VCL compilation failed
**   v1    0.1 VCL compilation failed (as expected)
***  v1    0.1 Found expected string: ("Expected CSTR got '!'")
*    top   0.1 RESETTING after ../../../bin/varnishtest/tests/r00409.vtc
**   v1    0.1 Wait
**** v1    0.1 CLI TX|backend.list
***  v1    0.1 CLI RX  101
**** v1    0.1 CLI RX|Unknown request in manager process (child not running).
**** v1    0.1 CLI RX|Type 'help' for more info.
**   v1    0.1 Stop
**** v1    0.1 CLI TX|stop
***  v1    0.1 CLI RX  300
**** v1    0.1 CLI RX|Child in state stopped
**** v1    0.1 CLI TX|status
***  v1    0.1 CLI RX  200
**** v1    0.1 CLI RX|Child in state stopped
**** v1    0.1 STDOUT poll 0x10
**   v1    0.1 R 65166 Status: 0000 (u 0.007000 s 0.023000)
*    diag  0.0 ............................................................
#    top  TEST ../../../bin/varnishtest/tests/r00409.vtc TIMED OUT (kill -9)
#    top  TEST ../../../bin/varnishtest/tests/r00409.vtc FAILED (60.004) signal=9

1 @ Ubuntu LTS i686 1.04 fgs

*    top   0.0 TEST ../../../bin/varnishtest/tests/r00409.vtc starting
[...]
*    top   0.0 TEST Regression test for ticket 409
[...]
**** v1    0.1 CLI TX|vcl 4.0;
**** v1    0.1 CLI TX|
**** v1    0.1 CLI TX|\tbackend b { .host = "127.0.0.1"; }
**** v1    0.1 CLI TX|\tsub vcl_recv {
**** v1    0.1 CLI TX|\t\tif ( req.url ~ ! "\.(png|jpg|gif|js|css)$" ) {
**** v1    0.1 CLI TX|\t\t\treturn (pass);
**** v1    0.1 CLI TX|\t\t}
**** v1    0.1 CLI TX|\t}
**** v1    0.1 CLI TX|
**** v1    0.1 CLI TX|%XJEIFLH|)Xspa8P
***  v1    0.1 CLI RX  106
**** v1    0.1 CLI RX|Message from VCC-compiler:
**** v1    0.1 CLI RX|Expected CSTR got '!'
**** v1    0.1 CLI RX|(program line 1193), at
**** v1    0.1 CLI RX|('<vcl.inline>' Line 5 Pos 32)
**** v1    0.1 CLI RX|                if ( req.url ~ ! "\.(png|jpg|gif|js|css)$" ) {
**** v1    0.1 CLI RX|-------------------------------#------------------------------
**** v1    0.1 CLI RX|
**** v1    0.1 CLI RX|Running VCC-compiler failed, exited with 2
**** v1    0.1 CLI RX|VCL compilation failed
**   v1    0.1 VCL compilation failed (as expected)
***  v1    0.1 Found expected string: ("Expected CSTR got '!'")
*    top   0.1 RESETTING after ../../../bin/varnishtest/tests/r00409.vtc
**   v1    0.1 Wait
**** v1    0.1 CLI TX|backend.list
***  v1    0.1 CLI RX  101
**** v1    0.1 CLI RX|Unknown request in manager process (child not running).
**** v1    0.1 CLI RX|Type 'help' for more info.
**   v1    0.1 Stop
**** v1    0.1 CLI TX|stop
***  v1    0.2 CLI RX  300
**** v1    0.2 CLI RX|Child in state stopped
**** v1    0.2 CLI TX|status
***  v1    0.2 CLI RX  200
**** v1    0.2 CLI RX|Child in state stopped
**** v1    0.2 STDOUT poll 0x10
**   v1    0.2 R 24564 Status: 0000 (u 0.000000 s 0.004000)
*    diag  0.0 ............................................................
#    top  TEST ../../../bin/varnishtest/tests/r00409.vtc TIMED OUT (kill -9)
#    top  TEST ../../../bin/varnishtest/tests/r00409.vtc FAILED (60.001) signal=9

1 @ Linux 3.10.0 x86_64 1.02 mblissett

*    top   0.0 TEST ../../../bin/varnishtest/tests/r00409.vtc starting
[...]
*    top   0.0 TEST Regression test for ticket 409
[...]
**** v1    0.1 CLI TX|vcl 4.0;
**** v1    0.1 CLI TX|
**** v1    0.1 CLI TX|\tbackend b { .host = "127.0.0.1"; }
**** v1    0.1 CLI TX|\tsub vcl_recv {
**** v1    0.1 CLI TX|\t\tif ( req.url ~ ! "\.(png|jpg|gif|js|css)$" ) {
**** v1    0.1 CLI TX|\t\t\treturn (pass);
**** v1    0.1 CLI TX|\t\t}
**** v1    0.1 CLI TX|\t}
**** v1    0.1 CLI TX|
**** v1    0.1 CLI TX|%XJEIFLH|)Xspa8P
***  v1    0.1 CLI RX  106
**** v1    0.1 CLI RX|Message from VCC-compiler:
**** v1    0.1 CLI RX|Expected CSTR got '!'
**** v1    0.1 CLI RX|(program line 1193), at
**** v1    0.1 CLI RX|('<vcl.inline>' Line 5 Pos 32)
**** v1    0.1 CLI RX|                if ( req.url ~ ! "\.(png|jpg|gif|js|css)$" ) {
**** v1    0.1 CLI RX|-------------------------------#------------------------------
**** v1    0.1 CLI RX|
**** v1    0.1 CLI RX|Running VCC-compiler failed, exited with 2
**** v1    0.1 CLI RX|VCL compilation failed
**   v1    0.1 VCL compilation failed (as expected)
***  v1    0.1 Found expected string: ("Expected CSTR got '!'")
*    top   0.1 RESETTING after ../../../bin/varnishtest/tests/r00409.vtc
**   v1    0.1 Wait
**** v1    0.1 CLI TX|backend.list
***  v1    0.2 CLI RX  101
**** v1    0.2 CLI RX|Unknown request in manager process (child not running).
**** v1    0.2 CLI RX|Type 'help' for more info.
**   v1    0.2 Stop
**** v1    0.2 CLI TX|stop
***  v1    0.2 CLI RX  300
**** v1    0.2 CLI RX|Child in state stopped
**** v1    0.2 CLI TX|status
***  v1    0.2 CLI RX  200
**** v1    0.2 CLI RX|Child in state stopped
**** v1    0.2 STDOUT poll 0x10
**   v1    0.2 R 14222 Status: 0000 (u 0.003272 s 0.018673)
*    diag  0.0 ............................................................
#    top  TEST ../../../bin/varnishtest/tests/r00409.vtc TIMED OUT (kill -9)
#    top  TEST ../../../bin/varnishtest/tests/r00409.vtc FAILED (60.002) signal=9

1 @ SunOS 5.11 i86pc 1.04 32_gcc4.7 uplex

*    top   0.0 TEST ../../../bin/varnishtest/tests/r00409.vtc starting
[...]
*    top   0.0 TEST Regression test for ticket 409
[...]
**** v1    0.1 CLI TX|
**** v1    0.1 CLI TX|\tbackend b { .host = "127.0.0.1"; }
**** v1    0.1 CLI TX|\tsub vcl_recv {
**** v1    0.1 CLI TX|\t\tif ( req.url ~ ! "\.(png|jpg|gif|js|css)$" ) {
**** v1    0.1 CLI TX|\t\t\treturn (pass);
**** v1    0.1 CLI TX|\t\t}
**** v1    0.1 CLI TX|\t}
**** v1    0.1 CLI TX|
**** v1    0.1 CLI TX|%XJEIFLH|)Xspa8P
***  v1    0.1 CLI RX  106
**** v1    0.1 CLI RX|Message from VCC-compiler:
**** v1    0.1 CLI RX|Security: Privilege proc_setid missing, will not change uid/gid
**** v1    0.1 CLI RX|Expected CSTR got '!'
**** v1    0.1 CLI RX|(program line 1193), at
**** v1    0.1 CLI RX|('<vcl.inline>' Line 5 Pos 32)
**** v1    0.1 CLI RX|                if ( req.url ~ ! "\.(png|jpg|gif|js|css)$" ) {
**** v1    0.1 CLI RX|-------------------------------#------------------------------
**** v1    0.1 CLI RX|
**** v1    0.1 CLI RX|Running VCC-compiler failed, exited with 2
**** v1    0.1 CLI RX|VCL compilation failed
**   v1    0.1 VCL compilation failed (as expected)
***  v1    0.1 Found expected string: ("Expected CSTR got '!'")
*    top   0.1 RESETTING after ../../../bin/varnishtest/tests/r00409.vtc
**   v1    0.1 Wait
**** v1    0.1 CLI TX|backend.list
***  v1    0.1 CLI RX  101
**** v1    0.1 CLI RX|Unknown request in manager process (child not running).
**** v1    0.1 CLI RX|Type 'help' for more info.
**   v1    0.1 Stop
**** v1    0.1 CLI TX|stop
***  v1    0.1 CLI RX  300
**** v1    0.1 CLI RX|Child in state stopped
**** v1    0.1 CLI TX|status
***  v1    0.1 CLI RX  200
**** v1    0.1 CLI RX|Child in state stopped
**** v1    0.1 STDOUT poll 0x10
**   v1    0.1 R 79809 Status: 0000 (u 0.004000 s 0.016000)
*    diag  0.0 ............................................................
#    top  TEST ../../../bin/varnishtest/tests/r00409.vtc TIMED OUT (kill -9)
#    top  TEST ../../../bin/varnishtest/tests/r00409.vtc FAILED (60.001) signal=9

1 @ Ubuntu LTS i686 1.04 fgs

*    top   0.0 TEST ../../../bin/varnishtest/tests/r00409.vtc starting
[...]
*    top   0.0 TEST Regression test for ticket 409
[...]
**** v1    0.1 CLI TX|vcl 4.0;
**** v1    0.1 CLI TX|
**** v1    0.1 CLI TX|\tbackend b { .host = "127.0.0.1"; }
**** v1    0.1 CLI TX|\tsub vcl_recv {
**** v1    0.1 CLI TX|\t\tif ( req.url ~ ! "\.(png|jpg|gif|js|css)$" ) {
**** v1    0.1 CLI TX|\t\t\treturn (pass);
**** v1    0.1 CLI TX|\t\t}
**** v1    0.1 CLI TX|\t}
**** v1    0.1 CLI TX|
**** v1    0.1 CLI TX|%XJEIFLH|)Xspa8P
***  v1    0.1 CLI RX  106
**** v1    0.1 CLI RX|Message from VCC-compiler:
**** v1    0.1 CLI RX|Expected CSTR got '!'
**** v1    0.1 CLI RX|(program line 1193), at
**** v1    0.1 CLI RX|('<vcl.inline>' Line 5 Pos 32)
**** v1    0.1 CLI RX|                if ( req.url ~ ! "\.(png|jpg|gif|js|css)$" ) {
**** v1    0.1 CLI RX|-------------------------------#------------------------------
**** v1    0.1 CLI RX|
**** v1    0.1 CLI RX|Running VCC-compiler failed, exited with 2
**** v1    0.1 CLI RX|VCL compilation failed
**   v1    0.1 VCL compilation failed (as expected)
***  v1    0.1 Found expected string: ("Expected CSTR got '!'")
*    top   0.1 RESETTING after ../../../bin/varnishtest/tests/r00409.vtc
**   v1    0.1 Wait
**** v1    0.1 CLI TX|backend.list
***  v1    0.1 CLI RX  101
**** v1    0.1 CLI RX|Unknown request in manager process (child not running).
**** v1    0.1 CLI RX|Type 'help' for more info.
**   v1    0.1 Stop
**** v1    0.1 CLI TX|stop
***  v1    0.2 CLI RX  300
**** v1    0.2 CLI RX|Child in state stopped
**** v1    0.2 CLI TX|status
***  v1    0.2 CLI RX  200
**** v1    0.2 CLI RX|Child in state stopped
**** v1    0.2 STDOUT poll 0x10
**   v1    0.2 R 1245 Status: 0000 (u 0.000000 s 0.004000)
*    diag  0.0 ............................................................
#    top  TEST ../../../bin/varnishtest/tests/r00409.vtc TIMED OUT (kill -9)
#    top  TEST ../../../bin/varnishtest/tests/r00409.vtc FAILED (60.001) signal=9

1 @ Linux 3.10.0 x86_64 1.02 mblissett

*    top   0.0 TEST ../../../bin/varnishtest/tests/r00409.vtc starting
[...]
*    top   0.0 TEST Regression test for ticket 409
[...]
**** v1    0.1 CLI TX|vcl 4.0;
**** v1    0.1 CLI TX|
**** v1    0.1 CLI TX|\tbackend b { .host = "127.0.0.1"; }
**** v1    0.1 CLI TX|\tsub vcl_recv {
**** v1    0.1 CLI TX|\t\tif ( req.url ~ ! "\.(png|jpg|gif|js|css)$" ) {
**** v1    0.1 CLI TX|\t\t\treturn (pass);
**** v1    0.1 CLI TX|\t\t}
**** v1    0.1 CLI TX|\t}
**** v1    0.1 CLI TX|
**** v1    0.1 CLI TX|%XJEIFLH|)Xspa8P
***  v1    0.1 CLI RX  106
**** v1    0.1 CLI RX|Message from VCC-compiler:
**** v1    0.1 CLI RX|Expected CSTR got '!'
**** v1    0.1 CLI RX|(program line 1193), at
**** v1    0.1 CLI RX|('<vcl.inline>' Line 5 Pos 32)
**** v1    0.1 CLI RX|                if ( req.url ~ ! "\.(png|jpg|gif|js|css)$" ) {
**** v1    0.1 CLI RX|-------------------------------#------------------------------
**** v1    0.1 CLI RX|
**** v1    0.1 CLI RX|Running VCC-compiler failed, exited with 2
**** v1    0.1 CLI RX|VCL compilation failed
**   v1    0.1 VCL compilation failed (as expected)
***  v1    0.1 Found expected string: ("Expected CSTR got '!'")
*    top   0.1 RESETTING after ../../../bin/varnishtest/tests/r00409.vtc
**   v1    0.1 Wait
**** v1    0.1 CLI TX|backend.list
***  v1    0.2 CLI RX  101
**** v1    0.2 CLI RX|Unknown request in manager process (child not running).
**** v1    0.2 CLI RX|Type 'help' for more info.
**   v1    0.2 Stop
**** v1    0.2 CLI TX|stop
***  v1    0.2 CLI RX  300
**** v1    0.2 CLI RX|Child in state stopped
**** v1    0.2 CLI TX|status
***  v1    0.2 CLI RX  200
**** v1    0.2 CLI RX|Child in state stopped
**** v1    0.2 STDOUT poll 0x10
**   v1    0.2 R 7082 Status: 0000 (u 0.006105 s 0.017788)
*    diag  0.0 ............................................................
#    top  TEST ../../../bin/varnishtest/tests/r00409.vtc TIMED OUT (kill -9)
#    top  TEST ../../../bin/varnishtest/tests/r00409.vtc FAILED (60.002) signal=9

1 @ SunOS 5.11 i86pc 1.04 32_gcc4.7 uplex

*    top   0.0 TEST ../../../bin/varnishtest/tests/r00409.vtc starting
[...]
*    top   0.0 TEST Regression test for ticket 409
[...]
**** v1    0.1 CLI TX|
**** v1    0.1 CLI TX|\tbackend b { .host = "127.0.0.1"; }
**** v1    0.1 CLI TX|\tsub vcl_recv {
**** v1    0.1 CLI TX|\t\tif ( req.url ~ ! "\.(png|jpg|gif|js|css)$" ) {
**** v1    0.1 CLI TX|\t\t\treturn (pass);
**** v1    0.1 CLI TX|\t\t}
**** v1    0.1 CLI TX|\t}
**** v1    0.1 CLI TX|
**** v1    0.1 CLI TX|%XJEIFLH|)Xspa8P
***  v1    0.1 CLI RX  106
**** v1    0.1 CLI RX|Message from VCC-compiler:
**** v1    0.1 CLI RX|Security: Privilege proc_setid missing, will not change uid/gid
**** v1    0.1 CLI RX|Expected CSTR got '!'
**** v1    0.1 CLI RX|(program line 1193), at
**** v1    0.1 CLI RX|('<vcl.inline>' Line 5 Pos 32)
**** v1    0.1 CLI RX|                if ( req.url ~ ! "\.(png|jpg|gif|js|css)$" ) {
**** v1    0.1 CLI RX|-------------------------------#------------------------------
**** v1    0.1 CLI RX|
**** v1    0.1 CLI RX|Running VCC-compiler failed, exited with 2
**** v1    0.1 CLI RX|VCL compilation failed
**   v1    0.1 VCL compilation failed (as expected)
***  v1    0.1 Found expected string: ("Expected CSTR got '!'")
*    top   0.1 RESETTING after ../../../bin/varnishtest/tests/r00409.vtc
**   v1    0.1 Wait
**** v1    0.1 CLI TX|backend.list
***  v1    0.1 CLI RX  101
**** v1    0.1 CLI RX|Unknown request in manager process (child not running).
**** v1    0.1 CLI RX|Type 'help' for more info.
**   v1    0.1 Stop
**** v1    0.1 CLI TX|stop
***  v1    0.1 CLI RX  300
**** v1    0.1 CLI RX|Child in state stopped
**** v1    0.1 CLI TX|status
***  v1    0.1 CLI RX  200
**** v1    0.1 CLI RX|Child in state stopped
**** v1    0.1 STDOUT poll 0x10
**   v1    0.2 R 4606 Status: 0000 (u 0.007000 s 0.027000)
*    diag  0.0 ............................................................
#    top  TEST ../../../bin/varnishtest/tests/r00409.vtc TIMED OUT (kill -9)
#    top  TEST ../../../bin/varnishtest/tests/r00409.vtc FAILED (60.002) signal=9

1 @ SunOS 5.11 i86pc 1.04 64_gcc4.7 uplex

*    top   0.0 TEST ../../../bin/varnishtest/tests/r00409.vtc starting
[...]
*    top   0.0 TEST Regression test for ticket 409
[...]
**** v1    0.1 CLI TX|
**** v1    0.1 CLI TX|\tbackend b { .host = "127.0.0.1"; }
**** v1    0.1 CLI TX|\tsub vcl_recv {
**** v1    0.1 CLI TX|\t\tif ( req.url ~ ! "\.(png|jpg|gif|js|css)$" ) {
**** v1    0.1 CLI TX|\t\t\treturn (pass);
**** v1    0.1 CLI TX|\t\t}
**** v1    0.1 CLI TX|\t}
**** v1    0.1 CLI TX|
**** v1    0.1 CLI TX|%XJEIFLH|)Xspa8P
***  v1    0.1 CLI RX  106
**** v1    0.1 CLI RX|Message from VCC-compiler:
**** v1    0.1 CLI RX|Security: Privilege proc_setid missing, will not change uid/gid
**** v1    0.1 CLI RX|Expected CSTR got '!'
**** v1    0.1 CLI RX|(program line 1193), at
**** v1    0.1 CLI RX|('<vcl.inline>' Line 5 Pos 32)
**** v1    0.1 CLI RX|                if ( req.url ~ ! "\.(png|jpg|gif|js|css)$" ) {
**** v1    0.1 CLI RX|-------------------------------#------------------------------
**** v1    0.1 CLI RX|
**** v1    0.1 CLI RX|Running VCC-compiler failed, exited with 2
**** v1    0.1 CLI RX|VCL compilation failed
**   v1    0.1 VCL compilation failed (as expected)
***  v1    0.1 Found expected string: ("Expected CSTR got '!'")
*    top   0.1 RESETTING after ../../../bin/varnishtest/tests/r00409.vtc
**   v1    0.1 Wait
**** v1    0.1 CLI TX|backend.list
***  v1    0.1 CLI RX  101
**** v1    0.1 CLI RX|Unknown request in manager process (child not running).
**** v1    0.1 CLI RX|Type 'help' for more info.
**   v1    0.1 Stop
**** v1    0.1 CLI TX|stop
***  v1    0.1 CLI RX  300
**** v1    0.1 CLI RX|Child in state stopped
**** v1    0.1 CLI TX|status
***  v1    0.1 CLI RX  200
**** v1    0.1 CLI RX|Child in state stopped
**** v1    0.1 STDOUT poll 0x10
**   v1    0.1 R 26726 Status: 0000 (u 0.007000 s 0.020000)
*    diag  0.0 ............................................................
#    top  TEST ../../../bin/varnishtest/tests/r00409.vtc TIMED OUT (kill -9)
#    top  TEST ../../../bin/varnishtest/tests/r00409.vtc FAILED (60.004) signal=9

1 @ Linux 3.10.0 x86_64 1.02 mblissett

*    top   0.0 TEST ../../../bin/varnishtest/tests/r00409.vtc starting
[...]
*    top   0.0 TEST Regression test for ticket 409
[...]
**** v1    0.1 CLI TX|vcl 4.0;
**** v1    0.1 CLI TX|
**** v1    0.1 CLI TX|\tbackend b { .host = "127.0.0.1"; }
**** v1    0.1 CLI TX|\tsub vcl_recv {
**** v1    0.1 CLI TX|\t\tif ( req.url ~ ! "\.(png|jpg|gif|js|css)$" ) {
**** v1    0.1 CLI TX|\t\t\treturn (pass);
**** v1    0.1 CLI TX|\t\t}
**** v1    0.1 CLI TX|\t}
**** v1    0.1 CLI TX|
**** v1    0.1 CLI TX|%XJEIFLH|)Xspa8P
***  v1    0.1 CLI RX  106
**** v1    0.1 CLI RX|Message from VCC-compiler:
**** v1    0.1 CLI RX|Expected CSTR got '!'
**** v1    0.1 CLI RX|(program line 1193), at
**** v1    0.1 CLI RX|('<vcl.inline>' Line 5 Pos 32)
**** v1    0.1 CLI RX|                if ( req.url ~ ! "\.(png|jpg|gif|js|css)$" ) {
**** v1    0.1 CLI RX|-------------------------------#------------------------------
**** v1    0.1 CLI RX|
**** v1    0.1 CLI RX|Running VCC-compiler failed, exited with 2
**** v1    0.1 CLI RX|VCL compilation failed
**   v1    0.1 VCL compilation failed (as expected)
***  v1    0.1 Found expected string: ("Expected CSTR got '!'")
*    top   0.1 RESETTING after ../../../bin/varnishtest/tests/r00409.vtc
**   v1    0.1 Wait
**** v1    0.1 CLI TX|backend.list
***  v1    0.2 CLI RX  101
**** v1    0.2 CLI RX|Unknown request in manager process (child not running).
**** v1    0.2 CLI RX|Type 'help' for more info.
**   v1    0.2 Stop
**** v1    0.2 CLI TX|stop
***  v1    0.2 CLI RX  300
**** v1    0.2 CLI RX|Child in state stopped
**** v1    0.2 CLI TX|status
***  v1    0.2 CLI RX  200
**** v1    0.2 CLI RX|Child in state stopped
**** v1    0.2 STDOUT poll 0x10
**   v1    0.2 R 11104 Status: 0000 (u 0.005831 s 0.014563)
*    diag  0.0 ............................................................
#    top  TEST ../../../bin/varnishtest/tests/r00409.vtc TIMED OUT (kill -9)
#    top  TEST ../../../bin/varnishtest/tests/r00409.vtc FAILED (60.001) signal=9

1 @ Linux 3.10.0 x86_64 1.02 mblissett

*    top   0.0 TEST ../../../bin/varnishtest/tests/r00409.vtc starting
[...]
*    top   0.0 TEST Regression test for ticket 409
[...]
**** v1    0.1 CLI TX|vcl 4.0;
**** v1    0.1 CLI TX|
**** v1    0.1 CLI TX|\tbackend b { .host = "127.0.0.1"; }
**** v1    0.1 CLI TX|\tsub vcl_recv {
**** v1    0.1 CLI TX|\t\tif ( req.url ~ ! "\.(png|jpg|gif|js|css)$" ) {
**** v1    0.1 CLI TX|\t\t\treturn (pass);
**** v1    0.1 CLI TX|\t\t}
**** v1    0.1 CLI TX|\t}
**** v1    0.1 CLI TX|
**** v1    0.1 CLI TX|%XJEIFLH|)Xspa8P
***  v1    0.1 CLI RX  106
**** v1    0.1 CLI RX|Message from VCC-compiler:
**** v1    0.1 CLI RX|Expected CSTR got '!'
**** v1    0.1 CLI RX|(program line 1193), at
**** v1    0.1 CLI RX|('<vcl.inline>' Line 5 Pos 32)
**** v1    0.1 CLI RX|                if ( req.url ~ ! "\.(png|jpg|gif|js|css)$" ) {
**** v1    0.1 CLI RX|-------------------------------#------------------------------
**** v1    0.1 CLI RX|
**** v1    0.1 CLI RX|Running VCC-compiler failed, exited with 2
**** v1    0.1 CLI RX|VCL compilation failed
**   v1    0.1 VCL compilation failed (as expected)
***  v1    0.1 Found expected string: ("Expected CSTR got '!'")
*    top   0.1 RESETTING after ../../../bin/varnishtest/tests/r00409.vtc
**   v1    0.1 Wait
**** v1    0.1 CLI TX|backend.list
***  v1    0.2 CLI RX  101
**** v1    0.2 CLI RX|Unknown request in manager process (child not running).
**** v1    0.2 CLI RX|Type 'help' for more info.
**   v1    0.2 Stop
**** v1    0.2 CLI TX|stop
***  v1    0.2 CLI RX  300
**** v1    0.2 CLI RX|Child in state stopped
**** v1    0.2 CLI TX|status
***  v1    0.2 CLI RX  200
**** v1    0.2 CLI RX|Child in state stopped
**** v1    0.2 STDOUT poll 0x10
**   v1    0.2 R 7713 Status: 0000 (u 0.001124 s 0.014479)
*    diag  0.0 ............................................................
#    top  TEST ../../../bin/varnishtest/tests/r00409.vtc TIMED OUT (kill -9)
#    top  TEST ../../../bin/varnishtest/tests/r00409.vtc FAILED (60.001) signal=9

1 @ SunOS 5.11 i86pc 1.04 64_gcc4.7 uplex

*    top   0.0 TEST ../../../bin/varnishtest/tests/r00409.vtc starting
[...]
*    top   0.0 TEST Regression test for ticket 409
[...]
**** v1    0.1 CLI TX|
**** v1    0.1 CLI TX|\tbackend b { .host = "127.0.0.1"; }
**** v1    0.1 CLI TX|\tsub vcl_recv {
**** v1    0.1 CLI TX|\t\tif ( req.url ~ ! "\.(png|jpg|gif|js|css)$" ) {
**** v1    0.1 CLI TX|\t\t\treturn (pass);
**** v1    0.1 CLI TX|\t\t}
**** v1    0.1 CLI TX|\t}
**** v1    0.1 CLI TX|
**** v1    0.1 CLI TX|%XJEIFLH|)Xspa8P
***  v1    0.1 CLI RX  106
**** v1    0.1 CLI RX|Message from VCC-compiler:
**** v1    0.1 CLI RX|Security: Privilege proc_setid missing, will not change uid/gid
**** v1    0.1 CLI RX|Expected CSTR got '!'
**** v1    0.1 CLI RX|(program line 1193), at
**** v1    0.1 CLI RX|('<vcl.inline>' Line 5 Pos 32)
**** v1    0.1 CLI RX|                if ( req.url ~ ! "\.(png|jpg|gif|js|css)$" ) {
**** v1    0.1 CLI RX|-------------------------------#------------------------------
**** v1    0.1 CLI RX|
**** v1    0.1 CLI RX|Running VCC-compiler failed, exited with 2
**** v1    0.1 CLI RX|VCL compilation failed
**   v1    0.1 VCL compilation failed (as expected)
***  v1    0.1 Found expected string: ("Expected CSTR got '!'")
*    top   0.1 RESETTING after ../../../bin/varnishtest/tests/r00409.vtc
**   v1    0.1 Wait
**** v1    0.1 CLI TX|backend.list
***  v1    0.1 CLI RX  101
**** v1    0.1 CLI RX|Unknown request in manager process (child not running).
**** v1    0.1 CLI RX|Type 'help' for more info.
**   v1    0.1 Stop
**** v1    0.1 CLI TX|stop
***  v1    0.1 CLI RX  300
**** v1    0.1 CLI RX|Child in state stopped
**** v1    0.1 CLI TX|status
***  v1    0.1 CLI RX  200
**** v1    0.1 CLI RX|Child in state stopped
**** v1    0.1 STDOUT poll 0x10
**   v1    0.1 R 4658 Status: 0000 (u 0.006000 s 0.021000)
*    diag  0.0 ............................................................
#    top  TEST ../../../bin/varnishtest/tests/r00409.vtc TIMED OUT (kill -9)
#    top  TEST ../../../bin/varnishtest/tests/r00409.vtc FAILED (60.004) signal=9

1 @ SunOS 5.11 i86pc 1.04 32_gcc4.7 uplex

*    top   0.0 TEST ../../../bin/varnishtest/tests/r00409.vtc starting
[...]
*    top   0.0 TEST Regression test for ticket 409
[...]
**** v1    0.1 CLI TX|
**** v1    0.1 CLI TX|\tbackend b { .host = "127.0.0.1"; }
**** v1    0.1 CLI TX|\tsub vcl_recv {
**** v1    0.1 CLI TX|\t\tif ( req.url ~ ! "\.(png|jpg|gif|js|css)$" ) {
**** v1    0.1 CLI TX|\t\t\treturn (pass);
**** v1    0.1 CLI TX|\t\t}
**** v1    0.1 CLI TX|\t}
**** v1    0.1 CLI TX|
**** v1    0.1 CLI TX|%XJEIFLH|)Xspa8P
***  v1    0.1 CLI RX  106
**** v1    0.1 CLI RX|Message from VCC-compiler:
**** v1    0.1 CLI RX|Security: Privilege proc_setid missing, will not change uid/gid
**** v1    0.1 CLI RX|Expected CSTR got '!'
**** v1    0.1 CLI RX|(program line 1193), at
**** v1    0.1 CLI RX|('<vcl.inline>' Line 5 Pos 32)
**** v1    0.1 CLI RX|                if ( req.url ~ ! "\.(png|jpg|gif|js|css)$" ) {
**** v1    0.1 CLI RX|-------------------------------#------------------------------
**** v1    0.1 CLI RX|
**** v1    0.1 CLI RX|Running VCC-compiler failed, exited with 2
**** v1    0.1 CLI RX|VCL compilation failed
**   v1    0.1 VCL compilation failed (as expected)
***  v1    0.1 Found expected string: ("Expected CSTR got '!'")
*    top   0.1 RESETTING after ../../../bin/varnishtest/tests/r00409.vtc
**   v1    0.1 Wait
**** v1    0.1 CLI TX|backend.list
***  v1    0.1 CLI RX  101
**** v1    0.1 CLI RX|Unknown request in manager process (child not running).
**** v1    0.1 CLI RX|Type 'help' for more info.
**   v1    0.1 Stop
**** v1    0.1 CLI TX|stop
***  v1    0.1 CLI RX  300
**** v1    0.1 CLI RX|Child in state stopped
**** v1    0.1 CLI TX|status
***  v1    0.1 CLI RX  200
**** v1    0.1 CLI RX|Child in state stopped
**** v1    0.1 STDOUT poll 0x10
**   v1    0.1 R 50469 Status: 0000 (u 0.004000 s 0.017000)
*    diag  0.0 ............................................................
#    top  TEST ../../../bin/varnishtest/tests/r00409.vtc TIMED OUT (kill -9)
#    top  TEST ../../../bin/varnishtest/tests/r00409.vtc FAILED (60.002) signal=9

1 @ SunOS 5.11 i86pc 1.04 64_sun12.4 uplex

*    top   0.0 TEST ../../../bin/varnishtest/tests/r00409.vtc starting
[...]
*    top   0.0 TEST Regression test for ticket 409
[...]
**** v1    0.1 CLI TX|
**** v1    0.1 CLI TX|\tbackend b { .host = "127.0.0.1"; }
**** v1    0.1 CLI TX|\tsub vcl_recv {
**** v1    0.1 CLI TX|\t\tif ( req.url ~ ! "\.(png|jpg|gif|js|css)$" ) {
**** v1    0.1 CLI TX|\t\t\treturn (pass);
**** v1    0.1 CLI TX|\t\t}
**** v1    0.1 CLI TX|\t}
**** v1    0.1 CLI TX|
**** v1    0.1 CLI TX|%XJEIFLH|)Xspa8P
***  v1    0.1 CLI RX  106
**** v1    0.1 CLI RX|Message from VCC-compiler:
**** v1    0.1 CLI RX|Security: Privilege proc_setid missing, will not change uid/gid
**** v1    0.1 CLI RX|Expected CSTR got '!'
**** v1    0.1 CLI RX|(program line 1193), at
**** v1    0.1 CLI RX|('<vcl.inline>' Line 5 Pos 32)
**** v1    0.1 CLI RX|                if ( req.url ~ ! "\.(png|jpg|gif|js|css)$" ) {
**** v1    0.1 CLI RX|-------------------------------#------------------------------
**** v1    0.1 CLI RX|
**** v1    0.1 CLI RX|Running VCC-compiler failed, exited with 2
**** v1    0.1 CLI RX|VCL compilation failed
**   v1    0.1 VCL compilation failed (as expected)
***  v1    0.1 Found expected string: ("Expected CSTR got '!'")
*    top   0.1 RESETTING after ../../../bin/varnishtest/tests/r00409.vtc
**   v1    0.1 Wait
**** v1    0.1 CLI TX|backend.list
***  v1    0.1 CLI RX  101
**** v1    0.1 CLI RX|Unknown request in manager process (child not running).
**** v1    0.1 CLI RX|Type 'help' for more info.
**   v1    0.1 Stop
**** v1    0.1 CLI TX|stop
***  v1    0.1 CLI RX  300
**** v1    0.1 CLI RX|Child in state stopped
**** v1    0.1 CLI TX|status
***  v1    0.1 CLI RX  200
**** v1    0.1 CLI RX|Child in state stopped
**** v1    0.1 STDOUT poll 0x10
**   v1    0.1 R 21937 Status: 0000 (u 0.007000 s 0.022000)
*    diag  0.0 ............................................................
#    top  TEST ../../../bin/varnishtest/tests/r00409.vtc TIMED OUT (kill -9)
#    top  TEST ../../../bin/varnishtest/tests/r00409.vtc FAILED (60.004) signal=9

1 @ SunOS 5.11 i86pc 1.04 64_gcc4.7 uplex

*    top   0.0 TEST ../../../bin/varnishtest/tests/r00409.vtc starting
[...]
*    top   0.0 TEST Regression test for ticket 409
[...]
**** v1    0.1 CLI TX|
**** v1    0.1 CLI TX|\tbackend b { .host = "127.0.0.1"; }
**** v1    0.1 CLI TX|\tsub vcl_recv {
**** v1    0.1 CLI TX|\t\tif ( req.url ~ ! "\.(png|jpg|gif|js|css)$" ) {
**** v1    0.1 CLI TX|\t\t\treturn (pass);
**** v1    0.1 CLI TX|\t\t}
**** v1    0.1 CLI TX|\t}
**** v1    0.1 CLI TX|
**** v1    0.1 CLI TX|%XJEIFLH|)Xspa8P
***  v1    0.1 CLI RX  106
**** v1    0.1 CLI RX|Message from VCC-compiler:
**** v1    0.1 CLI RX|Security: Privilege proc_setid missing, will not change uid/gid
**** v1    0.1 CLI RX|Expected CSTR got '!'
**** v1    0.1 CLI RX|(program line 1193), at
**** v1    0.1 CLI RX|('<vcl.inline>' Line 5 Pos 32)
**** v1    0.1 CLI RX|                if ( req.url ~ ! "\.(png|jpg|gif|js|css)$" ) {
**** v1    0.1 CLI RX|-------------------------------#------------------------------
**** v1    0.1 CLI RX|
**** v1    0.1 CLI RX|Running VCC-compiler failed, exited with 2
**** v1    0.1 CLI RX|VCL compilation failed
**   v1    0.1 VCL compilation failed (as expected)
***  v1    0.1 Found expected string: ("Expected CSTR got '!'")
*    top   0.1 RESETTING after ../../../bin/varnishtest/tests/r00409.vtc
**   v1    0.1 Wait
**** v1    0.1 CLI TX|backend.list
***  v1    0.1 CLI RX  101
**** v1    0.1 CLI RX|Unknown request in manager process (child not running).
**** v1    0.1 CLI RX|Type 'help' for more info.
**   v1    0.1 Stop
**** v1    0.1 CLI TX|stop
***  v1    0.1 CLI RX  300
**** v1    0.1 CLI RX|Child in state stopped
**** v1    0.1 CLI TX|status
***  v1    0.1 CLI RX  200
**** v1    0.1 CLI RX|Child in state stopped
**** v1    0.1 STDOUT poll 0x10
**   v1    0.1 R 14832 Status: 0000 (u 0.007000 s 0.024000)
*    diag  0.0 ............................................................
#    top  TEST ../../../bin/varnishtest/tests/r00409.vtc TIMED OUT (kill -9)
#    top  TEST ../../../bin/varnishtest/tests/r00409.vtc FAILED (60.004) signal=9

1 @ SunOS 5.11 i86pc 1.04 32_gcc4.7 uplex

*    top   0.0 TEST ../../../bin/varnishtest/tests/r00409.vtc starting
[...]
*    top   0.0 TEST Regression test for ticket 409
[...]
**** v1    0.1 CLI TX|
**** v1    0.1 CLI TX|\tbackend b { .host = "127.0.0.1"; }
**** v1    0.1 CLI TX|\tsub vcl_recv {
**** v1    0.1 CLI TX|\t\tif ( req.url ~ ! "\.(png|jpg|gif|js|css)$" ) {
**** v1    0.1 CLI TX|\t\t\treturn (pass);
**** v1    0.1 CLI TX|\t\t}
**** v1    0.1 CLI TX|\t}
**** v1    0.1 CLI TX|
**** v1    0.1 CLI TX|%XJEIFLH|)Xspa8P
***  v1    0.1 CLI RX  106
**** v1    0.1 CLI RX|Message from VCC-compiler:
**** v1    0.1 CLI RX|Security: Privilege proc_setid missing, will not change uid/gid
**** v1    0.1 CLI RX|Expected CSTR got '!'
**** v1    0.1 CLI RX|(program line 1193), at
**** v1    0.1 CLI RX|('<vcl.inline>' Line 5 Pos 32)
**** v1    0.1 CLI RX|                if ( req.url ~ ! "\.(png|jpg|gif|js|css)$" ) {
**** v1    0.1 CLI RX|-------------------------------#------------------------------
**** v1    0.1 CLI RX|
**** v1    0.1 CLI RX|Running VCC-compiler failed, exited with 2
**** v1    0.1 CLI RX|VCL compilation failed
**   v1    0.1 VCL compilation failed (as expected)
***  v1    0.1 Found expected string: ("Expected CSTR got '!'")
*    top   0.1 RESETTING after ../../../bin/varnishtest/tests/r00409.vtc
**   v1    0.1 Wait
**** v1    0.1 CLI TX|backend.list
***  v1    0.1 CLI RX  101
**** v1    0.1 CLI RX|Unknown request in manager process (child not running).
**** v1    0.1 CLI RX|Type 'help' for more info.
**   v1    0.1 Stop
**** v1    0.1 CLI TX|stop
***  v1    0.1 CLI RX  300
**** v1    0.1 CLI RX|Child in state stopped
**** v1    0.1 CLI TX|status
***  v1    0.1 CLI RX  200
**** v1    0.1 CLI RX|Child in state stopped
**** v1    0.1 STDOUT poll 0x10
**   v1    0.1 R 6306 Status: 0000 (u 0.004000 s 0.016000)
*    diag  0.0 ............................................................
#    top  TEST ../../../bin/varnishtest/tests/r00409.vtc TIMED OUT (kill -9)
#    top  TEST ../../../bin/varnishtest/tests/r00409.vtc FAILED (60.003) signal=9

1 @ Ubuntu LTS i686 1.04 fgs

*    top   0.0 TEST ../../../bin/varnishtest/tests/r00409.vtc starting
[...]
*    top   0.0 TEST Regression test for ticket 409
[...]
**** v1    0.1 CLI TX|vcl 4.0;
**** v1    0.1 CLI TX|
**** v1    0.1 CLI TX|\tbackend b { .host = "127.0.0.1"; }
**** v1    0.1 CLI TX|\tsub vcl_recv {
**** v1    0.1 CLI TX|\t\tif ( req.url ~ ! "\.(png|jpg|gif|js|css)$" ) {
**** v1    0.1 CLI TX|\t\t\treturn (pass);
**** v1    0.1 CLI TX|\t\t}
**** v1    0.1 CLI TX|\t}
**** v1    0.1 CLI TX|
**** v1    0.1 CLI TX|%XJEIFLH|)Xspa8P
***  v1    0.1 CLI RX  106
**** v1    0.1 CLI RX|Message from VCC-compiler:
**** v1    0.1 CLI RX|Expected CSTR got '!'
**** v1    0.1 CLI RX|(program line 1193), at
**** v1    0.1 CLI RX|('<vcl.inline>' Line 5 Pos 32)
**** v1    0.1 CLI RX|                if ( req.url ~ ! "\.(png|jpg|gif|js|css)$" ) {
**** v1    0.1 CLI RX|-------------------------------#------------------------------
**** v1    0.1 CLI RX|
**** v1    0.1 CLI RX|Running VCC-compiler failed, exited with 2
**** v1    0.1 CLI RX|VCL compilation failed
**   v1    0.1 VCL compilation failed (as expected)
***  v1    0.1 Found expected string: ("Expected CSTR got '!'")
*    top   0.1 RESETTING after ../../../bin/varnishtest/tests/r00409.vtc
**   v1    0.1 Wait
**** v1    0.1 CLI TX|backend.list
***  v1    0.1 CLI RX  101
**** v1    0.1 CLI RX|Unknown request in manager process (child not running).
**** v1    0.1 CLI RX|Type 'help' for more info.
**   v1    0.1 Stop
**** v1    0.1 CLI TX|stop
***  v1    0.2 CLI RX  300
**** v1    0.2 CLI RX|Child in state stopped
**** v1    0.2 CLI TX|status
***  v1    0.2 CLI RX  200
**** v1    0.2 CLI RX|Child in state stopped
**** v1    0.2 STDOUT poll 0x10
**   v1    0.2 R 18228 Status: 0000 (u 0.004000 s 0.000000)
*    diag  0.0 ............................................................
#    top  TEST ../../../bin/varnishtest/tests/r00409.vtc TIMED OUT (kill -9)
#    top  TEST ../../../bin/varnishtest/tests/r00409.vtc FAILED (60.000) signal=9

1 @ Linux 3.10.0 x86_64 1.02 mblissett

*    top   0.0 TEST ../../../bin/varnishtest/tests/r00409.vtc starting
[...]
*    top   0.0 TEST Regression test for ticket 409
[...]
**** v1    0.1 CLI TX|vcl 4.0;
**** v1    0.1 CLI TX|
**** v1    0.1 CLI TX|\tbackend b { .host = "127.0.0.1"; }
**** v1    0.1 CLI TX|\tsub vcl_recv {
**** v1    0.1 CLI TX|\t\tif ( req.url ~ ! "\.(png|jpg|gif|js|css)$" ) {
**** v1    0.1 CLI TX|\t\t\treturn (pass);
**** v1    0.1 CLI TX|\t\t}
**** v1    0.1 CLI TX|\t}
**** v1    0.1 CLI TX|
**** v1    0.1 CLI TX|%XJEIFLH|)Xspa8P
***  v1    0.1 CLI RX  106
**** v1    0.1 CLI RX|Message from VCC-compiler:
**** v1    0.1 CLI RX|Expected CSTR got '!'
**** v1    0.1 CLI RX|(program line 1193), at
**** v1    0.1 CLI RX|('<vcl.inline>' Line 5 Pos 32)
**** v1    0.1 CLI RX|                if ( req.url ~ ! "\.(png|jpg|gif|js|css)$" ) {
**** v1    0.1 CLI RX|-------------------------------#------------------------------
**** v1    0.1 CLI RX|
**** v1    0.1 CLI RX|Running VCC-compiler failed, exited with 2
**** v1    0.1 CLI RX|VCL compilation failed
**   v1    0.1 VCL compilation failed (as expected)
***  v1    0.1 Found expected string: ("Expected CSTR got '!'")
*    top   0.1 RESETTING after ../../../bin/varnishtest/tests/r00409.vtc
**   v1    0.1 Wait
**** v1    0.1 CLI TX|backend.list
***  v1    0.2 CLI RX  101
**** v1    0.2 CLI RX|Unknown request in manager process (child not running).
**** v1    0.2 CLI RX|Type 'help' for more info.
**   v1    0.2 Stop
**** v1    0.2 CLI TX|stop
***  v1    0.2 CLI RX  300
**** v1    0.2 CLI RX|Child in state stopped
**** v1    0.2 CLI TX|status
***  v1    0.2 CLI RX  200
**** v1    0.2 CLI RX|Child in state stopped
**** v1    0.2 STDOUT poll 0x10
**   v1    0.2 R 3970 Status: 0000 (u 0.003041 s 0.015868)
*    diag  0.0 ............................................................
#    top  TEST ../../../bin/varnishtest/tests/r00409.vtc TIMED OUT (kill -9)
#    top  TEST ../../../bin/varnishtest/tests/r00409.vtc FAILED (60.001) signal=9

1 @ SunOS 5.11 i86pc 1.04 64_sun12.4 uplex

*    top   0.0 TEST ../../../bin/varnishtest/tests/r00409.vtc starting
[...]
*    top   0.0 TEST Regression test for ticket 409
[...]
**** v1    0.1 CLI TX|
**** v1    0.1 CLI TX|\tbackend b { .host = "127.0.0.1"; }
**** v1    0.1 CLI TX|\tsub vcl_recv {
**** v1    0.1 CLI TX|\t\tif ( req.url ~ ! "\.(png|jpg|gif|js|css)$" ) {
**** v1    0.1 CLI TX|\t\t\treturn (pass);
**** v1    0.1 CLI TX|\t\t}
**** v1    0.1 CLI TX|\t}
**** v1    0.1 CLI TX|
**** v1    0.1 CLI TX|%XJEIFLH|)Xspa8P
***  v1    0.1 CLI RX  106
**** v1    0.1 CLI RX|Message from VCC-compiler:
**** v1    0.1 CLI RX|Security: Privilege proc_setid missing, will not change uid/gid
**** v1    0.1 CLI RX|Expected CSTR got '!'
**** v1    0.1 CLI RX|(program line 1193), at
**** v1    0.1 CLI RX|('<vcl.inline>' Line 5 Pos 32)
**** v1    0.1 CLI RX|                if ( req.url ~ ! "\.(png|jpg|gif|js|css)$" ) {
**** v1    0.1 CLI RX|-------------------------------#------------------------------
**** v1    0.1 CLI RX|
**** v1    0.1 CLI RX|Running VCC-compiler failed, exited with 2
**** v1    0.1 CLI RX|VCL compilation failed
**   v1    0.1 VCL compilation failed (as expected)
***  v1    0.1 Found expected string: ("Expected CSTR got '!'")
*    top   0.1 RESETTING after ../../../bin/varnishtest/tests/r00409.vtc
**   v1    0.1 Wait
**** v1    0.1 CLI TX|backend.list
***  v1    0.1 CLI RX  101
**** v1    0.1 CLI RX|Unknown request in manager process (child not running).
**** v1    0.1 CLI RX|Type 'help' for more info.
**   v1    0.1 Stop
**** v1    0.1 CLI TX|stop
***  v1    0.1 CLI RX  300
**** v1    0.1 CLI RX|Child in state stopped
**** v1    0.1 CLI TX|status
***  v1    0.1 CLI RX  200
**** v1    0.1 CLI RX|Child in state stopped
**** v1    0.1 STDOUT poll 0x10
**   v1    0.1 R 6865 Status: 0000 (u 0.008000 s 0.029000)
*    diag  0.0 ............................................................
#    top  TEST ../../../bin/varnishtest/tests/r00409.vtc TIMED OUT (kill -9)
#    top  TEST ../../../bin/varnishtest/tests/r00409.vtc FAILED (60.008) signal=9

1 @ Linux 3.10.0 x86_64 1.02 mblissett

*    top   0.0 TEST ../../../bin/varnishtest/tests/r00409.vtc starting
[...]
*    top   0.0 TEST Regression test for ticket 409
[...]
**** v1    0.1 CLI TX|vcl 4.0;
**** v1    0.1 CLI TX|
**** v1    0.1 CLI TX|\tbackend b { .host = "127.0.0.1"; }
**** v1    0.1 CLI TX|\tsub vcl_recv {
**** v1    0.1 CLI TX|\t\tif ( req.url ~ ! "\.(png|jpg|gif|js|css)$" ) {
**** v1    0.1 CLI TX|\t\t\treturn (pass);
**** v1    0.1 CLI TX|\t\t}
**** v1    0.1 CLI TX|\t}
**** v1    0.1 CLI TX|
**** v1    0.1 CLI TX|%XJEIFLH|)Xspa8P
***  v1    0.1 CLI RX  106
**** v1    0.1 CLI RX|Message from VCC-compiler:
**** v1    0.1 CLI RX|Expected CSTR got '!'
**** v1    0.1 CLI RX|(program line 1193), at
**** v1    0.1 CLI RX|('<vcl.inline>' Line 5 Pos 32)
**** v1    0.1 CLI RX|                if ( req.url ~ ! "\.(png|jpg|gif|js|css)$" ) {
**** v1    0.1 CLI RX|-------------------------------#------------------------------
**** v1    0.1 CLI RX|
**** v1    0.1 CLI RX|Running VCC-compiler failed, exited with 2
**** v1    0.1 CLI RX|VCL compilation failed
**   v1    0.1 VCL compilation failed (as expected)
***  v1    0.1 Found expected string: ("Expected CSTR got '!'")
*    top   0.1 RESETTING after ../../../bin/varnishtest/tests/r00409.vtc
**   v1    0.1 Wait
**** v1    0.1 CLI TX|backend.list
***  v1    0.2 CLI RX  101
**** v1    0.2 CLI RX|Unknown request in manager process (child not running).
**** v1    0.2 CLI RX|Type 'help' for more info.
**   v1    0.2 Stop
**** v1    0.2 CLI TX|stop
***  v1    0.2 CLI RX  300
**** v1    0.2 CLI RX|Child in state stopped
**** v1    0.2 CLI TX|status
***  v1    0.2 CLI RX  200
**** v1    0.2 CLI RX|Child in state stopped
**** v1    0.2 STDOUT poll 0x10
**   v1    0.2 R 23755 Status: 0000 (u 0.005425 s 0.015587)
*    diag  0.0 ............................................................
#    top  TEST ../../../bin/varnishtest/tests/r00409.vtc TIMED OUT (kill -9)
#    top  TEST ../../../bin/varnishtest/tests/r00409.vtc FAILED (60.002) signal=9

1 @ SunOS 5.11 i86pc 1.04 64_gcc4.7 uplex

*    top   0.0 TEST ../../../bin/varnishtest/tests/r00409.vtc starting
[...]
*    top   0.0 TEST Regression test for ticket 409
[...]
**** v1    0.1 CLI TX|
**** v1    0.1 CLI TX|\tbackend b { .host = "127.0.0.1"; }
**** v1    0.1 CLI TX|\tsub vcl_recv {
**** v1    0.1 CLI TX|\t\tif ( req.url ~ ! "\.(png|jpg|gif|js|css)$" ) {
**** v1    0.1 CLI TX|\t\t\treturn (pass);
**** v1    0.1 CLI TX|\t\t}
**** v1    0.1 CLI TX|\t}
**** v1    0.1 CLI TX|
**** v1    0.1 CLI TX|%XJEIFLH|)Xspa8P
***  v1    0.1 CLI RX  106
**** v1    0.1 CLI RX|Message from VCC-compiler:
**** v1    0.1 CLI RX|Security: Privilege proc_setid missing, will not change uid/gid
**** v1    0.1 CLI RX|Expected CSTR got '!'
**** v1    0.1 CLI RX|(program line 1193), at
**** v1    0.1 CLI RX|('<vcl.inline>' Line 5 Pos 32)
**** v1    0.1 CLI RX|                if ( req.url ~ ! "\.(png|jpg|gif|js|css)$" ) {
**** v1    0.1 CLI RX|-------------------------------#------------------------------
**** v1    0.1 CLI RX|
**** v1    0.1 CLI RX|Running VCC-compiler failed, exited with 2
**** v1    0.1 CLI RX|VCL compilation failed
**   v1    0.1 VCL compilation failed (as expected)
***  v1    0.1 Found expected string: ("Expected CSTR got '!'")
*    top   0.1 RESETTING after ../../../bin/varnishtest/tests/r00409.vtc
**   v1    0.1 Wait
**** v1    0.1 CLI TX|backend.list
***  v1    0.1 CLI RX  101
**** v1    0.1 CLI RX|Unknown request in manager process (child not running).
**** v1    0.1 CLI RX|Type 'help' for more info.
**   v1    0.1 Stop
**** v1    0.1 CLI TX|stop
***  v1    0.1 CLI RX  300
**** v1    0.1 CLI RX|Child in state stopped
**** v1    0.1 CLI TX|status
***  v1    0.1 CLI RX  200
**** v1    0.1 CLI RX|Child in state stopped
**** v1    0.1 STDOUT poll 0x10
**   v1    0.1 R 88505 Status: 0000 (u 0.007000 s 0.023000)
*    diag  0.0 ............................................................
#    top  TEST ../../../bin/varnishtest/tests/r00409.vtc TIMED OUT (kill -9)
#    top  TEST ../../../bin/varnishtest/tests/r00409.vtc FAILED (60.004) signal=9

1 @ SunOS 5.11 i86pc 1.04 32_gcc4.7 uplex

*    top   0.0 TEST ../../../bin/varnishtest/tests/r00409.vtc starting
[...]
*    top   0.0 TEST Regression test for ticket 409
[...]
**** v1    0.1 CLI TX|
**** v1    0.1 CLI TX|\tbackend b { .host = "127.0.0.1"; }
**** v1    0.1 CLI TX|\tsub vcl_recv {
**** v1    0.1 CLI TX|\t\tif ( req.url ~ ! "\.(png|jpg|gif|js|css)$" ) {
**** v1    0.1 CLI TX|\t\t\treturn (pass);
**** v1    0.1 CLI TX|\t\t}
**** v1    0.1 CLI TX|\t}
**** v1    0.1 CLI TX|
**** v1    0.1 CLI TX|%XJEIFLH|)Xspa8P
***  v1    0.1 CLI RX  106
**** v1    0.1 CLI RX|Message from VCC-compiler:
**** v1    0.1 CLI RX|Security: Privilege proc_setid missing, will not change uid/gid
**** v1    0.1 CLI RX|Expected CSTR got '!'
**** v1    0.1 CLI RX|(program line 1193), at
**** v1    0.1 CLI RX|('<vcl.inline>' Line 5 Pos 32)
**** v1    0.1 CLI RX|                if ( req.url ~ ! "\.(png|jpg|gif|js|css)$" ) {
**** v1    0.1 CLI RX|-------------------------------#------------------------------
**** v1    0.1 CLI RX|
**** v1    0.1 CLI RX|Running VCC-compiler failed, exited with 2
**** v1    0.1 CLI RX|VCL compilation failed
**   v1    0.1 VCL compilation failed (as expected)
***  v1    0.1 Found expected string: ("Expected CSTR got '!'")
*    top   0.1 RESETTING after ../../../bin/varnishtest/tests/r00409.vtc
**   v1    0.1 Wait
**** v1    0.1 CLI TX|backend.list
***  v1    0.1 CLI RX  101
**** v1    0.1 CLI RX|Unknown request in manager process (child not running).
**** v1    0.1 CLI RX|Type 'help' for more info.
**   v1    0.1 Stop
**** v1    0.1 CLI TX|stop
***  v1    0.1 CLI RX  300
**** v1    0.1 CLI RX|Child in state stopped
**** v1    0.1 CLI TX|status
***  v1    0.1 CLI RX  200
**** v1    0.1 CLI RX|Child in state stopped
**** v1    0.1 STDOUT poll 0x10
**   v1    0.1 R 26528 Status: 0000 (u 0.004000 s 0.017000)
*    diag  0.0 ............................................................
#    top  TEST ../../../bin/varnishtest/tests/r00409.vtc TIMED OUT (kill -9)
#    top  TEST ../../../bin/varnishtest/tests/r00409.vtc FAILED (60.002) signal=9

1 @ SunOS 5.11 i86pc 1.04 64_gcc4.7 uplex

*    top   0.0 TEST ../../../bin/varnishtest/tests/r00409.vtc starting
[...]
*    top   0.0 TEST Regression test for ticket 409
[...]
**** v1    0.1 CLI TX|
**** v1    0.1 CLI TX|\tbackend b { .host = "127.0.0.1"; }
**** v1    0.1 CLI TX|\tsub vcl_recv {
**** v1    0.1 CLI TX|\t\tif ( req.url ~ ! "\.(png|jpg|gif|js|css)$" ) {
**** v1    0.1 CLI TX|\t\t\treturn (pass);
**** v1    0.1 CLI TX|\t\t}
**** v1    0.1 CLI TX|\t}
**** v1    0.1 CLI TX|
**** v1    0.1 CLI TX|%XJEIFLH|)Xspa8P
***  v1    0.2 CLI RX  106
**** v1    0.2 CLI RX|Message from VCC-compiler:
**** v1    0.2 CLI RX|Security: Privilege proc_setid missing, will not change uid/gid
**** v1    0.2 CLI RX|Expected CSTR got '!'
**** v1    0.2 CLI RX|(program line 1193), at
**** v1    0.2 CLI RX|('<vcl.inline>' Line 5 Pos 32)
**** v1    0.2 CLI RX|                if ( req.url ~ ! "\.(png|jpg|gif|js|css)$" ) {
**** v1    0.2 CLI RX|-------------------------------#------------------------------
**** v1    0.2 CLI RX|
**** v1    0.2 CLI RX|Running VCC-compiler failed, exited with 2
**** v1    0.2 CLI RX|VCL compilation failed
**   v1    0.2 VCL compilation failed (as expected)
***  v1    0.2 Found expected string: ("Expected CSTR got '!'")
*    top   0.2 RESETTING after ../../../bin/varnishtest/tests/r00409.vtc
**   v1    0.2 Wait
**** v1    0.2 CLI TX|backend.list
***  v1    0.2 CLI RX  101
**** v1    0.2 CLI RX|Unknown request in manager process (child not running).
**** v1    0.2 CLI RX|Type 'help' for more info.
**   v1    0.2 Stop
**** v1    0.2 CLI TX|stop
***  v1    0.2 CLI RX  300
**** v1    0.2 CLI RX|Child in state stopped
**** v1    0.2 CLI TX|status
***  v1    0.2 CLI RX  200
**** v1    0.2 CLI RX|Child in state stopped
**** v1    0.2 STDOUT poll 0x10
**   v1    0.2 R 57296 Status: 0000 (u 0.010000 s 0.032000)
*    diag  0.0 ............................................................
#    top  TEST ../../../bin/varnishtest/tests/r00409.vtc TIMED OUT (kill -9)
#    top  TEST ../../../bin/varnishtest/tests/r00409.vtc FAILED (60.006) signal=9

1 @ Ubuntu LTS i686 1.04 fgs

*    top   0.0 TEST ../../../bin/varnishtest/tests/r00409.vtc starting
[...]
*    top   0.0 TEST Regression test for ticket 409
[...]
**** v1    0.1 CLI TX|vcl 4.0;
**** v1    0.1 CLI TX|
**** v1    0.1 CLI TX|\tbackend b { .host = "127.0.0.1"; }
**** v1    0.1 CLI TX|\tsub vcl_recv {
**** v1    0.1 CLI TX|\t\tif ( req.url ~ ! "\.(png|jpg|gif|js|css)$" ) {
**** v1    0.1 CLI TX|\t\t\treturn (pass);
**** v1    0.1 CLI TX|\t\t}
**** v1    0.1 CLI TX|\t}
**** v1    0.1 CLI TX|
**** v1    0.1 CLI TX|%XJEIFLH|)Xspa8P
***  v1    0.1 CLI RX  106
**** v1    0.1 CLI RX|Message from VCC-compiler:
**** v1    0.1 CLI RX|Expected CSTR got '!'
**** v1    0.1 CLI RX|(program line 1193), at
**** v1    0.1 CLI RX|('<vcl.inline>' Line 5 Pos 32)
**** v1    0.1 CLI RX|                if ( req.url ~ ! "\.(png|jpg|gif|js|css)$" ) {
**** v1    0.1 CLI RX|-------------------------------#------------------------------
**** v1    0.1 CLI RX|
**** v1    0.1 CLI RX|Running VCC-compiler failed, exited with 2
**** v1    0.1 CLI RX|VCL compilation failed
**   v1    0.1 VCL compilation failed (as expected)
***  v1    0.1 Found expected string: ("Expected CSTR got '!'")
*    top   0.1 RESETTING after ../../../bin/varnishtest/tests/r00409.vtc
**   v1    0.1 Wait
**** v1    0.1 CLI TX|backend.list
***  v1    0.1 CLI RX  101
**** v1    0.1 CLI RX|Unknown request in manager process (child not running).
**** v1    0.1 CLI RX|Type 'help' for more info.
**   v1    0.1 Stop
**** v1    0.1 CLI TX|stop
***  v1    0.2 CLI RX  300
**** v1    0.2 CLI RX|Child in state stopped
**** v1    0.2 CLI TX|status
***  v1    0.2 CLI RX  200
**** v1    0.2 CLI RX|Child in state stopped
**** v1    0.2 STDOUT poll 0x10
**   v1    0.2 R 30711 Status: 0000 (u 0.000000 s 0.004000)
*    diag  0.0 ............................................................
#    top  TEST ../../../bin/varnishtest/tests/r00409.vtc TIMED OUT (kill -9)
#    top  TEST ../../../bin/varnishtest/tests/r00409.vtc FAILED (60.001) signal=9

1 @ SunOS 5.11 i86pc 1.04 32_gcc4.7 uplex

*    top   0.0 TEST ../../../bin/varnishtest/tests/r00409.vtc starting
[...]
*    top   0.0 TEST Regression test for ticket 409
[...]
**** v1    0.1 CLI TX|
**** v1    0.1 CLI TX|\tbackend b { .host = "127.0.0.1"; }
**** v1    0.1 CLI TX|\tsub vcl_recv {
**** v1    0.1 CLI TX|\t\tif ( req.url ~ ! "\.(png|jpg|gif|js|css)$" ) {
**** v1    0.1 CLI TX|\t\t\treturn (pass);
**** v1    0.1 CLI TX|\t\t}
**** v1    0.1 CLI TX|\t}
**** v1    0.1 CLI TX|
**** v1    0.1 CLI TX|%XJEIFLH|)Xspa8P
***  v1    0.1 CLI RX  106
**** v1    0.1 CLI RX|Message from VCC-compiler:
**** v1    0.1 CLI RX|Security: Privilege proc_setid missing, will not change uid/gid
**** v1    0.1 CLI RX|Expected CSTR got '!'
**** v1    0.1 CLI RX|(program line 1193), at
**** v1    0.1 CLI RX|('<vcl.inline>' Line 5 Pos 32)
**** v1    0.1 CLI RX|                if ( req.url ~ ! "\.(png|jpg|gif|js|css)$" ) {
**** v1    0.1 CLI RX|-------------------------------#------------------------------
**** v1    0.1 CLI RX|
**** v1    0.1 CLI RX|Running VCC-compiler failed, exited with 2
**** v1    0.1 CLI RX|VCL compilation failed
**   v1    0.1 VCL compilation failed (as expected)
***  v1    0.1 Found expected string: ("Expected CSTR got '!'")
*    top   0.1 RESETTING after ../../../bin/varnishtest/tests/r00409.vtc
**   v1    0.1 Wait
**** v1    0.1 CLI TX|backend.list
***  v1    0.1 CLI RX  101
**** v1    0.1 CLI RX|Unknown request in manager process (child not running).
**** v1    0.1 CLI RX|Type 'help' for more info.
**   v1    0.1 Stop
**** v1    0.1 CLI TX|stop
***  v1    0.1 CLI RX  300
**** v1    0.1 CLI RX|Child in state stopped
**** v1    0.1 CLI TX|status
***  v1    0.1 CLI RX  200
**** v1    0.1 CLI RX|Child in state stopped
**** v1    0.1 STDOUT poll 0x10
**   v1    0.1 R 68405 Status: 0000 (u 0.004000 s 0.017000)
*    diag  0.0 ............................................................
#    top  TEST ../../../bin/varnishtest/tests/r00409.vtc TIMED OUT (kill -9)
#    top  TEST ../../../bin/varnishtest/tests/r00409.vtc FAILED (60.002) signal=9

1 @ SunOS 5.11 i86pc 1.04 32_gcc4.7 uplex

*    top   0.0 TEST ../../../bin/varnishtest/tests/r00409.vtc starting
[...]
*    top   0.0 TEST Regression test for ticket 409
[...]
**** v1    0.1 CLI TX|
**** v1    0.1 CLI TX|\tbackend b { .host = "127.0.0.1"; }
**** v1    0.1 CLI TX|\tsub vcl_recv {
**** v1    0.1 CLI TX|\t\tif ( req.url ~ ! "\.(png|jpg|gif|js|css)$" ) {
**** v1    0.1 CLI TX|\t\t\treturn (pass);
**** v1    0.1 CLI TX|\t\t}
**** v1    0.1 CLI TX|\t}
**** v1    0.1 CLI TX|
**** v1    0.1 CLI TX|%XJEIFLH|)Xspa8P
***  v1    0.1 CLI RX  106
**** v1    0.1 CLI RX|Message from VCC-compiler:
**** v1    0.1 CLI RX|Security: Privilege proc_setid missing, will not change uid/gid
**** v1    0.1 CLI RX|Expected CSTR got '!'
**** v1    0.1 CLI RX|(program line 1193), at
**** v1    0.1 CLI RX|('<vcl.inline>' Line 5 Pos 32)
**** v1    0.1 CLI RX|                if ( req.url ~ ! "\.(png|jpg|gif|js|css)$" ) {
**** v1    0.1 CLI RX|-------------------------------#------------------------------
**** v1    0.1 CLI RX|
**** v1    0.1 CLI RX|Running VCC-compiler failed, exited with 2
**** v1    0.1 CLI RX|VCL compilation failed
**   v1    0.1 VCL compilation failed (as expected)
***  v1    0.1 Found expected string: ("Expected CSTR got '!'")
*    top   0.1 RESETTING after ../../../bin/varnishtest/tests/r00409.vtc
**   v1    0.1 Wait
**** v1    0.1 CLI TX|backend.list
***  v1    0.1 CLI RX  101
**** v1    0.1 CLI RX|Unknown request in manager process (child not running).
**** v1    0.1 CLI RX|Type 'help' for more info.
**   v1    0.1 Stop
**** v1    0.1 CLI TX|stop
***  v1    0.1 CLI RX  300
**** v1    0.1 CLI RX|Child in state stopped
**** v1    0.1 CLI TX|status
***  v1    0.1 CLI RX  200
**** v1    0.1 CLI RX|Child in state stopped
**** v1    0.1 STDOUT poll 0x10
**   v1    0.1 R 94341 Status: 0000 (u 0.004000 s 0.017000)
*    diag  0.0 ............................................................
#    top  TEST ../../../bin/varnishtest/tests/r00409.vtc TIMED OUT (kill -9)
#    top  TEST ../../../bin/varnishtest/tests/r00409.vtc FAILED (60.002) signal=9

1 @ SunOS 5.11 i86pc 1.04 64_sun12.4 uplex

*    top   0.0 TEST ../../../bin/varnishtest/tests/r00409.vtc starting
[...]
*    top   0.0 TEST Regression test for ticket 409
[...]
**** v1    0.1 CLI TX|
**** v1    0.1 CLI TX|\tbackend b { .host = "127.0.0.1"; }
**** v1    0.1 CLI TX|\tsub vcl_recv {
**** v1    0.1 CLI TX|\t\tif ( req.url ~ ! "\.(png|jpg|gif|js|css)$" ) {
**** v1    0.1 CLI TX|\t\t\treturn (pass);
**** v1    0.1 CLI TX|\t\t}
**** v1    0.1 CLI TX|\t}
**** v1    0.1 CLI TX|
**** v1    0.1 CLI TX|%XJEIFLH|)Xspa8P
***  v1    0.1 CLI RX  106
**** v1    0.1 CLI RX|Message from VCC-compiler:
**** v1    0.1 CLI RX|Security: Privilege proc_setid missing, will not change uid/gid
**** v1    0.1 CLI RX|Expected CSTR got '!'
**** v1    0.1 CLI RX|(program line 1193), at
**** v1    0.1 CLI RX|('<vcl.inline>' Line 5 Pos 32)
**** v1    0.1 CLI RX|                if ( req.url ~ ! "\.(png|jpg|gif|js|css)$" ) {
**** v1    0.1 CLI RX|-------------------------------#------------------------------
**** v1    0.1 CLI RX|
**** v1    0.1 CLI RX|Running VCC-compiler failed, exited with 2
**** v1    0.1 CLI RX|VCL compilation failed
**   v1    0.1 VCL compilation failed (as expected)
***  v1    0.1 Found expected string: ("Expected CSTR got '!'")
*    top   0.1 RESETTING after ../../../bin/varnishtest/tests/r00409.vtc
**   v1    0.1 Wait
**** v1    0.1 CLI TX|backend.list
***  v1    0.1 CLI RX  101
**** v1    0.1 CLI RX|Unknown request in manager process (child not running).
**** v1    0.1 CLI RX|Type 'help' for more info.
**   v1    0.1 Stop
**** v1    0.1 CLI TX|stop
***  v1    0.1 CLI RX  300
**** v1    0.1 CLI RX|Child in state stopped
**** v1    0.1 CLI TX|status
***  v1    0.1 CLI RX  200
**** v1    0.1 CLI RX|Child in state stopped
**** v1    0.1 STDOUT poll 0x10
**   v1    0.1 R 78756 Status: 0000 (u 0.007000 s 0.022000)
*    diag  0.0 ............................................................
#    top  TEST ../../../bin/varnishtest/tests/r00409.vtc TIMED OUT (kill -9)
#    top  TEST ../../../bin/varnishtest/tests/r00409.vtc FAILED (60.004) signal=9

1 @ SunOS 5.11 i86pc 1.04 32_sun12.4 uplex

*    top   0.0 TEST ../../../bin/varnishtest/tests/r00409.vtc starting
[...]
*    top   0.0 TEST Regression test for ticket 409
[...]
**** v1    0.1 CLI TX|
**** v1    0.1 CLI TX|\tbackend b { .host = "127.0.0.1"; }
**** v1    0.1 CLI TX|\tsub vcl_recv {
**** v1    0.1 CLI TX|\t\tif ( req.url ~ ! "\.(png|jpg|gif|js|css)$" ) {
**** v1    0.1 CLI TX|\t\t\treturn (pass);
**** v1    0.1 CLI TX|\t\t}
**** v1    0.1 CLI TX|\t}
**** v1    0.1 CLI TX|
**** v1    0.1 CLI TX|%XJEIFLH|)Xspa8P
***  v1    0.1 CLI RX  106
**** v1    0.1 CLI RX|Message from VCC-compiler:
**** v1    0.1 CLI RX|Security: Privilege proc_setid missing, will not change uid/gid
**** v1    0.1 CLI RX|Expected CSTR got '!'
**** v1    0.1 CLI RX|(program line 1193), at
**** v1    0.1 CLI RX|('<vcl.inline>' Line 5 Pos 32)
**** v1    0.1 CLI RX|                if ( req.url ~ ! "\.(png|jpg|gif|js|css)$" ) {
**** v1    0.1 CLI RX|-------------------------------#------------------------------
**** v1    0.1 CLI RX|
**** v1    0.1 CLI RX|Running VCC-compiler failed, exited with 2
**** v1    0.1 CLI RX|VCL compilation failed
**   v1    0.1 VCL compilation failed (as expected)
***  v1    0.1 Found expected string: ("Expected CSTR got '!'")
*    top   0.1 RESETTING after ../../../bin/varnishtest/tests/r00409.vtc
**   v1    0.1 Wait
**** v1    0.1 CLI TX|backend.list
***  v1    0.1 CLI RX  101
**** v1    0.1 CLI RX|Unknown request in manager process (child not running).
**** v1    0.1 CLI RX|Type 'help' for more info.
**   v1    0.1 Stop
**** v1    0.1 CLI TX|stop
***  v1    0.1 CLI RX  300
**** v1    0.1 CLI RX|Child in state stopped
**** v1    0.1 CLI TX|status
***  v1    0.1 CLI RX  200
**** v1    0.1 CLI RX|Child in state stopped
**** v1    0.1 STDOUT poll 0x10
**   v1    0.1 R 88136 Status: 0000 (u 0.004000 s 0.016000)
*    diag  0.0 ............................................................
#    top  TEST ../../../bin/varnishtest/tests/r00409.vtc TIMED OUT (kill -9)
#    top  TEST ../../../bin/varnishtest/tests/r00409.vtc FAILED (60.002) signal=9

1 @ SunOS 5.11 i86pc 1.04 64_sun12.4 uplex

*    top   0.0 TEST ../../../bin/varnishtest/tests/r00409.vtc starting
[...]
*    top   0.0 TEST Regression test for ticket 409
[...]
**** v1    0.1 CLI TX|
**** v1    0.1 CLI TX|\tbackend b { .host = "127.0.0.1"; }
**** v1    0.1 CLI TX|\tsub vcl_recv {
**** v1    0.1 CLI TX|\t\tif ( req.url ~ ! "\.(png|jpg|gif|js|css)$" ) {
**** v1    0.1 CLI TX|\t\t\treturn (pass);
**** v1    0.1 CLI TX|\t\t}
**** v1    0.1 CLI TX|\t}
**** v1    0.1 CLI TX|
**** v1    0.1 CLI TX|%XJEIFLH|)Xspa8P
***  v1    0.1 CLI RX  106
**** v1    0.1 CLI RX|Message from VCC-compiler:
**** v1    0.1 CLI RX|Security: Privilege proc_setid missing, will not change uid/gid
**** v1    0.1 CLI RX|Expected CSTR got '!'
**** v1    0.1 CLI RX|(program line 1193), at
**** v1    0.1 CLI RX|('<vcl.inline>' Line 5 Pos 32)
**** v1    0.1 CLI RX|                if ( req.url ~ ! "\.(png|jpg|gif|js|css)$" ) {
**** v1    0.1 CLI RX|-------------------------------#------------------------------
**** v1    0.1 CLI RX|
**** v1    0.1 CLI RX|Running VCC-compiler failed, exited with 2
**** v1    0.1 CLI RX|VCL compilation failed
**   v1    0.1 VCL compilation failed (as expected)
***  v1    0.1 Found expected string: ("Expected CSTR got '!'")
*    top   0.1 RESETTING after ../../../bin/varnishtest/tests/r00409.vtc
**   v1    0.1 Wait
**** v1    0.1 CLI TX|backend.list
***  v1    0.1 CLI RX  101
**** v1    0.1 CLI RX|Unknown request in manager process (child not running).
**** v1    0.1 CLI RX|Type 'help' for more info.
**   v1    0.1 Stop
**** v1    0.1 CLI TX|stop
***  v1    0.1 CLI RX  300
**** v1    0.1 CLI RX|Child in state stopped
**** v1    0.1 CLI TX|status
***  v1    0.1 CLI RX  200
**** v1    0.1 CLI RX|Child in state stopped
**** v1    0.1 STDOUT poll 0x10
**   v1    0.1 R 87605 Status: 0000 (u 0.007000 s 0.024000)
*    diag  0.0 ............................................................
#    top  TEST ../../../bin/varnishtest/tests/r00409.vtc TIMED OUT (kill -9)
#    top  TEST ../../../bin/varnishtest/tests/r00409.vtc FAILED (60.004) signal=9