r00655

8bbbdfa

1 @ Ubuntu LTS i686 1.04 fgs

*    top   0.0 TEST ../../../bin/varnishtest/tests/r00655.vtc starting
[...]
*    top   0.0 TEST Test nested /*...*/ comments
[...]
**** v1    0.1 CLI TX|
**** v1    0.1 CLI TX|
**** v1    0.1 CLI TX|\t/* foo
**** v1    0.1 CLI TX|\t\t/* bar
**** v1    0.1 CLI TX|\t*/
**** v1    0.1 CLI TX|
**** v1    0.1 CLI TX|%XJEIFLH|)Xspa8P
***  v1    0.1 CLI RX  106
**** v1    0.1 CLI RX|Message from VCC-compiler:
**** v1    0.1 CLI RX|/* ... */ comment contains /*
**** v1    0.1 CLI RX|('<vcl.inline>' Line 4 Pos 9)
**** v1    0.1 CLI RX|        /* foo
**** v1    0.1 CLI RX|--------##----
**** v1    0.1 CLI RX|
**** v1    0.1 CLI RX|('<vcl.inline>' Line 5 Pos 17)
**** v1    0.1 CLI RX|                /* bar
**** v1    0.1 CLI RX|----------------##----
**** v1    0.1 CLI RX|
**** v1    0.1 CLI RX|Running VCC-compiler failed, exited with 2
**** v1    0.1 CLI RX|VCL compilation failed
**   v1    0.1 VCL compilation failed (as expected)
***  v1    0.1 Found expected string: ("/* ... */ comment contains /*")
*    top   0.1 RESETTING after ../../../bin/varnishtest/tests/r00655.vtc
**   v1    0.1 Wait
**** v1    0.1 CLI TX|backend.list
***  v1    0.2 CLI RX  101
**** v1    0.2 CLI RX|Unknown request in manager process (child not running).
**** v1    0.2 CLI RX|Type 'help' for more info.
**   v1    0.2 Stop
**** v1    0.2 CLI TX|stop
***  v1    0.2 CLI RX  300
**** v1    0.2 CLI RX|Child in state stopped
**** v1    0.2 CLI TX|status
***  v1    0.2 CLI RX  200
**** v1    0.2 CLI RX|Child in state stopped
**** v1    0.2 STDOUT poll 0x10
**   v1    0.2 R 17093 Status: 0000 (u 0.004000 s 0.000000)
*    diag  0.0 ............................................................
#    top  TEST ../../../bin/varnishtest/tests/r00655.vtc TIMED OUT (kill -9)
#    top  TEST ../../../bin/varnishtest/tests/r00655.vtc FAILED (60.001) signal=9

1 @ Ubuntu LTS i686 1.04 fgs

*    top   0.0 TEST ../../../bin/varnishtest/tests/r00655.vtc starting
[...]
*    top   0.0 TEST Test nested /*...*/ comments
[...]
**** v1    0.1 CLI TX|
**** v1    0.1 CLI TX|
**** v1    0.1 CLI TX|\t/* foo
**** v1    0.1 CLI TX|\t\t/* bar
**** v1    0.1 CLI TX|\t*/
**** v1    0.1 CLI TX|
**** v1    0.1 CLI TX|%XJEIFLH|)Xspa8P
***  v1    0.1 CLI RX  106
**** v1    0.1 CLI RX|Message from VCC-compiler:
**** v1    0.1 CLI RX|/* ... */ comment contains /*
**** v1    0.1 CLI RX|('<vcl.inline>' Line 4 Pos 9)
**** v1    0.1 CLI RX|        /* foo
**** v1    0.1 CLI RX|--------##----
**** v1    0.1 CLI RX|
**** v1    0.1 CLI RX|('<vcl.inline>' Line 5 Pos 17)
**** v1    0.1 CLI RX|                /* bar
**** v1    0.1 CLI RX|----------------##----
**** v1    0.1 CLI RX|
**** v1    0.1 CLI RX|Running VCC-compiler failed, exited with 2
**** v1    0.1 CLI RX|VCL compilation failed
**   v1    0.1 VCL compilation failed (as expected)
***  v1    0.1 Found expected string: ("/* ... */ comment contains /*")
*    top   0.1 RESETTING after ../../../bin/varnishtest/tests/r00655.vtc
**   v1    0.1 Wait
**** v1    0.1 CLI TX|backend.list
***  v1    0.1 CLI RX  101
**** v1    0.1 CLI RX|Unknown request in manager process (child not running).
**** v1    0.1 CLI RX|Type 'help' for more info.
**   v1    0.1 Stop
**** v1    0.1 CLI TX|stop
***  v1    0.2 CLI RX  300
**** v1    0.2 CLI RX|Child in state stopped
**** v1    0.2 CLI TX|status
***  v1    0.2 CLI RX  200
**** v1    0.2 CLI RX|Child in state stopped
**** v1    0.2 STDOUT poll 0x10
**   v1    0.2 R 3056 Status: 0000 (u 0.000000 s 0.004000)
*    diag  0.0 ............................................................
#    top  TEST ../../../bin/varnishtest/tests/r00655.vtc TIMED OUT (kill -9)
#    top  TEST ../../../bin/varnishtest/tests/r00655.vtc FAILED (60.001) signal=9

1 @ SunOS 5.11 i86pc 1.04 64_sun12.4 uplex

*    top   0.0 TEST ../../../bin/varnishtest/tests/r00655.vtc starting
[...]
*    top   0.0 TEST Test nested /*...*/ comments
[...]
**** v1    0.1 CLI TX|
**** v1    0.1 CLI TX|\t/* foo
**** v1    0.1 CLI TX|\t\t/* bar
**** v1    0.1 CLI TX|\t*/
**** v1    0.1 CLI TX|
**** v1    0.1 CLI TX|%XJEIFLH|)Xspa8P
***  v1    0.1 CLI RX  106
**** v1    0.1 CLI RX|Message from VCC-compiler:
**** v1    0.1 CLI RX|Security: Privilege proc_setid missing, will not change uid/gid
**** v1    0.1 CLI RX|/* ... */ comment contains /*
**** v1    0.1 CLI RX|('<vcl.inline>' Line 4 Pos 9)
**** v1    0.1 CLI RX|        /* foo
**** v1    0.1 CLI RX|--------##----
**** v1    0.1 CLI RX|
**** v1    0.1 CLI RX|('<vcl.inline>' Line 5 Pos 17)
**** v1    0.1 CLI RX|                /* bar
**** v1    0.1 CLI RX|----------------##----
**** v1    0.1 CLI RX|
**** v1    0.1 CLI RX|Running VCC-compiler failed, exited with 2
**** v1    0.1 CLI RX|VCL compilation failed
**   v1    0.1 VCL compilation failed (as expected)
***  v1    0.1 Found expected string: ("/* ... */ comment contains /*")
*    top   0.1 RESETTING after ../../../bin/varnishtest/tests/r00655.vtc
**   v1    0.1 Wait
**** v1    0.1 CLI TX|backend.list
***  v1    0.1 CLI RX  101
**** v1    0.1 CLI RX|Unknown request in manager process (child not running).
**** v1    0.1 CLI RX|Type 'help' for more info.
**   v1    0.1 Stop
**** v1    0.1 CLI TX|stop
***  v1    0.1 CLI RX  300
**** v1    0.1 CLI RX|Child in state stopped
**** v1    0.1 CLI TX|status
***  v1    0.1 CLI RX  200
**** v1    0.1 CLI RX|Child in state stopped
**** v1    0.1 STDOUT poll 0x10
**   v1    0.1 R 19454 Status: 0000 (u 0.006000 s 0.023000)
*    diag  0.0 ............................................................
#    top  TEST ../../../bin/varnishtest/tests/r00655.vtc TIMED OUT (kill -9)
#    top  TEST ../../../bin/varnishtest/tests/r00655.vtc FAILED (60.005) signal=9

1 @ Linux 3.10.0 x86_64 1.02 mblissett

*    top   0.0 TEST ../../../bin/varnishtest/tests/r00655.vtc starting
[...]
*    top   0.0 TEST Test nested /*...*/ comments
[...]
**** v1    0.1 CLI TX|
**** v1    0.1 CLI TX|
**** v1    0.1 CLI TX|\t/* foo
**** v1    0.1 CLI TX|\t\t/* bar
**** v1    0.1 CLI TX|\t*/
**** v1    0.1 CLI TX|
**** v1    0.1 CLI TX|%XJEIFLH|)Xspa8P
***  v1    0.1 CLI RX  106
**** v1    0.1 CLI RX|Message from VCC-compiler:
**** v1    0.1 CLI RX|/* ... */ comment contains /*
**** v1    0.1 CLI RX|('<vcl.inline>' Line 4 Pos 9)
**** v1    0.1 CLI RX|        /* foo
**** v1    0.1 CLI RX|--------##----
**** v1    0.1 CLI RX|
**** v1    0.1 CLI RX|('<vcl.inline>' Line 5 Pos 17)
**** v1    0.1 CLI RX|                /* bar
**** v1    0.1 CLI RX|----------------##----
**** v1    0.1 CLI RX|
**** v1    0.1 CLI RX|Running VCC-compiler failed, exited with 2
**** v1    0.1 CLI RX|VCL compilation failed
**   v1    0.1 VCL compilation failed (as expected)
***  v1    0.1 Found expected string: ("/* ... */ comment contains /*")
*    top   0.1 RESETTING after ../../../bin/varnishtest/tests/r00655.vtc
**   v1    0.1 Wait
**** v1    0.1 CLI TX|backend.list
***  v1    0.2 CLI RX  101
**** v1    0.2 CLI RX|Unknown request in manager process (child not running).
**** v1    0.2 CLI RX|Type 'help' for more info.
**   v1    0.2 Stop
**** v1    0.2 CLI TX|stop
***  v1    0.2 CLI RX  300
**** v1    0.2 CLI RX|Child in state stopped
**** v1    0.2 CLI TX|status
***  v1    0.2 CLI RX  200
**** v1    0.2 CLI RX|Child in state stopped
**** v1    0.2 STDOUT poll 0x10
**   v1    0.2 R 9493 Status: 0000 (u 0.003762 s 0.018407)
*    diag  0.0 ............................................................
#    top  TEST ../../../bin/varnishtest/tests/r00655.vtc TIMED OUT (kill -9)
#    top  TEST ../../../bin/varnishtest/tests/r00655.vtc FAILED (60.001) signal=9

1 @ SunOS 5.11 i86pc 1.04 32_sun12.4 uplex

*    top   0.0 TEST ../../../bin/varnishtest/tests/r00655.vtc starting
[...]
*    top   0.0 TEST Test nested /*...*/ comments
[...]
**** v1    0.1 CLI TX|
**** v1    0.1 CLI TX|\t/* foo
**** v1    0.1 CLI TX|\t\t/* bar
**** v1    0.1 CLI TX|\t*/
**** v1    0.1 CLI TX|
**** v1    0.1 CLI TX|%XJEIFLH|)Xspa8P
***  v1    0.1 CLI RX  106
**** v1    0.1 CLI RX|Message from VCC-compiler:
**** v1    0.1 CLI RX|Security: Privilege proc_setid missing, will not change uid/gid
**** v1    0.1 CLI RX|/* ... */ comment contains /*
**** v1    0.1 CLI RX|('<vcl.inline>' Line 4 Pos 9)
**** v1    0.1 CLI RX|        /* foo
**** v1    0.1 CLI RX|--------##----
**** v1    0.1 CLI RX|
**** v1    0.1 CLI RX|('<vcl.inline>' Line 5 Pos 17)
**** v1    0.1 CLI RX|                /* bar
**** v1    0.1 CLI RX|----------------##----
**** v1    0.1 CLI RX|
**** v1    0.1 CLI RX|Running VCC-compiler failed, exited with 2
**** v1    0.1 CLI RX|VCL compilation failed
**   v1    0.1 VCL compilation failed (as expected)
***  v1    0.1 Found expected string: ("/* ... */ comment contains /*")
*    top   0.1 RESETTING after ../../../bin/varnishtest/tests/r00655.vtc
**   v1    0.1 Wait
**** v1    0.1 CLI TX|backend.list
***  v1    0.1 CLI RX  101
**** v1    0.1 CLI RX|Unknown request in manager process (child not running).
**** v1    0.1 CLI RX|Type 'help' for more info.
**   v1    0.1 Stop
**** v1    0.1 CLI TX|stop
***  v1    0.1 CLI RX  300
**** v1    0.1 CLI RX|Child in state stopped
**** v1    0.1 CLI TX|status
***  v1    0.1 CLI RX  200
**** v1    0.1 CLI RX|Child in state stopped
**** v1    0.1 STDOUT poll 0x10
**   v1    0.1 R 99484 Status: 0000 (u 0.004000 s 0.018000)
*    diag  0.0 ............................................................
#    top  TEST ../../../bin/varnishtest/tests/r00655.vtc TIMED OUT (kill -9)
#    top  TEST ../../../bin/varnishtest/tests/r00655.vtc FAILED (60.002) signal=9

1 @ Linux 3.10.0 x86_64 1.02 mblissett

*    top   0.0 TEST ../../../bin/varnishtest/tests/r00655.vtc starting
[...]
*    top   0.0 TEST Test nested /*...*/ comments
[...]
**** v1    0.1 CLI TX|
**** v1    0.1 CLI TX|
**** v1    0.1 CLI TX|\t/* foo
**** v1    0.1 CLI TX|\t\t/* bar
**** v1    0.1 CLI TX|\t*/
**** v1    0.1 CLI TX|
**** v1    0.1 CLI TX|%XJEIFLH|)Xspa8P
***  v1    0.1 CLI RX  106
**** v1    0.1 CLI RX|Message from VCC-compiler:
**** v1    0.1 CLI RX|/* ... */ comment contains /*
**** v1    0.1 CLI RX|('<vcl.inline>' Line 4 Pos 9)
**** v1    0.1 CLI RX|        /* foo
**** v1    0.1 CLI RX|--------##----
**** v1    0.1 CLI RX|
**** v1    0.1 CLI RX|('<vcl.inline>' Line 5 Pos 17)
**** v1    0.1 CLI RX|                /* bar
**** v1    0.1 CLI RX|----------------##----
**** v1    0.1 CLI RX|
**** v1    0.1 CLI RX|Running VCC-compiler failed, exited with 2
**** v1    0.1 CLI RX|VCL compilation failed
**   v1    0.1 VCL compilation failed (as expected)
***  v1    0.1 Found expected string: ("/* ... */ comment contains /*")
*    top   0.1 RESETTING after ../../../bin/varnishtest/tests/r00655.vtc
**   v1    0.1 Wait
**** v1    0.1 CLI TX|backend.list
***  v1    0.2 CLI RX  101
**** v1    0.2 CLI RX|Unknown request in manager process (child not running).
**** v1    0.2 CLI RX|Type 'help' for more info.
**   v1    0.2 Stop
**** v1    0.2 CLI TX|stop
***  v1    0.2 CLI RX  300
**** v1    0.2 CLI RX|Child in state stopped
**** v1    0.2 CLI TX|status
***  v1    0.2 CLI RX  200
**** v1    0.2 CLI RX|Child in state stopped
**** v1    0.2 STDOUT poll 0x10
**   v1    0.2 R 12206 Status: 0000 (u 0.003133 s 0.014942)
*    diag  0.0 ............................................................
#    top  TEST ../../../bin/varnishtest/tests/r00655.vtc TIMED OUT (kill -9)
#    top  TEST ../../../bin/varnishtest/tests/r00655.vtc FAILED (60.001) signal=9

1 @ Ubuntu LTS i686 1.04 fgs

*    top   0.0 TEST ../../../bin/varnishtest/tests/r00655.vtc starting
[...]
*    top   0.0 TEST Test nested /*...*/ comments
[...]
**** v1    0.1 CLI TX|
**** v1    0.1 CLI TX|
**** v1    0.1 CLI TX|\t/* foo
**** v1    0.1 CLI TX|\t\t/* bar
**** v1    0.1 CLI TX|\t*/
**** v1    0.1 CLI TX|
**** v1    0.1 CLI TX|%XJEIFLH|)Xspa8P
***  v1    0.1 CLI RX  106
**** v1    0.1 CLI RX|Message from VCC-compiler:
**** v1    0.1 CLI RX|/* ... */ comment contains /*
**** v1    0.1 CLI RX|('<vcl.inline>' Line 4 Pos 9)
**** v1    0.1 CLI RX|        /* foo
**** v1    0.1 CLI RX|--------##----
**** v1    0.1 CLI RX|
**** v1    0.1 CLI RX|('<vcl.inline>' Line 5 Pos 17)
**** v1    0.1 CLI RX|                /* bar
**** v1    0.1 CLI RX|----------------##----
**** v1    0.1 CLI RX|
**** v1    0.1 CLI RX|Running VCC-compiler failed, exited with 2
**** v1    0.1 CLI RX|VCL compilation failed
**   v1    0.1 VCL compilation failed (as expected)
***  v1    0.1 Found expected string: ("/* ... */ comment contains /*")
*    top   0.1 RESETTING after ../../../bin/varnishtest/tests/r00655.vtc
**   v1    0.1 Wait
**** v1    0.1 CLI TX|backend.list
***  v1    0.2 CLI RX  101
**** v1    0.2 CLI RX|Unknown request in manager process (child not running).
**** v1    0.2 CLI RX|Type 'help' for more info.
**   v1    0.2 Stop
**** v1    0.2 CLI TX|stop
***  v1    0.2 CLI RX  300
**** v1    0.2 CLI RX|Child in state stopped
**** v1    0.2 CLI TX|status
***  v1    0.2 CLI RX  200
**** v1    0.2 CLI RX|Child in state stopped
**** v1    0.3 STDOUT poll 0x10
**   v1    0.3 R 32513 Status: 0000 (u 0.000000 s 0.004000)
*    diag  0.0 ............................................................
#    top  TEST ../../../bin/varnishtest/tests/r00655.vtc TIMED OUT (kill -9)
#    top  TEST ../../../bin/varnishtest/tests/r00655.vtc FAILED (60.001) signal=9

1 @ Linux 3.10.0 x86_64 1.02 mblissett

*    top   0.0 TEST ../../../bin/varnishtest/tests/r00655.vtc starting
[...]
*    top   0.0 TEST Test nested /*...*/ comments
[...]
**** v1    0.1 CLI TX|
**** v1    0.1 CLI TX|
**** v1    0.1 CLI TX|\t/* foo
**** v1    0.1 CLI TX|\t\t/* bar
**** v1    0.1 CLI TX|\t*/
**** v1    0.1 CLI TX|
**** v1    0.1 CLI TX|%XJEIFLH|)Xspa8P
***  v1    0.1 CLI RX  106
**** v1    0.1 CLI RX|Message from VCC-compiler:
**** v1    0.1 CLI RX|/* ... */ comment contains /*
**** v1    0.1 CLI RX|('<vcl.inline>' Line 4 Pos 9)
**** v1    0.1 CLI RX|        /* foo
**** v1    0.1 CLI RX|--------##----
**** v1    0.1 CLI RX|
**** v1    0.1 CLI RX|('<vcl.inline>' Line 5 Pos 17)
**** v1    0.1 CLI RX|                /* bar
**** v1    0.1 CLI RX|----------------##----
**** v1    0.1 CLI RX|
**** v1    0.1 CLI RX|Running VCC-compiler failed, exited with 2
**** v1    0.1 CLI RX|VCL compilation failed
**   v1    0.1 VCL compilation failed (as expected)
***  v1    0.1 Found expected string: ("/* ... */ comment contains /*")
*    top   0.1 RESETTING after ../../../bin/varnishtest/tests/r00655.vtc
**   v1    0.1 Wait
**** v1    0.1 CLI TX|backend.list
***  v1    0.2 CLI RX  101
**** v1    0.2 CLI RX|Unknown request in manager process (child not running).
**** v1    0.2 CLI RX|Type 'help' for more info.
**   v1    0.2 Stop
**** v1    0.2 CLI TX|stop
***  v1    0.2 CLI RX  300
**** v1    0.2 CLI RX|Child in state stopped
**** v1    0.2 CLI TX|status
***  v1    0.2 CLI RX  200
**** v1    0.2 CLI RX|Child in state stopped
**** v1    0.2 STDOUT poll 0x10
**   v1    0.2 R 12901 Status: 0000 (u 0.001055 s 0.009736)
*    diag  0.0 ............................................................
#    top  TEST ../../../bin/varnishtest/tests/r00655.vtc TIMED OUT (kill -9)
#    top  TEST ../../../bin/varnishtest/tests/r00655.vtc FAILED (60.002) signal=9

1 @ SunOS 5.11 i86pc 1.04 32_sun12.4 uplex

*    top   0.0 TEST ../../../bin/varnishtest/tests/r00655.vtc starting
[...]
*    top   0.0 TEST Test nested /*...*/ comments
[...]
**** v1    0.1 CLI TX|
**** v1    0.1 CLI TX|\t/* foo
**** v1    0.1 CLI TX|\t\t/* bar
**** v1    0.1 CLI TX|\t*/
**** v1    0.1 CLI TX|
**** v1    0.1 CLI TX|%XJEIFLH|)Xspa8P
***  v1    0.1 CLI RX  106
**** v1    0.1 CLI RX|Message from VCC-compiler:
**** v1    0.1 CLI RX|Security: Privilege proc_setid missing, will not change uid/gid
**** v1    0.1 CLI RX|/* ... */ comment contains /*
**** v1    0.1 CLI RX|('<vcl.inline>' Line 4 Pos 9)
**** v1    0.1 CLI RX|        /* foo
**** v1    0.1 CLI RX|--------##----
**** v1    0.1 CLI RX|
**** v1    0.1 CLI RX|('<vcl.inline>' Line 5 Pos 17)
**** v1    0.1 CLI RX|                /* bar
**** v1    0.1 CLI RX|----------------##----
**** v1    0.1 CLI RX|
**** v1    0.1 CLI RX|Running VCC-compiler failed, exited with 2
**** v1    0.1 CLI RX|VCL compilation failed
**   v1    0.1 VCL compilation failed (as expected)
***  v1    0.1 Found expected string: ("/* ... */ comment contains /*")
*    top   0.1 RESETTING after ../../../bin/varnishtest/tests/r00655.vtc
**   v1    0.1 Wait
**** v1    0.1 CLI TX|backend.list
***  v1    0.1 CLI RX  101
**** v1    0.1 CLI RX|Unknown request in manager process (child not running).
**** v1    0.1 CLI RX|Type 'help' for more info.
**   v1    0.1 Stop
**** v1    0.1 CLI TX|stop
***  v1    0.1 CLI RX  300
**** v1    0.1 CLI RX|Child in state stopped
**** v1    0.1 CLI TX|status
***  v1    0.1 CLI RX  200
**** v1    0.1 CLI RX|Child in state stopped
**** v1    0.1 STDOUT poll 0x10
**   v1    0.1 R 68442 Status: 0000 (u 0.004000 s 0.016000)
*    diag  0.0 ............................................................
#    top  TEST ../../../bin/varnishtest/tests/r00655.vtc TIMED OUT (kill -9)
#    top  TEST ../../../bin/varnishtest/tests/r00655.vtc FAILED (60.002) signal=9

1 @ Ubuntu LTS i686 1.04 fgs

*    top   0.0 TEST ../../../bin/varnishtest/tests/r00655.vtc starting
[...]
*    top   0.0 TEST Test nested /*...*/ comments
[...]
**** v1    0.1 CLI TX|
**** v1    0.1 CLI TX|
**** v1    0.1 CLI TX|\t/* foo
**** v1    0.1 CLI TX|\t\t/* bar
**** v1    0.1 CLI TX|\t*/
**** v1    0.1 CLI TX|
**** v1    0.1 CLI TX|%XJEIFLH|)Xspa8P
***  v1    0.1 CLI RX  106
**** v1    0.1 CLI RX|Message from VCC-compiler:
**** v1    0.1 CLI RX|/* ... */ comment contains /*
**** v1    0.1 CLI RX|('<vcl.inline>' Line 4 Pos 9)
**** v1    0.1 CLI RX|        /* foo
**** v1    0.1 CLI RX|--------##----
**** v1    0.1 CLI RX|
**** v1    0.1 CLI RX|('<vcl.inline>' Line 5 Pos 17)
**** v1    0.1 CLI RX|                /* bar
**** v1    0.1 CLI RX|----------------##----
**** v1    0.1 CLI RX|
**** v1    0.1 CLI RX|Running VCC-compiler failed, exited with 2
**** v1    0.1 CLI RX|VCL compilation failed
**   v1    0.1 VCL compilation failed (as expected)
***  v1    0.1 Found expected string: ("/* ... */ comment contains /*")
*    top   0.1 RESETTING after ../../../bin/varnishtest/tests/r00655.vtc
**   v1    0.1 Wait
**** v1    0.1 CLI TX|backend.list
***  v1    0.1 CLI RX  101
**** v1    0.1 CLI RX|Unknown request in manager process (child not running).
**** v1    0.1 CLI RX|Type 'help' for more info.
**   v1    0.1 Stop
**** v1    0.1 CLI TX|stop
***  v1    0.2 CLI RX  300
**** v1    0.2 CLI RX|Child in state stopped
**** v1    0.2 CLI TX|status
***  v1    0.2 CLI RX  200
**** v1    0.2 CLI RX|Child in state stopped
**** v1    0.2 STDOUT poll 0x10
**   v1    0.2 R 6259 Status: 0000 (u 0.000000 s 0.004000)
*    diag  0.0 ............................................................
#    top  TEST ../../../bin/varnishtest/tests/r00655.vtc TIMED OUT (kill -9)
#    top  TEST ../../../bin/varnishtest/tests/r00655.vtc FAILED (60.001) signal=9

1 @ Ubuntu LTS i686 1.04 fgs

*    top   0.0 TEST ../../../bin/varnishtest/tests/r00655.vtc starting
[...]
*    top   0.0 TEST Test nested /*...*/ comments
[...]
**** v1    0.1 CLI TX|
**** v1    0.1 CLI TX|
**** v1    0.1 CLI TX|\t/* foo
**** v1    0.1 CLI TX|\t\t/* bar
**** v1    0.1 CLI TX|\t*/
**** v1    0.1 CLI TX|
**** v1    0.1 CLI TX|%XJEIFLH|)Xspa8P
***  v1    0.1 CLI RX  106
**** v1    0.1 CLI RX|Message from VCC-compiler:
**** v1    0.1 CLI RX|/* ... */ comment contains /*
**** v1    0.1 CLI RX|('<vcl.inline>' Line 4 Pos 9)
**** v1    0.1 CLI RX|        /* foo
**** v1    0.1 CLI RX|--------##----
**** v1    0.1 CLI RX|
**** v1    0.1 CLI RX|('<vcl.inline>' Line 5 Pos 17)
**** v1    0.1 CLI RX|                /* bar
**** v1    0.1 CLI RX|----------------##----
**** v1    0.1 CLI RX|
**** v1    0.1 CLI RX|Running VCC-compiler failed, exited with 2
**** v1    0.1 CLI RX|VCL compilation failed
**   v1    0.1 VCL compilation failed (as expected)
***  v1    0.1 Found expected string: ("/* ... */ comment contains /*")
*    top   0.1 RESETTING after ../../../bin/varnishtest/tests/r00655.vtc
**   v1    0.1 Wait
**** v1    0.1 CLI TX|backend.list
***  v1    0.1 CLI RX  101
**** v1    0.1 CLI RX|Unknown request in manager process (child not running).
**** v1    0.1 CLI RX|Type 'help' for more info.
**   v1    0.1 Stop
**** v1    0.1 CLI TX|stop
***  v1    0.2 CLI RX  300
**** v1    0.2 CLI RX|Child in state stopped
**** v1    0.2 CLI TX|status
***  v1    0.2 CLI RX  200
**** v1    0.2 CLI RX|Child in state stopped
**** v1    0.2 STDOUT poll 0x10
**   v1    0.2 R 29542 Status: 0000 (u 0.000000 s 0.004000)
*    diag  0.0 ............................................................
#    top  TEST ../../../bin/varnishtest/tests/r00655.vtc TIMED OUT (kill -9)
#    top  TEST ../../../bin/varnishtest/tests/r00655.vtc FAILED (60.001) signal=9

1 @ Linux 3.10.0 x86_64 1.02 mblissett

*    top   0.0 TEST ../../../bin/varnishtest/tests/r00655.vtc starting
[...]
*    top   0.0 TEST Test nested /*...*/ comments
[...]
**** v1    0.1 CLI TX|
**** v1    0.1 CLI TX|
**** v1    0.1 CLI TX|\t/* foo
**** v1    0.1 CLI TX|\t\t/* bar
**** v1    0.1 CLI TX|\t*/
**** v1    0.1 CLI TX|
**** v1    0.1 CLI TX|%XJEIFLH|)Xspa8P
***  v1    0.1 CLI RX  106
**** v1    0.1 CLI RX|Message from VCC-compiler:
**** v1    0.1 CLI RX|/* ... */ comment contains /*
**** v1    0.1 CLI RX|('<vcl.inline>' Line 4 Pos 9)
**** v1    0.1 CLI RX|        /* foo
**** v1    0.1 CLI RX|--------##----
**** v1    0.1 CLI RX|
**** v1    0.1 CLI RX|('<vcl.inline>' Line 5 Pos 17)
**** v1    0.1 CLI RX|                /* bar
**** v1    0.1 CLI RX|----------------##----
**** v1    0.1 CLI RX|
**** v1    0.1 CLI RX|Running VCC-compiler failed, exited with 2
**** v1    0.1 CLI RX|VCL compilation failed
**   v1    0.1 VCL compilation failed (as expected)
***  v1    0.1 Found expected string: ("/* ... */ comment contains /*")
*    top   0.1 RESETTING after ../../../bin/varnishtest/tests/r00655.vtc
**   v1    0.1 Wait
**** v1    0.1 CLI TX|backend.list
***  v1    0.2 CLI RX  101
**** v1    0.2 CLI RX|Unknown request in manager process (child not running).
**** v1    0.2 CLI RX|Type 'help' for more info.
**   v1    0.2 Stop
**** v1    0.2 CLI TX|stop
***  v1    0.2 CLI RX  300
**** v1    0.2 CLI RX|Child in state stopped
**** v1    0.2 CLI TX|status
***  v1    0.2 CLI RX  200
**** v1    0.2 CLI RX|Child in state stopped
**** v1    0.2 STDOUT poll 0x10
**   v1    0.2 R 28703 Status: 0000 (u 0.007230 s 0.015272)
*    diag  0.0 ............................................................
#    top  TEST ../../../bin/varnishtest/tests/r00655.vtc TIMED OUT (kill -9)
#    top  TEST ../../../bin/varnishtest/tests/r00655.vtc FAILED (60.001) signal=9

1 @ Ubuntu LTS i686 1.04 fgs

*    top   0.0 TEST ../../../bin/varnishtest/tests/r00655.vtc starting
[...]
*    top   0.0 TEST Test nested /*...*/ comments
[...]
**** v1    0.1 CLI TX|
**** v1    0.1 CLI TX|
**** v1    0.1 CLI TX|\t/* foo
**** v1    0.1 CLI TX|\t\t/* bar
**** v1    0.1 CLI TX|\t*/
**** v1    0.1 CLI TX|
**** v1    0.1 CLI TX|%XJEIFLH|)Xspa8P
***  v1    0.1 CLI RX  106
**** v1    0.1 CLI RX|Message from VCC-compiler:
**** v1    0.1 CLI RX|/* ... */ comment contains /*
**** v1    0.1 CLI RX|('<vcl.inline>' Line 4 Pos 9)
**** v1    0.1 CLI RX|        /* foo
**** v1    0.1 CLI RX|--------##----
**** v1    0.1 CLI RX|
**** v1    0.1 CLI RX|('<vcl.inline>' Line 5 Pos 17)
**** v1    0.1 CLI RX|                /* bar
**** v1    0.1 CLI RX|----------------##----
**** v1    0.1 CLI RX|
**** v1    0.1 CLI RX|Running VCC-compiler failed, exited with 2
**** v1    0.1 CLI RX|VCL compilation failed
**   v1    0.1 VCL compilation failed (as expected)
***  v1    0.1 Found expected string: ("/* ... */ comment contains /*")
*    top   0.1 RESETTING after ../../../bin/varnishtest/tests/r00655.vtc
**   v1    0.1 Wait
**** v1    0.1 CLI TX|backend.list
***  v1    0.1 CLI RX  101
**** v1    0.1 CLI RX|Unknown request in manager process (child not running).
**** v1    0.1 CLI RX|Type 'help' for more info.
**   v1    0.1 Stop
**** v1    0.1 CLI TX|stop
***  v1    0.2 CLI RX  300
**** v1    0.2 CLI RX|Child in state stopped
**** v1    0.2 CLI TX|status
***  v1    0.2 CLI RX  200
**** v1    0.2 CLI RX|Child in state stopped
**** v1    0.2 STDOUT poll 0x10
**   v1    0.2 R 11214 Status: 0000 (u 0.004000 s 0.000000)
*    diag  0.0 ............................................................
#    top  TEST ../../../bin/varnishtest/tests/r00655.vtc TIMED OUT (kill -9)
#    top  TEST ../../../bin/varnishtest/tests/r00655.vtc FAILED (60.001) signal=9

1 @ Linux 3.10.0 x86_64 1.02 mblissett

*    top   0.0 TEST ../../../bin/varnishtest/tests/r00655.vtc starting
[...]
*    top   0.0 TEST Test nested /*...*/ comments
[...]
**** v1    0.1 CLI TX|
**** v1    0.1 CLI TX|
**** v1    0.1 CLI TX|\t/* foo
**** v1    0.1 CLI TX|\t\t/* bar
**** v1    0.1 CLI TX|\t*/
**** v1    0.1 CLI TX|
**** v1    0.1 CLI TX|%XJEIFLH|)Xspa8P
***  v1    0.1 CLI RX  106
**** v1    0.1 CLI RX|Message from VCC-compiler:
**** v1    0.1 CLI RX|/* ... */ comment contains /*
**** v1    0.1 CLI RX|('<vcl.inline>' Line 4 Pos 9)
**** v1    0.1 CLI RX|        /* foo
**** v1    0.1 CLI RX|--------##----
**** v1    0.1 CLI RX|
**** v1    0.1 CLI RX|('<vcl.inline>' Line 5 Pos 17)
**** v1    0.1 CLI RX|                /* bar
**** v1    0.1 CLI RX|----------------##----
**** v1    0.1 CLI RX|
**** v1    0.1 CLI RX|Running VCC-compiler failed, exited with 2
**** v1    0.1 CLI RX|VCL compilation failed
**   v1    0.1 VCL compilation failed (as expected)
***  v1    0.1 Found expected string: ("/* ... */ comment contains /*")
*    top   0.1 RESETTING after ../../../bin/varnishtest/tests/r00655.vtc
**   v1    0.1 Wait
**** v1    0.1 CLI TX|backend.list
***  v1    0.2 CLI RX  101
**** v1    0.2 CLI RX|Unknown request in manager process (child not running).
**** v1    0.2 CLI RX|Type 'help' for more info.
**   v1    0.2 Stop
**** v1    0.2 CLI TX|stop
***  v1    0.2 CLI RX  300
**** v1    0.2 CLI RX|Child in state stopped
**** v1    0.2 CLI TX|status
***  v1    0.2 CLI RX  200
**** v1    0.2 CLI RX|Child in state stopped
**** v1    0.2 STDOUT poll 0x10
**   v1    0.2 R 25565 Status: 0000 (u 0.002008 s 0.019374)
*    diag  0.0 ............................................................
#    top  TEST ../../../bin/varnishtest/tests/r00655.vtc TIMED OUT (kill -9)
#    top  TEST ../../../bin/varnishtest/tests/r00655.vtc FAILED (60.002) signal=9

1 @ Linux 3.10.0 x86_64 1.02 mblissett

*    top   0.0 TEST ../../../bin/varnishtest/tests/r00655.vtc starting
[...]
*    top   0.0 TEST Test nested /*...*/ comments
[...]
**** v1    0.1 CLI TX|
**** v1    0.1 CLI TX|
**** v1    0.1 CLI TX|\t/* foo
**** v1    0.1 CLI TX|\t\t/* bar
**** v1    0.1 CLI TX|\t*/
**** v1    0.1 CLI TX|
**** v1    0.1 CLI TX|%XJEIFLH|)Xspa8P
***  v1    0.1 CLI RX  106
**** v1    0.1 CLI RX|Message from VCC-compiler:
**** v1    0.1 CLI RX|/* ... */ comment contains /*
**** v1    0.1 CLI RX|('<vcl.inline>' Line 4 Pos 9)
**** v1    0.1 CLI RX|        /* foo
**** v1    0.1 CLI RX|--------##----
**** v1    0.1 CLI RX|
**** v1    0.1 CLI RX|('<vcl.inline>' Line 5 Pos 17)
**** v1    0.1 CLI RX|                /* bar
**** v1    0.1 CLI RX|----------------##----
**** v1    0.1 CLI RX|
**** v1    0.1 CLI RX|Running VCC-compiler failed, exited with 2
**** v1    0.1 CLI RX|VCL compilation failed
**   v1    0.1 VCL compilation failed (as expected)
***  v1    0.1 Found expected string: ("/* ... */ comment contains /*")
*    top   0.1 RESETTING after ../../../bin/varnishtest/tests/r00655.vtc
**   v1    0.1 Wait
**** v1    0.1 CLI TX|backend.list
***  v1    0.2 CLI RX  101
**** v1    0.2 CLI RX|Unknown request in manager process (child not running).
**** v1    0.2 CLI RX|Type 'help' for more info.
**   v1    0.2 Stop
**** v1    0.2 CLI TX|stop
***  v1    0.2 CLI RX  300
**** v1    0.2 CLI RX|Child in state stopped
**** v1    0.2 CLI TX|status
***  v1    0.2 CLI RX  200
**** v1    0.2 CLI RX|Child in state stopped
**** v1    0.2 STDOUT poll 0x10
**   v1    0.2 R 2628 Status: 0000 (u 0.003158 s 0.018053)
*    diag  0.0 ............................................................
#    top  TEST ../../../bin/varnishtest/tests/r00655.vtc TIMED OUT (kill -9)
#    top  TEST ../../../bin/varnishtest/tests/r00655.vtc FAILED (60.001) signal=9

1 @ SunOS 5.11 i86pc 1.04 32_sun12.4 uplex

*    top   0.0 TEST ../../../bin/varnishtest/tests/r00655.vtc starting
[...]
*    top   0.0 TEST Test nested /*...*/ comments
[...]
**** v1    0.1 CLI TX|
**** v1    0.1 CLI TX|\t/* foo
**** v1    0.1 CLI TX|\t\t/* bar
**** v1    0.1 CLI TX|\t*/
**** v1    0.1 CLI TX|
**** v1    0.1 CLI TX|%XJEIFLH|)Xspa8P
***  v1    0.1 CLI RX  106
**** v1    0.1 CLI RX|Message from VCC-compiler:
**** v1    0.1 CLI RX|Security: Privilege proc_setid missing, will not change uid/gid
**** v1    0.1 CLI RX|/* ... */ comment contains /*
**** v1    0.1 CLI RX|('<vcl.inline>' Line 4 Pos 9)
**** v1    0.1 CLI RX|        /* foo
**** v1    0.1 CLI RX|--------##----
**** v1    0.1 CLI RX|
**** v1    0.1 CLI RX|('<vcl.inline>' Line 5 Pos 17)
**** v1    0.1 CLI RX|                /* bar
**** v1    0.1 CLI RX|----------------##----
**** v1    0.1 CLI RX|
**** v1    0.1 CLI RX|Running VCC-compiler failed, exited with 2
**** v1    0.1 CLI RX|VCL compilation failed
**   v1    0.1 VCL compilation failed (as expected)
***  v1    0.1 Found expected string: ("/* ... */ comment contains /*")
*    top   0.1 RESETTING after ../../../bin/varnishtest/tests/r00655.vtc
**   v1    0.1 Wait
**** v1    0.1 CLI TX|backend.list
***  v1    0.1 CLI RX  101
**** v1    0.1 CLI RX|Unknown request in manager process (child not running).
**** v1    0.1 CLI RX|Type 'help' for more info.
**   v1    0.1 Stop
**** v1    0.1 CLI TX|stop
***  v1    0.1 CLI RX  300
**** v1    0.1 CLI RX|Child in state stopped
**** v1    0.1 CLI TX|status
***  v1    0.1 CLI RX  200
**** v1    0.1 CLI RX|Child in state stopped
**** v1    0.1 STDOUT poll 0x10
**   v1    0.1 R 84922 Status: 0000 (u 0.004000 s 0.017000)
*    diag  0.0 ............................................................
#    top  TEST ../../../bin/varnishtest/tests/r00655.vtc TIMED OUT (kill -9)
#    top  TEST ../../../bin/varnishtest/tests/r00655.vtc FAILED (60.002) signal=9

1 @ Linux 3.10.0 x86_64 1.02 mblissett

*    top   0.0 TEST ../../../bin/varnishtest/tests/r00655.vtc starting
[...]
*    top   0.0 TEST Test nested /*...*/ comments
[...]
**** v1    0.1 CLI TX|
**** v1    0.1 CLI TX|
**** v1    0.1 CLI TX|\t/* foo
**** v1    0.1 CLI TX|\t\t/* bar
**** v1    0.1 CLI TX|\t*/
**** v1    0.1 CLI TX|
**** v1    0.1 CLI TX|%XJEIFLH|)Xspa8P
***  v1    0.1 CLI RX  106
**** v1    0.1 CLI RX|Message from VCC-compiler:
**** v1    0.1 CLI RX|/* ... */ comment contains /*
**** v1    0.1 CLI RX|('<vcl.inline>' Line 4 Pos 9)
**** v1    0.1 CLI RX|        /* foo
**** v1    0.1 CLI RX|--------##----
**** v1    0.1 CLI RX|
**** v1    0.1 CLI RX|('<vcl.inline>' Line 5 Pos 17)
**** v1    0.1 CLI RX|                /* bar
**** v1    0.1 CLI RX|----------------##----
**** v1    0.1 CLI RX|
**** v1    0.1 CLI RX|Running VCC-compiler failed, exited with 2
**** v1    0.1 CLI RX|VCL compilation failed
**   v1    0.1 VCL compilation failed (as expected)
***  v1    0.1 Found expected string: ("/* ... */ comment contains /*")
*    top   0.1 RESETTING after ../../../bin/varnishtest/tests/r00655.vtc
**   v1    0.1 Wait
**** v1    0.1 CLI TX|backend.list
***  v1    0.2 CLI RX  101
**** v1    0.2 CLI RX|Unknown request in manager process (child not running).
**** v1    0.2 CLI RX|Type 'help' for more info.
**   v1    0.2 Stop
**** v1    0.2 CLI TX|stop
***  v1    0.2 CLI RX  300
**** v1    0.2 CLI RX|Child in state stopped
**** v1    0.2 CLI TX|status
***  v1    0.2 CLI RX  200
**** v1    0.2 CLI RX|Child in state stopped
**** v1    0.2 STDOUT poll 0x10
**   v1    0.2 R 16019 Status: 0000 (u 0.002372 s 0.016068)
*    diag  0.0 ............................................................
#    top  TEST ../../../bin/varnishtest/tests/r00655.vtc TIMED OUT (kill -9)
#    top  TEST ../../../bin/varnishtest/tests/r00655.vtc FAILED (60.001) signal=9

1 @ SunOS 5.11 i86pc 1.04 32_sun12.4 uplex

*    top   0.0 TEST ../../../bin/varnishtest/tests/r00655.vtc starting
[...]
*    top   0.0 TEST Test nested /*...*/ comments
[...]
**** v1    0.1 CLI TX|
**** v1    0.1 CLI TX|\t/* foo
**** v1    0.1 CLI TX|\t\t/* bar
**** v1    0.1 CLI TX|\t*/
**** v1    0.1 CLI TX|
**** v1    0.1 CLI TX|%XJEIFLH|)Xspa8P
***  v1    0.1 CLI RX  106
**** v1    0.1 CLI RX|Message from VCC-compiler:
**** v1    0.1 CLI RX|Security: Privilege proc_setid missing, will not change uid/gid
**** v1    0.1 CLI RX|/* ... */ comment contains /*
**** v1    0.1 CLI RX|('<vcl.inline>' Line 4 Pos 9)
**** v1    0.1 CLI RX|        /* foo
**** v1    0.1 CLI RX|--------##----
**** v1    0.1 CLI RX|
**** v1    0.1 CLI RX|('<vcl.inline>' Line 5 Pos 17)
**** v1    0.1 CLI RX|                /* bar
**** v1    0.1 CLI RX|----------------##----
**** v1    0.1 CLI RX|
**** v1    0.1 CLI RX|Running VCC-compiler failed, exited with 2
**** v1    0.1 CLI RX|VCL compilation failed
**   v1    0.1 VCL compilation failed (as expected)
***  v1    0.1 Found expected string: ("/* ... */ comment contains /*")
*    top   0.1 RESETTING after ../../../bin/varnishtest/tests/r00655.vtc
**   v1    0.1 Wait
**** v1    0.1 CLI TX|backend.list
***  v1    0.1 CLI RX  101
**** v1    0.1 CLI RX|Unknown request in manager process (child not running).
**** v1    0.1 CLI RX|Type 'help' for more info.
**   v1    0.1 Stop
**** v1    0.1 CLI TX|stop
***  v1    0.1 CLI RX  300
**** v1    0.1 CLI RX|Child in state stopped
**** v1    0.1 CLI TX|status
***  v1    0.1 CLI RX  200
**** v1    0.1 CLI RX|Child in state stopped
**** v1    0.1 STDOUT poll 0x10
**   v1    0.1 R 87566 Status: 0000 (u 0.004000 s 0.017000)
*    diag  0.0 ............................................................
#    top  TEST ../../../bin/varnishtest/tests/r00655.vtc TIMED OUT (kill -9)
#    top  TEST ../../../bin/varnishtest/tests/r00655.vtc FAILED (60.002) signal=9

1 @ Linux 3.10.0 x86_64 1.02 mblissett

*    top   0.0 TEST ../../../bin/varnishtest/tests/r00655.vtc starting
[...]
*    top   0.0 TEST Test nested /*...*/ comments
[...]
**** v1    0.1 CLI TX|
**** v1    0.1 CLI TX|
**** v1    0.1 CLI TX|\t/* foo
**** v1    0.1 CLI TX|\t\t/* bar
**** v1    0.1 CLI TX|\t*/
**** v1    0.1 CLI TX|
**** v1    0.1 CLI TX|%XJEIFLH|)Xspa8P
***  v1    0.1 CLI RX  106
**** v1    0.1 CLI RX|Message from VCC-compiler:
**** v1    0.1 CLI RX|/* ... */ comment contains /*
**** v1    0.1 CLI RX|('<vcl.inline>' Line 4 Pos 9)
**** v1    0.1 CLI RX|        /* foo
**** v1    0.1 CLI RX|--------##----
**** v1    0.1 CLI RX|
**** v1    0.1 CLI RX|('<vcl.inline>' Line 5 Pos 17)
**** v1    0.1 CLI RX|                /* bar
**** v1    0.1 CLI RX|----------------##----
**** v1    0.1 CLI RX|
**** v1    0.1 CLI RX|Running VCC-compiler failed, exited with 2
**** v1    0.1 CLI RX|VCL compilation failed
**   v1    0.1 VCL compilation failed (as expected)
***  v1    0.1 Found expected string: ("/* ... */ comment contains /*")
*    top   0.1 RESETTING after ../../../bin/varnishtest/tests/r00655.vtc
**   v1    0.1 Wait
**** v1    0.1 CLI TX|backend.list
***  v1    0.2 CLI RX  101
**** v1    0.2 CLI RX|Unknown request in manager process (child not running).
**** v1    0.2 CLI RX|Type 'help' for more info.
**   v1    0.2 Stop
**** v1    0.2 CLI TX|stop
***  v1    0.2 CLI RX  300
**** v1    0.2 CLI RX|Child in state stopped
**** v1    0.2 CLI TX|status
***  v1    0.2 CLI RX  200
**** v1    0.2 CLI RX|Child in state stopped
**** v1    0.2 STDOUT poll 0x10
**   v1    0.2 R 5763 Status: 0000 (u 0.004818 s 0.013911)
*    diag  0.0 ............................................................
#    top  TEST ../../../bin/varnishtest/tests/r00655.vtc TIMED OUT (kill -9)
#    top  TEST ../../../bin/varnishtest/tests/r00655.vtc FAILED (60.001) signal=9

1 @ Linux 3.10.0 x86_64 1.02 mblissett

*    top   0.0 TEST ../../../bin/varnishtest/tests/r00655.vtc starting
[...]
*    top   0.0 TEST Test nested /*...*/ comments
[...]
**** v1    0.1 CLI TX|
**** v1    0.1 CLI TX|
**** v1    0.1 CLI TX|\t/* foo
**** v1    0.1 CLI TX|\t\t/* bar
**** v1    0.1 CLI TX|\t*/
**** v1    0.1 CLI TX|
**** v1    0.1 CLI TX|%XJEIFLH|)Xspa8P
***  v1    0.1 CLI RX  106
**** v1    0.1 CLI RX|Message from VCC-compiler:
**** v1    0.1 CLI RX|/* ... */ comment contains /*
**** v1    0.1 CLI RX|('<vcl.inline>' Line 4 Pos 9)
**** v1    0.1 CLI RX|        /* foo
**** v1    0.1 CLI RX|--------##----
**** v1    0.1 CLI RX|
**** v1    0.1 CLI RX|('<vcl.inline>' Line 5 Pos 17)
**** v1    0.1 CLI RX|                /* bar
**** v1    0.1 CLI RX|----------------##----
**** v1    0.1 CLI RX|
**** v1    0.1 CLI RX|Running VCC-compiler failed, exited with 2
**** v1    0.1 CLI RX|VCL compilation failed
**   v1    0.1 VCL compilation failed (as expected)
***  v1    0.1 Found expected string: ("/* ... */ comment contains /*")
*    top   0.1 RESETTING after ../../../bin/varnishtest/tests/r00655.vtc
**   v1    0.1 Wait
**** v1    0.1 CLI TX|backend.list
***  v1    0.2 CLI RX  101
**** v1    0.2 CLI RX|Unknown request in manager process (child not running).
**** v1    0.2 CLI RX|Type 'help' for more info.
**   v1    0.2 Stop
**** v1    0.2 CLI TX|stop
***  v1    0.2 CLI RX  300
**** v1    0.2 CLI RX|Child in state stopped
**** v1    0.2 CLI TX|status
***  v1    0.2 CLI RX  200
**** v1    0.2 CLI RX|Child in state stopped
**** v1    0.2 STDOUT poll 0x10
**   v1    0.2 R 19204 Status: 0000 (u 0.003230 s 0.018237)
*    diag  0.0 ............................................................
#    top  TEST ../../../bin/varnishtest/tests/r00655.vtc TIMED OUT (kill -9)
#    top  TEST ../../../bin/varnishtest/tests/r00655.vtc FAILED (60.001) signal=9

1 @ SunOS 5.11 i86pc 1.04 64_sun12.4 uplex

*    top   0.0 TEST ../../../bin/varnishtest/tests/r00655.vtc starting
[...]
*    top   0.0 TEST Test nested /*...*/ comments
[...]
**** v1    0.1 CLI TX|
**** v1    0.1 CLI TX|\t/* foo
**** v1    0.1 CLI TX|\t\t/* bar
**** v1    0.1 CLI TX|\t*/
**** v1    0.1 CLI TX|
**** v1    0.1 CLI TX|%XJEIFLH|)Xspa8P
***  v1    0.1 CLI RX  106
**** v1    0.1 CLI RX|Message from VCC-compiler:
**** v1    0.1 CLI RX|Security: Privilege proc_setid missing, will not change uid/gid
**** v1    0.1 CLI RX|/* ... */ comment contains /*
**** v1    0.1 CLI RX|('<vcl.inline>' Line 4 Pos 9)
**** v1    0.1 CLI RX|        /* foo
**** v1    0.1 CLI RX|--------##----
**** v1    0.1 CLI RX|
**** v1    0.1 CLI RX|('<vcl.inline>' Line 5 Pos 17)
**** v1    0.1 CLI RX|                /* bar
**** v1    0.1 CLI RX|----------------##----
**** v1    0.1 CLI RX|
**** v1    0.1 CLI RX|Running VCC-compiler failed, exited with 2
**** v1    0.1 CLI RX|VCL compilation failed
**   v1    0.1 VCL compilation failed (as expected)
***  v1    0.1 Found expected string: ("/* ... */ comment contains /*")
*    top   0.1 RESETTING after ../../../bin/varnishtest/tests/r00655.vtc
**   v1    0.1 Wait
**** v1    0.1 CLI TX|backend.list
***  v1    0.1 CLI RX  101
**** v1    0.1 CLI RX|Unknown request in manager process (child not running).
**** v1    0.1 CLI RX|Type 'help' for more info.
**   v1    0.1 Stop
**** v1    0.1 CLI TX|stop
***  v1    0.1 CLI RX  300
**** v1    0.1 CLI RX|Child in state stopped
**** v1    0.1 CLI TX|status
***  v1    0.1 CLI RX  200
**** v1    0.1 CLI RX|Child in state stopped
**** v1    0.1 STDOUT poll 0x10
**   v1    0.1 R 15990 Status: 0000 (u 0.006000 s 0.022000)
*    diag  0.0 ............................................................
#    top  TEST ../../../bin/varnishtest/tests/r00655.vtc TIMED OUT (kill -9)
#    top  TEST ../../../bin/varnishtest/tests/r00655.vtc FAILED (60.004) signal=9

1 @ SunOS 5.11 i86pc 1.04 32_sun12.4 uplex

*    top   0.0 TEST ../../../bin/varnishtest/tests/r00655.vtc starting
[...]
*    top   0.0 TEST Test nested /*...*/ comments
[...]
**** v1    0.1 CLI TX|
**** v1    0.1 CLI TX|\t/* foo
**** v1    0.1 CLI TX|\t\t/* bar
**** v1    0.1 CLI TX|\t*/
**** v1    0.1 CLI TX|
**** v1    0.1 CLI TX|%XJEIFLH|)Xspa8P
***  v1    0.1 CLI RX  106
**** v1    0.1 CLI RX|Message from VCC-compiler:
**** v1    0.1 CLI RX|Security: Privilege proc_setid missing, will not change uid/gid
**** v1    0.1 CLI RX|/* ... */ comment contains /*
**** v1    0.1 CLI RX|('<vcl.inline>' Line 4 Pos 9)
**** v1    0.1 CLI RX|        /* foo
**** v1    0.1 CLI RX|--------##----
**** v1    0.1 CLI RX|
**** v1    0.1 CLI RX|('<vcl.inline>' Line 5 Pos 17)
**** v1    0.1 CLI RX|                /* bar
**** v1    0.1 CLI RX|----------------##----
**** v1    0.1 CLI RX|
**** v1    0.1 CLI RX|Running VCC-compiler failed, exited with 2
**** v1    0.1 CLI RX|VCL compilation failed
**   v1    0.1 VCL compilation failed (as expected)
***  v1    0.1 Found expected string: ("/* ... */ comment contains /*")
*    top   0.1 RESETTING after ../../../bin/varnishtest/tests/r00655.vtc
**   v1    0.1 Wait
**** v1    0.1 CLI TX|backend.list
***  v1    0.1 CLI RX  101
**** v1    0.1 CLI RX|Unknown request in manager process (child not running).
**** v1    0.1 CLI RX|Type 'help' for more info.
**   v1    0.1 Stop
**** v1    0.1 CLI TX|stop
***  v1    0.1 CLI RX  300
**** v1    0.1 CLI RX|Child in state stopped
**** v1    0.1 CLI TX|status
***  v1    0.1 CLI RX  200
**** v1    0.1 CLI RX|Child in state stopped
**** v1    0.1 STDOUT poll 0x10
**   v1    0.1 R 80371 Status: 0000 (u 0.004000 s 0.017000)
*    diag  0.0 ............................................................
#    top  TEST ../../../bin/varnishtest/tests/r00655.vtc TIMED OUT (kill -9)
#    top  TEST ../../../bin/varnishtest/tests/r00655.vtc FAILED (60.002) signal=9

1 @ SunOS 5.11 i86pc 1.04 32_sun12.4 uplex

*    top   0.0 TEST ../../../bin/varnishtest/tests/r00655.vtc starting
[...]
*    top   0.0 TEST Test nested /*...*/ comments
[...]
**** v1    0.1 CLI TX|
**** v1    0.1 CLI TX|\t/* foo
**** v1    0.1 CLI TX|\t\t/* bar
**** v1    0.1 CLI TX|\t*/
**** v1    0.1 CLI TX|
**** v1    0.1 CLI TX|%XJEIFLH|)Xspa8P
***  v1    0.1 CLI RX  106
**** v1    0.1 CLI RX|Message from VCC-compiler:
**** v1    0.1 CLI RX|Security: Privilege proc_setid missing, will not change uid/gid
**** v1    0.1 CLI RX|/* ... */ comment contains /*
**** v1    0.1 CLI RX|('<vcl.inline>' Line 4 Pos 9)
**** v1    0.1 CLI RX|        /* foo
**** v1    0.1 CLI RX|--------##----
**** v1    0.1 CLI RX|
**** v1    0.1 CLI RX|('<vcl.inline>' Line 5 Pos 17)
**** v1    0.1 CLI RX|                /* bar
**** v1    0.1 CLI RX|----------------##----
**** v1    0.1 CLI RX|
**** v1    0.1 CLI RX|Running VCC-compiler failed, exited with 2
**** v1    0.1 CLI RX|VCL compilation failed
**   v1    0.1 VCL compilation failed (as expected)
***  v1    0.1 Found expected string: ("/* ... */ comment contains /*")
*    top   0.1 RESETTING after ../../../bin/varnishtest/tests/r00655.vtc
**   v1    0.1 Wait
**** v1    0.1 CLI TX|backend.list
***  v1    0.1 CLI RX  101
**** v1    0.1 CLI RX|Unknown request in manager process (child not running).
**** v1    0.1 CLI RX|Type 'help' for more info.
**   v1    0.1 Stop
**** v1    0.1 CLI TX|stop
***  v1    0.1 CLI RX  300
**** v1    0.1 CLI RX|Child in state stopped
**** v1    0.1 CLI TX|status
***  v1    0.1 CLI RX  200
**** v1    0.1 CLI RX|Child in state stopped
**** v1    0.1 STDOUT poll 0x10
**   v1    0.1 R 65104 Status: 0000 (u 0.004000 s 0.017000)
*    diag  0.0 ............................................................
#    top  TEST ../../../bin/varnishtest/tests/r00655.vtc TIMED OUT (kill -9)
#    top  TEST ../../../bin/varnishtest/tests/r00655.vtc FAILED (60.002) signal=9

1 @ Ubuntu LTS i686 1.04 fgs

*    top   0.0 TEST ../../../bin/varnishtest/tests/r00655.vtc starting
[...]
*    top   0.0 TEST Test nested /*...*/ comments
[...]
**** v1    0.1 CLI TX|
**** v1    0.1 CLI TX|
**** v1    0.1 CLI TX|\t/* foo
**** v1    0.1 CLI TX|\t\t/* bar
**** v1    0.1 CLI TX|\t*/
**** v1    0.1 CLI TX|
**** v1    0.1 CLI TX|%XJEIFLH|)Xspa8P
***  v1    0.1 CLI RX  106
**** v1    0.1 CLI RX|Message from VCC-compiler:
**** v1    0.1 CLI RX|/* ... */ comment contains /*
**** v1    0.1 CLI RX|('<vcl.inline>' Line 4 Pos 9)
**** v1    0.1 CLI RX|        /* foo
**** v1    0.1 CLI RX|--------##----
**** v1    0.1 CLI RX|
**** v1    0.1 CLI RX|('<vcl.inline>' Line 5 Pos 17)
**** v1    0.1 CLI RX|                /* bar
**** v1    0.1 CLI RX|----------------##----
**** v1    0.1 CLI RX|
**** v1    0.1 CLI RX|Running VCC-compiler failed, exited with 2
**** v1    0.1 CLI RX|VCL compilation failed
**   v1    0.1 VCL compilation failed (as expected)
***  v1    0.1 Found expected string: ("/* ... */ comment contains /*")
*    top   0.1 RESETTING after ../../../bin/varnishtest/tests/r00655.vtc
**   v1    0.1 Wait
**** v1    0.1 CLI TX|backend.list
***  v1    0.1 CLI RX  101
**** v1    0.1 CLI RX|Unknown request in manager process (child not running).
**** v1    0.1 CLI RX|Type 'help' for more info.
**   v1    0.1 Stop
**** v1    0.1 CLI TX|stop
***  v1    0.2 CLI RX  300
**** v1    0.2 CLI RX|Child in state stopped
**** v1    0.2 CLI TX|status
***  v1    0.2 CLI RX  200
**** v1    0.2 CLI RX|Child in state stopped
**** v1    0.2 STDOUT poll 0x10
**   v1    0.2 R 5205 Status: 0000 (u 0.000000 s 0.004000)
*    diag  0.0 ............................................................
#    top  TEST ../../../bin/varnishtest/tests/r00655.vtc TIMED OUT (kill -9)
#    top  TEST ../../../bin/varnishtest/tests/r00655.vtc FAILED (60.001) signal=9

1 @ Ubuntu LTS i686 1.04 fgs

*    top   0.0 TEST ../../../bin/varnishtest/tests/r00655.vtc starting
[...]
*    top   0.0 TEST Test nested /*...*/ comments
[...]
**** v1    0.1 CLI TX|
**** v1    0.1 CLI TX|
**** v1    0.1 CLI TX|\t/* foo
**** v1    0.1 CLI TX|\t\t/* bar
**** v1    0.1 CLI TX|\t*/
**** v1    0.1 CLI TX|
**** v1    0.1 CLI TX|%XJEIFLH|)Xspa8P
***  v1    0.1 CLI RX  106
**** v1    0.1 CLI RX|Message from VCC-compiler:
**** v1    0.1 CLI RX|/* ... */ comment contains /*
**** v1    0.1 CLI RX|('<vcl.inline>' Line 4 Pos 9)
**** v1    0.1 CLI RX|        /* foo
**** v1    0.1 CLI RX|--------##----
**** v1    0.1 CLI RX|
**** v1    0.1 CLI RX|('<vcl.inline>' Line 5 Pos 17)
**** v1    0.1 CLI RX|                /* bar
**** v1    0.1 CLI RX|----------------##----
**** v1    0.1 CLI RX|
**** v1    0.1 CLI RX|Running VCC-compiler failed, exited with 2
**** v1    0.1 CLI RX|VCL compilation failed
**   v1    0.1 VCL compilation failed (as expected)
***  v1    0.1 Found expected string: ("/* ... */ comment contains /*")
*    top   0.1 RESETTING after ../../../bin/varnishtest/tests/r00655.vtc
**   v1    0.1 Wait
**** v1    0.1 CLI TX|backend.list
***  v1    0.1 CLI RX  101
**** v1    0.1 CLI RX|Unknown request in manager process (child not running).
**** v1    0.1 CLI RX|Type 'help' for more info.
**   v1    0.1 Stop
**** v1    0.1 CLI TX|stop
***  v1    0.2 CLI RX  300
**** v1    0.2 CLI RX|Child in state stopped
**** v1    0.2 CLI TX|status
***  v1    0.2 CLI RX  200
**** v1    0.2 CLI RX|Child in state stopped
**** v1    0.2 STDOUT poll 0x10
**   v1    0.2 R 8203 Status: 0000 (u 0.000000 s 0.004000)
*    diag  0.0 ............................................................
#    top  TEST ../../../bin/varnishtest/tests/r00655.vtc TIMED OUT (kill -9)
#    top  TEST ../../../bin/varnishtest/tests/r00655.vtc FAILED (60.000) signal=9

1 @ Ubuntu LTS i686 1.04 fgs

*    top   0.0 TEST ../../../bin/varnishtest/tests/r00655.vtc starting
[...]
*    top   0.0 TEST Test nested /*...*/ comments
[...]
**** v1    0.1 CLI TX|
**** v1    0.1 CLI TX|
**** v1    0.1 CLI TX|\t/* foo
**** v1    0.1 CLI TX|\t\t/* bar
**** v1    0.1 CLI TX|\t*/
**** v1    0.1 CLI TX|
**** v1    0.1 CLI TX|%XJEIFLH|)Xspa8P
***  v1    0.1 CLI RX  106
**** v1    0.1 CLI RX|Message from VCC-compiler:
**** v1    0.1 CLI RX|/* ... */ comment contains /*
**** v1    0.1 CLI RX|('<vcl.inline>' Line 4 Pos 9)
**** v1    0.1 CLI RX|        /* foo
**** v1    0.1 CLI RX|--------##----
**** v1    0.1 CLI RX|
**** v1    0.1 CLI RX|('<vcl.inline>' Line 5 Pos 17)
**** v1    0.1 CLI RX|                /* bar
**** v1    0.1 CLI RX|----------------##----
**** v1    0.1 CLI RX|
**** v1    0.1 CLI RX|Running VCC-compiler failed, exited with 2
**** v1    0.1 CLI RX|VCL compilation failed
**   v1    0.1 VCL compilation failed (as expected)
***  v1    0.1 Found expected string: ("/* ... */ comment contains /*")
*    top   0.1 RESETTING after ../../../bin/varnishtest/tests/r00655.vtc
**   v1    0.1 Wait
**** v1    0.1 CLI TX|backend.list
***  v1    0.1 CLI RX  101
**** v1    0.1 CLI RX|Unknown request in manager process (child not running).
**** v1    0.1 CLI RX|Type 'help' for more info.
**   v1    0.1 Stop
**** v1    0.1 CLI TX|stop
***  v1    0.2 CLI RX  300
**** v1    0.2 CLI RX|Child in state stopped
**** v1    0.2 CLI TX|status
***  v1    0.2 CLI RX  200
**** v1    0.2 CLI RX|Child in state stopped
**** v1    0.2 STDOUT poll 0x10
**   v1    0.2 R 20028 Status: 0000 (u 0.000000 s 0.004000)
*    diag  0.0 ............................................................
#    top  TEST ../../../bin/varnishtest/tests/r00655.vtc TIMED OUT (kill -9)
#    top  TEST ../../../bin/varnishtest/tests/r00655.vtc FAILED (60.001) signal=9

1 @ Linux 3.10.0 x86_64 1.02 mblissett

*    top   0.0 TEST ../../../bin/varnishtest/tests/r00655.vtc starting
[...]
*    top   0.0 TEST Test nested /*...*/ comments
[...]
**** v1    0.1 CLI TX|
**** v1    0.1 CLI TX|
**** v1    0.1 CLI TX|\t/* foo
**** v1    0.1 CLI TX|\t\t/* bar
**** v1    0.1 CLI TX|\t*/
**** v1    0.1 CLI TX|
**** v1    0.1 CLI TX|%XJEIFLH|)Xspa8P
***  v1    0.1 CLI RX  106
**** v1    0.1 CLI RX|Message from VCC-compiler:
**** v1    0.1 CLI RX|/* ... */ comment contains /*
**** v1    0.1 CLI RX|('<vcl.inline>' Line 4 Pos 9)
**** v1    0.1 CLI RX|        /* foo
**** v1    0.1 CLI RX|--------##----
**** v1    0.1 CLI RX|
**** v1    0.1 CLI RX|('<vcl.inline>' Line 5 Pos 17)
**** v1    0.1 CLI RX|                /* bar
**** v1    0.1 CLI RX|----------------##----
**** v1    0.1 CLI RX|
**** v1    0.1 CLI RX|Running VCC-compiler failed, exited with 2
**** v1    0.1 CLI RX|VCL compilation failed
**   v1    0.1 VCL compilation failed (as expected)
***  v1    0.1 Found expected string: ("/* ... */ comment contains /*")
*    top   0.1 RESETTING after ../../../bin/varnishtest/tests/r00655.vtc
**   v1    0.1 Wait
**** v1    0.1 CLI TX|backend.list
***  v1    0.2 CLI RX  101
**** v1    0.2 CLI RX|Unknown request in manager process (child not running).
**** v1    0.2 CLI RX|Type 'help' for more info.
**   v1    0.2 Stop
**** v1    0.2 CLI TX|stop
***  v1    0.2 CLI RX  300
**** v1    0.2 CLI RX|Child in state stopped
**** v1    0.2 CLI TX|status
***  v1    0.2 CLI RX  200
**** v1    0.2 CLI RX|Child in state stopped
**** v1    0.2 STDOUT poll 0x10
**   v1    0.2 R 8887 Status: 0000 (u 0.003003 s 0.015771)
*    diag  0.0 ............................................................
#    top  TEST ../../../bin/varnishtest/tests/r00655.vtc TIMED OUT (kill -9)
#    top  TEST ../../../bin/varnishtest/tests/r00655.vtc FAILED (60.001) signal=9

1 @ SunOS 5.11 i86pc 1.04 32_sun12.4 uplex

*    top   0.0 TEST ../../../bin/varnishtest/tests/r00655.vtc starting
[...]
*    top   0.0 TEST Test nested /*...*/ comments
[...]
**** v1    0.1 CLI TX|
**** v1    0.1 CLI TX|\t/* foo
**** v1    0.1 CLI TX|\t\t/* bar
**** v1    0.1 CLI TX|\t*/
**** v1    0.1 CLI TX|
**** v1    0.1 CLI TX|%XJEIFLH|)Xspa8P
***  v1    0.1 CLI RX  106
**** v1    0.1 CLI RX|Message from VCC-compiler:
**** v1    0.1 CLI RX|Security: Privilege proc_setid missing, will not change uid/gid
**** v1    0.1 CLI RX|/* ... */ comment contains /*
**** v1    0.1 CLI RX|('<vcl.inline>' Line 4 Pos 9)
**** v1    0.1 CLI RX|        /* foo
**** v1    0.1 CLI RX|--------##----
**** v1    0.1 CLI RX|
**** v1    0.1 CLI RX|('<vcl.inline>' Line 5 Pos 17)
**** v1    0.1 CLI RX|                /* bar
**** v1    0.1 CLI RX|----------------##----
**** v1    0.1 CLI RX|
**** v1    0.1 CLI RX|Running VCC-compiler failed, exited with 2
**** v1    0.1 CLI RX|VCL compilation failed
**   v1    0.1 VCL compilation failed (as expected)
***  v1    0.1 Found expected string: ("/* ... */ comment contains /*")
*    top   0.1 RESETTING after ../../../bin/varnishtest/tests/r00655.vtc
**   v1    0.1 Wait
**** v1    0.1 CLI TX|backend.list
***  v1    0.1 CLI RX  101
**** v1    0.1 CLI RX|Unknown request in manager process (child not running).
**** v1    0.1 CLI RX|Type 'help' for more info.
**   v1    0.1 Stop
**** v1    0.1 CLI TX|stop
***  v1    0.1 CLI RX  300
**** v1    0.1 CLI RX|Child in state stopped
**** v1    0.1 CLI TX|status
***  v1    0.1 CLI RX  200
**** v1    0.1 CLI RX|Child in state stopped
**** v1    0.1 STDOUT poll 0x10
**   v1    0.1 R 47176 Status: 0000 (u 0.004000 s 0.017000)
*    diag  0.0 ............................................................
#    top  TEST ../../../bin/varnishtest/tests/r00655.vtc TIMED OUT (kill -9)
#    top  TEST ../../../bin/varnishtest/tests/r00655.vtc FAILED (60.002) signal=9

1 @ SunOS 5.11 i86pc 1.04 32_sun12.4 uplex

*    top   0.0 TEST ../../../bin/varnishtest/tests/r00655.vtc starting
[...]
*    top   0.0 TEST Test nested /*...*/ comments
[...]
**** v1    0.1 CLI TX|
**** v1    0.1 CLI TX|\t/* foo
**** v1    0.1 CLI TX|\t\t/* bar
**** v1    0.1 CLI TX|\t*/
**** v1    0.1 CLI TX|
**** v1    0.1 CLI TX|%XJEIFLH|)Xspa8P
***  v1    0.1 CLI RX  106
**** v1    0.1 CLI RX|Message from VCC-compiler:
**** v1    0.1 CLI RX|Security: Privilege proc_setid missing, will not change uid/gid
**** v1    0.1 CLI RX|/* ... */ comment contains /*
**** v1    0.1 CLI RX|('<vcl.inline>' Line 4 Pos 9)
**** v1    0.1 CLI RX|        /* foo
**** v1    0.1 CLI RX|--------##----
**** v1    0.1 CLI RX|
**** v1    0.1 CLI RX|('<vcl.inline>' Line 5 Pos 17)
**** v1    0.1 CLI RX|                /* bar
**** v1    0.1 CLI RX|----------------##----
**** v1    0.1 CLI RX|
**** v1    0.1 CLI RX|Running VCC-compiler failed, exited with 2
**** v1    0.1 CLI RX|VCL compilation failed
**   v1    0.1 VCL compilation failed (as expected)
***  v1    0.1 Found expected string: ("/* ... */ comment contains /*")
*    top   0.1 RESETTING after ../../../bin/varnishtest/tests/r00655.vtc
**   v1    0.1 Wait
**** v1    0.1 CLI TX|backend.list
***  v1    0.1 CLI RX  101
**** v1    0.1 CLI RX|Unknown request in manager process (child not running).
**** v1    0.1 CLI RX|Type 'help' for more info.
**   v1    0.1 Stop
**** v1    0.1 CLI TX|stop
***  v1    0.1 CLI RX  300
**** v1    0.1 CLI RX|Child in state stopped
**** v1    0.1 CLI TX|status
***  v1    0.1 CLI RX  200
**** v1    0.1 CLI RX|Child in state stopped
**** v1    0.1 STDOUT poll 0x10
**   v1    0.1 R 98726 Status: 0000 (u 0.005000 s 0.021000)
*    diag  0.0 ............................................................
#    top  TEST ../../../bin/varnishtest/tests/r00655.vtc TIMED OUT (kill -9)
#    top  TEST ../../../bin/varnishtest/tests/r00655.vtc FAILED (60.002) signal=9

1 @ Ubuntu LTS i686 1.04 fgs

*    top   0.0 TEST ../../../bin/varnishtest/tests/r00655.vtc starting
[...]
*    top   0.0 TEST Test nested /*...*/ comments
[...]
**** v1    0.1 CLI TX|
**** v1    0.1 CLI TX|
**** v1    0.1 CLI TX|\t/* foo
**** v1    0.1 CLI TX|\t\t/* bar
**** v1    0.1 CLI TX|\t*/
**** v1    0.1 CLI TX|
**** v1    0.1 CLI TX|%XJEIFLH|)Xspa8P
***  v1    0.1 CLI RX  106
**** v1    0.1 CLI RX|Message from VCC-compiler:
**** v1    0.1 CLI RX|/* ... */ comment contains /*
**** v1    0.1 CLI RX|('<vcl.inline>' Line 4 Pos 9)
**** v1    0.1 CLI RX|        /* foo
**** v1    0.1 CLI RX|--------##----
**** v1    0.1 CLI RX|
**** v1    0.1 CLI RX|('<vcl.inline>' Line 5 Pos 17)
**** v1    0.1 CLI RX|                /* bar
**** v1    0.1 CLI RX|----------------##----
**** v1    0.1 CLI RX|
**** v1    0.1 CLI RX|Running VCC-compiler failed, exited with 2
**** v1    0.1 CLI RX|VCL compilation failed
**   v1    0.1 VCL compilation failed (as expected)
***  v1    0.1 Found expected string: ("/* ... */ comment contains /*")
*    top   0.1 RESETTING after ../../../bin/varnishtest/tests/r00655.vtc
**   v1    0.1 Wait
**** v1    0.1 CLI TX|backend.list
***  v1    0.1 CLI RX  101
**** v1    0.1 CLI RX|Unknown request in manager process (child not running).
**** v1    0.1 CLI RX|Type 'help' for more info.
**   v1    0.1 Stop
**** v1    0.1 CLI TX|stop
***  v1    0.2 CLI RX  300
**** v1    0.2 CLI RX|Child in state stopped
**** v1    0.2 CLI TX|status
***  v1    0.2 CLI RX  200
**** v1    0.2 CLI RX|Child in state stopped
**** v1    0.2 STDOUT poll 0x10
**   v1    0.2 R 14130 Status: 0000 (u 0.000000 s 0.004000)
*    diag  0.0 ............................................................
#    top  TEST ../../../bin/varnishtest/tests/r00655.vtc TIMED OUT (kill -9)
#    top  TEST ../../../bin/varnishtest/tests/r00655.vtc FAILED (60.001) signal=9

1 @ SunOS 5.11 i86pc 1.04 32_sun12.4 uplex

*    top   0.0 TEST ../../../bin/varnishtest/tests/r00655.vtc starting
[...]
*    top   0.0 TEST Test nested /*...*/ comments
[...]
**** v1    0.1 CLI TX|
**** v1    0.1 CLI TX|\t/* foo
**** v1    0.1 CLI TX|\t\t/* bar
**** v1    0.1 CLI TX|\t*/
**** v1    0.1 CLI TX|
**** v1    0.1 CLI TX|%XJEIFLH|)Xspa8P
***  v1    0.1 CLI RX  106
**** v1    0.1 CLI RX|Message from VCC-compiler:
**** v1    0.1 CLI RX|Security: Privilege proc_setid missing, will not change uid/gid
**** v1    0.1 CLI RX|/* ... */ comment contains /*
**** v1    0.1 CLI RX|('<vcl.inline>' Line 4 Pos 9)
**** v1    0.1 CLI RX|        /* foo
**** v1    0.1 CLI RX|--------##----
**** v1    0.1 CLI RX|
**** v1    0.1 CLI RX|('<vcl.inline>' Line 5 Pos 17)
**** v1    0.1 CLI RX|                /* bar
**** v1    0.1 CLI RX|----------------##----
**** v1    0.1 CLI RX|
**** v1    0.1 CLI RX|Running VCC-compiler failed, exited with 2
**** v1    0.1 CLI RX|VCL compilation failed
**   v1    0.1 VCL compilation failed (as expected)
***  v1    0.1 Found expected string: ("/* ... */ comment contains /*")
*    top   0.1 RESETTING after ../../../bin/varnishtest/tests/r00655.vtc
**   v1    0.1 Wait
**** v1    0.1 CLI TX|backend.list
***  v1    0.1 CLI RX  101
**** v1    0.1 CLI RX|Unknown request in manager process (child not running).
**** v1    0.1 CLI RX|Type 'help' for more info.
**   v1    0.1 Stop
**** v1    0.1 CLI TX|stop
***  v1    0.1 CLI RX  300
**** v1    0.1 CLI RX|Child in state stopped
**** v1    0.1 CLI TX|status
***  v1    0.1 CLI RX  200
**** v1    0.1 CLI RX|Child in state stopped
**** v1    0.1 STDOUT poll 0x10
**   v1    0.1 R 41583 Status: 0000 (u 0.004000 s 0.016000)
*    diag  0.0 ............................................................
#    top  TEST ../../../bin/varnishtest/tests/r00655.vtc TIMED OUT (kill -9)
#    top  TEST ../../../bin/varnishtest/tests/r00655.vtc FAILED (60.002) signal=9

1 @ Ubuntu LTS i686 1.04 fgs

*    top   0.0 TEST ../../../bin/varnishtest/tests/r00655.vtc starting
[...]
*    top   0.0 TEST Test nested /*...*/ comments
[...]
**** v1    0.1 CLI TX|
**** v1    0.1 CLI TX|
**** v1    0.1 CLI TX|\t/* foo
**** v1    0.1 CLI TX|\t\t/* bar
**** v1    0.1 CLI TX|\t*/
**** v1    0.1 CLI TX|
**** v1    0.1 CLI TX|%XJEIFLH|)Xspa8P
***  v1    0.1 CLI RX  106
**** v1    0.1 CLI RX|Message from VCC-compiler:
**** v1    0.1 CLI RX|/* ... */ comment contains /*
**** v1    0.1 CLI RX|('<vcl.inline>' Line 4 Pos 9)
**** v1    0.1 CLI RX|        /* foo
**** v1    0.1 CLI RX|--------##----
**** v1    0.1 CLI RX|
**** v1    0.1 CLI RX|('<vcl.inline>' Line 5 Pos 17)
**** v1    0.1 CLI RX|                /* bar
**** v1    0.1 CLI RX|----------------##----
**** v1    0.1 CLI RX|
**** v1    0.1 CLI RX|Running VCC-compiler failed, exited with 2
**** v1    0.1 CLI RX|VCL compilation failed
**   v1    0.1 VCL compilation failed (as expected)
***  v1    0.1 Found expected string: ("/* ... */ comment contains /*")
*    top   0.1 RESETTING after ../../../bin/varnishtest/tests/r00655.vtc
**   v1    0.1 Wait
**** v1    0.1 CLI TX|backend.list
***  v1    0.2 CLI RX  101
**** v1    0.2 CLI RX|Unknown request in manager process (child not running).
**** v1    0.2 CLI RX|Type 'help' for more info.
**   v1    0.2 Stop
**** v1    0.2 CLI TX|stop
***  v1    0.2 CLI RX  300
**** v1    0.2 CLI RX|Child in state stopped
**** v1    0.2 CLI TX|status
***  v1    0.2 CLI RX  200
**** v1    0.2 CLI RX|Child in state stopped
**** v1    0.2 STDOUT poll 0x10
**   v1    0.2 R 26643 Status: 0000 (u 0.000000 s 0.004000)
*    diag  0.0 ............................................................
#    top  TEST ../../../bin/varnishtest/tests/r00655.vtc TIMED OUT (kill -9)
#    top  TEST ../../../bin/varnishtest/tests/r00655.vtc FAILED (60.001) signal=9

1 @ Linux 3.10.0 x86_64 1.02 mblissett

*    top   0.0 TEST ../../../bin/varnishtest/tests/r00655.vtc starting
[...]
*    top   0.0 TEST Test nested /*...*/ comments
[...]
**** v1    0.1 CLI TX|
**** v1    0.1 CLI TX|
**** v1    0.1 CLI TX|\t/* foo
**** v1    0.1 CLI TX|\t\t/* bar
**** v1    0.1 CLI TX|\t*/
**** v1    0.1 CLI TX|
**** v1    0.1 CLI TX|%XJEIFLH|)Xspa8P
***  v1    0.1 CLI RX  106
**** v1    0.1 CLI RX|Message from VCC-compiler:
**** v1    0.1 CLI RX|/* ... */ comment contains /*
**** v1    0.1 CLI RX|('<vcl.inline>' Line 4 Pos 9)
**** v1    0.1 CLI RX|        /* foo
**** v1    0.1 CLI RX|--------##----
**** v1    0.1 CLI RX|
**** v1    0.1 CLI RX|('<vcl.inline>' Line 5 Pos 17)
**** v1    0.1 CLI RX|                /* bar
**** v1    0.1 CLI RX|----------------##----
**** v1    0.1 CLI RX|
**** v1    0.1 CLI RX|Running VCC-compiler failed, exited with 2
**** v1    0.1 CLI RX|VCL compilation failed
**   v1    0.1 VCL compilation failed (as expected)
***  v1    0.1 Found expected string: ("/* ... */ comment contains /*")
*    top   0.1 RESETTING after ../../../bin/varnishtest/tests/r00655.vtc
**   v1    0.1 Wait
**** v1    0.1 CLI TX|backend.list
***  v1    0.2 CLI RX  101
**** v1    0.2 CLI RX|Unknown request in manager process (child not running).
**** v1    0.2 CLI RX|Type 'help' for more info.
**   v1    0.2 Stop
**** v1    0.2 CLI TX|stop
***  v1    0.2 CLI RX  300
**** v1    0.2 CLI RX|Child in state stopped
**** v1    0.2 CLI TX|status
***  v1    0.2 CLI RX  200
**** v1    0.2 CLI RX|Child in state stopped
**** v1    0.2 STDOUT poll 0x10
**   v1    0.2 R 22372 Status: 0000 (u 0.004788 s 0.016445)
*    diag  0.0 ............................................................
#    top  TEST ../../../bin/varnishtest/tests/r00655.vtc TIMED OUT (kill -9)
#    top  TEST ../../../bin/varnishtest/tests/r00655.vtc FAILED (60.001) signal=9

1 @ Linux 3.10.0 x86_64 1.02 mblissett

*    top   0.0 TEST ../../../bin/varnishtest/tests/r00655.vtc starting
[...]
*    top   0.0 TEST Test nested /*...*/ comments
[...]
**** v1    0.1 CLI TX|
**** v1    0.1 CLI TX|
**** v1    0.1 CLI TX|\t/* foo
**** v1    0.1 CLI TX|\t\t/* bar
**** v1    0.1 CLI TX|\t*/
**** v1    0.1 CLI TX|
**** v1    0.1 CLI TX|%XJEIFLH|)Xspa8P
***  v1    0.1 CLI RX  106
**** v1    0.1 CLI RX|Message from VCC-compiler:
**** v1    0.1 CLI RX|/* ... */ comment contains /*
**** v1    0.1 CLI RX|('<vcl.inline>' Line 4 Pos 9)
**** v1    0.1 CLI RX|        /* foo
**** v1    0.1 CLI RX|--------##----
**** v1    0.1 CLI RX|
**** v1    0.1 CLI RX|('<vcl.inline>' Line 5 Pos 17)
**** v1    0.1 CLI RX|                /* bar
**** v1    0.1 CLI RX|----------------##----
**** v1    0.1 CLI RX|
**** v1    0.1 CLI RX|Running VCC-compiler failed, exited with 2
**** v1    0.1 CLI RX|VCL compilation failed
**   v1    0.1 VCL compilation failed (as expected)
***  v1    0.1 Found expected string: ("/* ... */ comment contains /*")
*    top   0.1 RESETTING after ../../../bin/varnishtest/tests/r00655.vtc
**   v1    0.1 Wait
**** v1    0.1 CLI TX|backend.list
***  v1    0.2 CLI RX  101
**** v1    0.2 CLI RX|Unknown request in manager process (child not running).
**** v1    0.2 CLI RX|Type 'help' for more info.
**   v1    0.2 Stop
**** v1    0.2 CLI TX|stop
***  v1    0.2 CLI RX  300
**** v1    0.2 CLI RX|Child in state stopped
**** v1    0.2 CLI TX|status
***  v1    0.2 CLI RX  200
**** v1    0.2 CLI RX|Child in state stopped
**** v1    0.2 STDOUT poll 0x10
**   v1    0.2 R 31815 Status: 0000 (u 0.002471 s 0.008792)
*    diag  0.0 ............................................................
#    top  TEST ../../../bin/varnishtest/tests/r00655.vtc TIMED OUT (kill -9)
#    top  TEST ../../../bin/varnishtest/tests/r00655.vtc FAILED (60.001) signal=9

1 @ SunOS 5.11 i86pc 1.04 32_sun12.4 uplex

*    top   0.0 TEST ../../../bin/varnishtest/tests/r00655.vtc starting
[...]
*    top   0.0 TEST Test nested /*...*/ comments
[...]
**** v1    0.1 CLI TX|
**** v1    0.1 CLI TX|\t/* foo
**** v1    0.1 CLI TX|\t\t/* bar
**** v1    0.1 CLI TX|\t*/
**** v1    0.1 CLI TX|
**** v1    0.1 CLI TX|%XJEIFLH|)Xspa8P
***  v1    0.1 CLI RX  106
**** v1    0.1 CLI RX|Message from VCC-compiler:
**** v1    0.1 CLI RX|Security: Privilege proc_setid missing, will not change uid/gid
**** v1    0.1 CLI RX|/* ... */ comment contains /*
**** v1    0.1 CLI RX|('<vcl.inline>' Line 4 Pos 9)
**** v1    0.1 CLI RX|        /* foo
**** v1    0.1 CLI RX|--------##----
**** v1    0.1 CLI RX|
**** v1    0.1 CLI RX|('<vcl.inline>' Line 5 Pos 17)
**** v1    0.1 CLI RX|                /* bar
**** v1    0.1 CLI RX|----------------##----
**** v1    0.1 CLI RX|
**** v1    0.1 CLI RX|Running VCC-compiler failed, exited with 2
**** v1    0.1 CLI RX|VCL compilation failed
**   v1    0.1 VCL compilation failed (as expected)
***  v1    0.1 Found expected string: ("/* ... */ comment contains /*")
*    top   0.1 RESETTING after ../../../bin/varnishtest/tests/r00655.vtc
**   v1    0.1 Wait
**** v1    0.1 CLI TX|backend.list
***  v1    0.1 CLI RX  101
**** v1    0.1 CLI RX|Unknown request in manager process (child not running).
**** v1    0.1 CLI RX|Type 'help' for more info.
**   v1    0.1 Stop
**** v1    0.1 CLI TX|stop
***  v1    0.1 CLI RX  300
**** v1    0.1 CLI RX|Child in state stopped
**** v1    0.1 CLI TX|status
***  v1    0.1 CLI RX  200
**** v1    0.1 CLI RX|Child in state stopped
**** v1    0.1 STDOUT poll 0x10
**   v1    0.1 R 98602 Status: 0000 (u 0.006000 s 0.024000)
*    diag  0.0 ............................................................
#    top  TEST ../../../bin/varnishtest/tests/r00655.vtc TIMED OUT (kill -9)
#    top  TEST ../../../bin/varnishtest/tests/r00655.vtc FAILED (60.003) signal=9

1 @ Ubuntu LTS i686 1.04 fgs

*    top   0.0 TEST ../../../bin/varnishtest/tests/r00655.vtc starting
[...]
*    top   0.0 TEST Test nested /*...*/ comments
[...]
**** v1    0.1 CLI TX|
**** v1    0.1 CLI TX|
**** v1    0.1 CLI TX|\t/* foo
**** v1    0.1 CLI TX|\t\t/* bar
**** v1    0.1 CLI TX|\t*/
**** v1    0.1 CLI TX|
**** v1    0.1 CLI TX|%XJEIFLH|)Xspa8P
***  v1    0.1 CLI RX  106
**** v1    0.1 CLI RX|Message from VCC-compiler:
**** v1    0.1 CLI RX|/* ... */ comment contains /*
**** v1    0.1 CLI RX|('<vcl.inline>' Line 4 Pos 9)
**** v1    0.1 CLI RX|        /* foo
**** v1    0.1 CLI RX|--------##----
**** v1    0.1 CLI RX|
**** v1    0.1 CLI RX|('<vcl.inline>' Line 5 Pos 17)
**** v1    0.1 CLI RX|                /* bar
**** v1    0.1 CLI RX|----------------##----
**** v1    0.1 CLI RX|
**** v1    0.1 CLI RX|Running VCC-compiler failed, exited with 2
**** v1    0.1 CLI RX|VCL compilation failed
**   v1    0.1 VCL compilation failed (as expected)
***  v1    0.1 Found expected string: ("/* ... */ comment contains /*")
*    top   0.1 RESETTING after ../../../bin/varnishtest/tests/r00655.vtc
**   v1    0.1 Wait
**** v1    0.1 CLI TX|backend.list
***  v1    0.1 CLI RX  101
**** v1    0.1 CLI RX|Unknown request in manager process (child not running).
**** v1    0.1 CLI RX|Type 'help' for more info.
**   v1    0.1 Stop
**** v1    0.1 CLI TX|stop
***  v1    0.2 CLI RX  300
**** v1    0.2 CLI RX|Child in state stopped
**** v1    0.2 CLI TX|status
***  v1    0.2 CLI RX  200
**** v1    0.2 CLI RX|Child in state stopped
**** v1    0.2 STDOUT poll 0x10
**   v1    0.2 R 23158 Status: 0000 (u 0.000000 s 0.004000)
*    diag  0.0 ............................................................
#    top  TEST ../../../bin/varnishtest/tests/r00655.vtc TIMED OUT (kill -9)
#    top  TEST ../../../bin/varnishtest/tests/r00655.vtc FAILED (60.001) signal=9

d3baf27

1 @ Linux 3.10.0 x86_64 1.02 mblissett

*    top   0.0 TEST ../../../bin/varnishtest/tests/r00655.vtc starting
[...]
*    top   0.0 TEST Test nested /*...*/ comments
[...]
**** v1    0.1 CLI TX|
**** v1    0.1 CLI TX|
**** v1    0.1 CLI TX|\t/* foo
**** v1    0.1 CLI TX|\t\t/* bar
**** v1    0.1 CLI TX|\t*/
**** v1    0.1 CLI TX|
**** v1    0.1 CLI TX|%XJEIFLH|)Xspa8P
***  v1    0.1 CLI RX  106
**** v1    0.1 CLI RX|Message from VCC-compiler:
**** v1    0.1 CLI RX|/* ... */ comment contains /*
**** v1    0.1 CLI RX|('<vcl.inline>' Line 4 Pos 9)
**** v1    0.1 CLI RX|        /* foo
**** v1    0.1 CLI RX|--------##----
**** v1    0.1 CLI RX|
**** v1    0.1 CLI RX|('<vcl.inline>' Line 5 Pos 17)
**** v1    0.1 CLI RX|                /* bar
**** v1    0.1 CLI RX|----------------##----
**** v1    0.1 CLI RX|
**** v1    0.1 CLI RX|Running VCC-compiler failed, exited with 2
**** v1    0.1 CLI RX|VCL compilation failed
**   v1    0.1 VCL compilation failed (as expected)
***  v1    0.1 Found expected string: ("/* ... */ comment contains /*")
*    top   0.1 RESETTING after ../../../bin/varnishtest/tests/r00655.vtc
**   v1    0.1 Wait
**** v1    0.1 CLI TX|backend.list
***  v1    0.2 CLI RX  101
**** v1    0.2 CLI RX|Unknown request in manager process (child not running).
**** v1    0.2 CLI RX|Type 'help' for more info.
**   v1    0.2 Stop
**** v1    0.2 CLI TX|stop
***  v1    0.2 CLI RX  300
**** v1    0.2 CLI RX|Child in state stopped
**** v1    0.2 CLI TX|status
***  v1    0.2 CLI RX  200
**** v1    0.2 CLI RX|Child in state stopped
**** v1    0.2 STDOUT poll 0x10
**   v1    0.2 R 3217 Status: 0000 (u 0.005926 s 0.016440)
*    diag  0.0 ............................................................
#    top  TEST ../../../bin/varnishtest/tests/r00655.vtc TIMED OUT (kill -9)
#    top  TEST ../../../bin/varnishtest/tests/r00655.vtc FAILED (60.001) signal=9

1 @ Ubuntu LTS i686 1.04 fgs

*    top   0.0 TEST ../../../bin/varnishtest/tests/r00655.vtc starting
[...]
*    top   0.0 TEST Test nested /*...*/ comments
[...]
**** v1    0.1 CLI TX|
**** v1    0.1 CLI TX|
**** v1    0.1 CLI TX|\t/* foo
**** v1    0.1 CLI TX|\t\t/* bar
**** v1    0.1 CLI TX|\t*/
**** v1    0.1 CLI TX|
**** v1    0.1 CLI TX|%XJEIFLH|)Xspa8P
***  v1    0.1 CLI RX  106
**** v1    0.1 CLI RX|Message from VCC-compiler:
**** v1    0.1 CLI RX|/* ... */ comment contains /*
**** v1    0.1 CLI RX|('<vcl.inline>' Line 4 Pos 9)
**** v1    0.1 CLI RX|        /* foo
**** v1    0.1 CLI RX|--------##----
**** v1    0.1 CLI RX|
**** v1    0.1 CLI RX|('<vcl.inline>' Line 5 Pos 17)
**** v1    0.1 CLI RX|                /* bar
**** v1    0.1 CLI RX|----------------##----
**** v1    0.1 CLI RX|
**** v1    0.1 CLI RX|Running VCC-compiler failed, exited with 2
**** v1    0.1 CLI RX|VCL compilation failed
**   v1    0.1 VCL compilation failed (as expected)
***  v1    0.1 Found expected string: ("/* ... */ comment contains /*")
*    top   0.1 RESETTING after ../../../bin/varnishtest/tests/r00655.vtc
**   v1    0.1 Wait
**** v1    0.1 CLI TX|backend.list
***  v1    0.1 CLI RX  101
**** v1    0.1 CLI RX|Unknown request in manager process (child not running).
**** v1    0.1 CLI RX|Type 'help' for more info.
**   v1    0.1 Stop
**** v1    0.1 CLI TX|stop
***  v1    0.2 CLI RX  300
**** v1    0.2 CLI RX|Child in state stopped
**** v1    0.2 CLI TX|status
***  v1    0.2 CLI RX  200
**** v1    0.2 CLI RX|Child in state stopped
**** v1    0.2 STDOUT poll 0x10
**   v1    0.2 R 31268 Status: 0000 (u 0.000000 s 0.004000)
*    diag  0.0 ............................................................
#    top  TEST ../../../bin/varnishtest/tests/r00655.vtc TIMED OUT (kill -9)
#    top  TEST ../../../bin/varnishtest/tests/r00655.vtc FAILED (60.001) signal=9

1 @ Ubuntu LTS i686 1.04 fgs

*    top   0.0 TEST ../../../bin/varnishtest/tests/r00655.vtc starting
[...]
*    top   0.0 TEST Test nested /*...*/ comments
[...]
**** v1    0.1 CLI TX|
**** v1    0.1 CLI TX|
**** v1    0.1 CLI TX|\t/* foo
**** v1    0.1 CLI TX|\t\t/* bar
**** v1    0.1 CLI TX|\t*/
**** v1    0.1 CLI TX|
**** v1    0.1 CLI TX|%XJEIFLH|)Xspa8P
***  v1    0.1 CLI RX  106
**** v1    0.1 CLI RX|Message from VCC-compiler:
**** v1    0.1 CLI RX|/* ... */ comment contains /*
**** v1    0.1 CLI RX|('<vcl.inline>' Line 4 Pos 9)
**** v1    0.1 CLI RX|        /* foo
**** v1    0.1 CLI RX|--------##----
**** v1    0.1 CLI RX|
**** v1    0.1 CLI RX|('<vcl.inline>' Line 5 Pos 17)
**** v1    0.1 CLI RX|                /* bar
**** v1    0.1 CLI RX|----------------##----
**** v1    0.1 CLI RX|
**** v1    0.1 CLI RX|Running VCC-compiler failed, exited with 2
**** v1    0.1 CLI RX|VCL compilation failed
**   v1    0.1 VCL compilation failed (as expected)
***  v1    0.1 Found expected string: ("/* ... */ comment contains /*")
*    top   0.1 RESETTING after ../../../bin/varnishtest/tests/r00655.vtc
**   v1    0.1 Wait
**** v1    0.1 CLI TX|backend.list
***  v1    0.1 CLI RX  101
**** v1    0.1 CLI RX|Unknown request in manager process (child not running).
**** v1    0.1 CLI RX|Type 'help' for more info.
**   v1    0.1 Stop
**** v1    0.1 CLI TX|stop
***  v1    0.2 CLI RX  300
**** v1    0.2 CLI RX|Child in state stopped
**** v1    0.2 CLI TX|status
***  v1    0.2 CLI RX  200
**** v1    0.2 CLI RX|Child in state stopped
**** v1    0.2 STDOUT poll 0x10
**   v1    0.2 R 22035 Status: 0000 (u 0.004000 s 0.000000)
*    diag  0.0 ............................................................
#    top  TEST ../../../bin/varnishtest/tests/r00655.vtc TIMED OUT (kill -9)
#    top  TEST ../../../bin/varnishtest/tests/r00655.vtc FAILED (60.002) signal=9

1 @ SunOS 5.11 i86pc 1.04 32_sun12.4 uplex

*    top   0.0 TEST ../../../bin/varnishtest/tests/r00655.vtc starting
[...]
*    top   0.0 TEST Test nested /*...*/ comments
[...]
**** v1    0.1 CLI TX|
**** v1    0.1 CLI TX|\t/* foo
**** v1    0.1 CLI TX|\t\t/* bar
**** v1    0.1 CLI TX|\t*/
**** v1    0.1 CLI TX|
**** v1    0.1 CLI TX|%XJEIFLH|)Xspa8P
***  v1    0.1 CLI RX  106
**** v1    0.1 CLI RX|Message from VCC-compiler:
**** v1    0.1 CLI RX|Security: Privilege proc_setid missing, will not change uid/gid
**** v1    0.1 CLI RX|/* ... */ comment contains /*
**** v1    0.1 CLI RX|('<vcl.inline>' Line 4 Pos 9)
**** v1    0.1 CLI RX|        /* foo
**** v1    0.1 CLI RX|--------##----
**** v1    0.1 CLI RX|
**** v1    0.1 CLI RX|('<vcl.inline>' Line 5 Pos 17)
**** v1    0.1 CLI RX|                /* bar
**** v1    0.1 CLI RX|----------------##----
**** v1    0.1 CLI RX|
**** v1    0.1 CLI RX|Running VCC-compiler failed, exited with 2
**** v1    0.1 CLI RX|VCL compilation failed
**   v1    0.1 VCL compilation failed (as expected)
***  v1    0.1 Found expected string: ("/* ... */ comment contains /*")
*    top   0.1 RESETTING after ../../../bin/varnishtest/tests/r00655.vtc
**   v1    0.1 Wait
**** v1    0.1 CLI TX|backend.list
***  v1    0.1 CLI RX  101
**** v1    0.1 CLI RX|Unknown request in manager process (child not running).
**** v1    0.1 CLI RX|Type 'help' for more info.
**   v1    0.1 Stop
**** v1    0.1 CLI TX|stop
***  v1    0.1 CLI RX  300
**** v1    0.1 CLI RX|Child in state stopped
**** v1    0.1 CLI TX|status
***  v1    0.1 CLI RX  200
**** v1    0.1 CLI RX|Child in state stopped
**** v1    0.1 STDOUT poll 0x10
**   v1    0.1 R 97634 Status: 0000 (u 0.004000 s 0.017000)
*    diag  0.0 ............................................................
#    top  TEST ../../../bin/varnishtest/tests/r00655.vtc TIMED OUT (kill -9)
#    top  TEST ../../../bin/varnishtest/tests/r00655.vtc FAILED (60.003) signal=9

1 @ SunOS 5.11 i86pc 1.04 32_sun12.4 uplex

*    top   0.0 TEST ../../../bin/varnishtest/tests/r00655.vtc starting
[...]
*    top   0.0 TEST Test nested /*...*/ comments
[...]
**** v1    0.1 CLI TX|
**** v1    0.1 CLI TX|\t/* foo
**** v1    0.1 CLI TX|\t\t/* bar
**** v1    0.1 CLI TX|\t*/
**** v1    0.1 CLI TX|
**** v1    0.1 CLI TX|%XJEIFLH|)Xspa8P
***  v1    0.2 CLI RX  106
**** v1    0.2 CLI RX|Message from VCC-compiler:
**** v1    0.2 CLI RX|Security: Privilege proc_setid missing, will not change uid/gid
**** v1    0.2 CLI RX|/* ... */ comment contains /*
**** v1    0.2 CLI RX|('<vcl.inline>' Line 4 Pos 9)
**** v1    0.2 CLI RX|        /* foo
**** v1    0.2 CLI RX|--------##----
**** v1    0.2 CLI RX|
**** v1    0.2 CLI RX|('<vcl.inline>' Line 5 Pos 17)
**** v1    0.2 CLI RX|                /* bar
**** v1    0.2 CLI RX|----------------##----
**** v1    0.2 CLI RX|
**** v1    0.2 CLI RX|Running VCC-compiler failed, exited with 2
**** v1    0.2 CLI RX|VCL compilation failed
**   v1    0.2 VCL compilation failed (as expected)
***  v1    0.2 Found expected string: ("/* ... */ comment contains /*")
*    top   0.2 RESETTING after ../../../bin/varnishtest/tests/r00655.vtc
**   v1    0.2 Wait
**** v1    0.2 CLI TX|backend.list
***  v1    0.2 CLI RX  101
**** v1    0.2 CLI RX|Unknown request in manager process (child not running).
**** v1    0.2 CLI RX|Type 'help' for more info.
**   v1    0.2 Stop
**** v1    0.2 CLI TX|stop
***  v1    0.2 CLI RX  300
**** v1    0.2 CLI RX|Child in state stopped
**** v1    0.2 CLI TX|status
***  v1    0.2 CLI RX  200
**** v1    0.2 CLI RX|Child in state stopped
**** v1    0.2 STDOUT poll 0x10
**   v1    0.2 R 71715 Status: 0000 (u 0.006000 s 0.022000)
*    diag  0.0 ............................................................
#    top  TEST ../../../bin/varnishtest/tests/r00655.vtc TIMED OUT (kill -9)
#    top  TEST ../../../bin/varnishtest/tests/r00655.vtc FAILED (60.002) signal=9

1 @ SunOS 5.11 i86pc 1.04 32_sun12.4 uplex

*    top   0.0 TEST ../../../bin/varnishtest/tests/r00655.vtc starting
[...]
*    top   0.0 TEST Test nested /*...*/ comments
[...]
**** v1    0.1 CLI TX|
**** v1    0.1 CLI TX|\t/* foo
**** v1    0.1 CLI TX|\t\t/* bar
**** v1    0.1 CLI TX|\t*/
**** v1    0.1 CLI TX|
**** v1    0.1 CLI TX|%XJEIFLH|)Xspa8P
***  v1    0.1 CLI RX  106
**** v1    0.1 CLI RX|Message from VCC-compiler:
**** v1    0.1 CLI RX|Security: Privilege proc_setid missing, will not change uid/gid
**** v1    0.1 CLI RX|/* ... */ comment contains /*
**** v1    0.1 CLI RX|('<vcl.inline>' Line 4 Pos 9)
**** v1    0.1 CLI RX|        /* foo
**** v1    0.1 CLI RX|--------##----
**** v1    0.1 CLI RX|
**** v1    0.1 CLI RX|('<vcl.inline>' Line 5 Pos 17)
**** v1    0.1 CLI RX|                /* bar
**** v1    0.1 CLI RX|----------------##----
**** v1    0.1 CLI RX|
**** v1    0.1 CLI RX|Running VCC-compiler failed, exited with 2
**** v1    0.1 CLI RX|VCL compilation failed
**   v1    0.1 VCL compilation failed (as expected)
***  v1    0.1 Found expected string: ("/* ... */ comment contains /*")
*    top   0.1 RESETTING after ../../../bin/varnishtest/tests/r00655.vtc
**   v1    0.1 Wait
**** v1    0.1 CLI TX|backend.list
***  v1    0.1 CLI RX  101
**** v1    0.1 CLI RX|Unknown request in manager process (child not running).
**** v1    0.1 CLI RX|Type 'help' for more info.
**   v1    0.1 Stop
**** v1    0.1 CLI TX|stop
***  v1    0.1 CLI RX  300
**** v1    0.1 CLI RX|Child in state stopped
**** v1    0.1 CLI TX|status
***  v1    0.1 CLI RX  200
**** v1    0.1 CLI RX|Child in state stopped
**** v1    0.1 STDOUT poll 0x10
**   v1    0.1 R 86771 Status: 0000 (u 0.004000 s 0.017000)
*    diag  0.0 ............................................................
#    top  TEST ../../../bin/varnishtest/tests/r00655.vtc TIMED OUT (kill -9)
#    top  TEST ../../../bin/varnishtest/tests/r00655.vtc FAILED (60.002) signal=9

1 @ SunOS 5.11 i86pc 1.04 32_sun12.4 uplex

*    top   0.0 TEST ../../../bin/varnishtest/tests/r00655.vtc starting
[...]
*    top   0.0 TEST Test nested /*...*/ comments
[...]
**** v1    0.1 CLI TX|
**** v1    0.1 CLI TX|\t/* foo
**** v1    0.1 CLI TX|\t\t/* bar
**** v1    0.1 CLI TX|\t*/
**** v1    0.1 CLI TX|
**** v1    0.1 CLI TX|%XJEIFLH|)Xspa8P
***  v1    0.1 CLI RX  106
**** v1    0.1 CLI RX|Message from VCC-compiler:
**** v1    0.1 CLI RX|Security: Privilege proc_setid missing, will not change uid/gid
**** v1    0.1 CLI RX|/* ... */ comment contains /*
**** v1    0.1 CLI RX|('<vcl.inline>' Line 4 Pos 9)
**** v1    0.1 CLI RX|        /* foo
**** v1    0.1 CLI RX|--------##----
**** v1    0.1 CLI RX|
**** v1    0.1 CLI RX|('<vcl.inline>' Line 5 Pos 17)
**** v1    0.1 CLI RX|                /* bar
**** v1    0.1 CLI RX|----------------##----
**** v1    0.1 CLI RX|
**** v1    0.1 CLI RX|Running VCC-compiler failed, exited with 2
**** v1    0.1 CLI RX|VCL compilation failed
**   v1    0.1 VCL compilation failed (as expected)
***  v1    0.1 Found expected string: ("/* ... */ comment contains /*")
*    top   0.1 RESETTING after ../../../bin/varnishtest/tests/r00655.vtc
**   v1    0.1 Wait
**** v1    0.1 CLI TX|backend.list
***  v1    0.1 CLI RX  101
**** v1    0.1 CLI RX|Unknown request in manager process (child not running).
**** v1    0.1 CLI RX|Type 'help' for more info.
**   v1    0.1 Stop
**** v1    0.1 CLI TX|stop
***  v1    0.1 CLI RX  300
**** v1    0.1 CLI RX|Child in state stopped
**** v1    0.1 CLI TX|status
***  v1    0.1 CLI RX  200
**** v1    0.1 CLI RX|Child in state stopped
**** v1    0.1 STDOUT poll 0x10
**   v1    0.1 R 69390 Status: 0000 (u 0.004000 s 0.016000)
*    diag  0.0 ............................................................
#    top  TEST ../../../bin/varnishtest/tests/r00655.vtc TIMED OUT (kill -9)
#    top  TEST ../../../bin/varnishtest/tests/r00655.vtc FAILED (60.002) signal=9

1 @ Linux 3.10.0 x86_64 1.02 mblissett

*    top   0.0 TEST ../../../bin/varnishtest/tests/r00655.vtc starting
[...]
*    top   0.0 TEST Test nested /*...*/ comments
[...]
**** v1    0.1 CLI TX|
**** v1    0.1 CLI TX|
**** v1    0.1 CLI TX|\t/* foo
**** v1    0.1 CLI TX|\t\t/* bar
**** v1    0.1 CLI TX|\t*/
**** v1    0.1 CLI TX|
**** v1    0.1 CLI TX|%XJEIFLH|)Xspa8P
***  v1    0.1 CLI RX  106
**** v1    0.1 CLI RX|Message from VCC-compiler:
**** v1    0.1 CLI RX|/* ... */ comment contains /*
**** v1    0.1 CLI RX|('<vcl.inline>' Line 4 Pos 9)
**** v1    0.1 CLI RX|        /* foo
**** v1    0.1 CLI RX|--------##----
**** v1    0.1 CLI RX|
**** v1    0.1 CLI RX|('<vcl.inline>' Line 5 Pos 17)
**** v1    0.1 CLI RX|                /* bar
**** v1    0.1 CLI RX|----------------##----
**** v1    0.1 CLI RX|
**** v1    0.1 CLI RX|Running VCC-compiler failed, exited with 2
**** v1    0.1 CLI RX|VCL compilation failed
**   v1    0.1 VCL compilation failed (as expected)
***  v1    0.1 Found expected string: ("/* ... */ comment contains /*")
*    top   0.1 RESETTING after ../../../bin/varnishtest/tests/r00655.vtc
**   v1    0.1 Wait
**** v1    0.1 CLI TX|backend.list
***  v1    0.2 CLI RX  101
**** v1    0.2 CLI RX|Unknown request in manager process (child not running).
**** v1    0.2 CLI RX|Type 'help' for more info.
**   v1    0.2 Stop
**** v1    0.2 CLI TX|stop
***  v1    0.2 CLI RX  300
**** v1    0.2 CLI RX|Child in state stopped
**** v1    0.2 CLI TX|status
***  v1    0.2 CLI RX  200
**** v1    0.2 CLI RX|Child in state stopped
**** v1    0.2 STDOUT poll 0x10
**   v1    0.2 R 6378 Status: 0000 (u 0.002233 s 0.016508)
*    diag  0.0 ............................................................
#    top  TEST ../../../bin/varnishtest/tests/r00655.vtc TIMED OUT (kill -9)
#    top  TEST ../../../bin/varnishtest/tests/r00655.vtc FAILED (60.002) signal=9

1 @ SunOS 5.11 i86pc 1.04 32_sun12.4 uplex

*    top   0.0 TEST ../../../bin/varnishtest/tests/r00655.vtc starting
[...]
*    top   0.0 TEST Test nested /*...*/ comments
[...]
**** v1    0.1 CLI TX|
**** v1    0.1 CLI TX|\t/* foo
**** v1    0.1 CLI TX|\t\t/* bar
**** v1    0.1 CLI TX|\t*/
**** v1    0.1 CLI TX|
**** v1    0.1 CLI TX|%XJEIFLH|)Xspa8P
***  v1    0.1 CLI RX  106
**** v1    0.1 CLI RX|Message from VCC-compiler:
**** v1    0.1 CLI RX|Security: Privilege proc_setid missing, will not change uid/gid
**** v1    0.1 CLI RX|/* ... */ comment contains /*
**** v1    0.1 CLI RX|('<vcl.inline>' Line 4 Pos 9)
**** v1    0.1 CLI RX|        /* foo
**** v1    0.1 CLI RX|--------##----
**** v1    0.1 CLI RX|
**** v1    0.1 CLI RX|('<vcl.inline>' Line 5 Pos 17)
**** v1    0.1 CLI RX|                /* bar
**** v1    0.1 CLI RX|----------------##----
**** v1    0.1 CLI RX|
**** v1    0.1 CLI RX|Running VCC-compiler failed, exited with 2
**** v1    0.1 CLI RX|VCL compilation failed
**   v1    0.1 VCL compilation failed (as expected)
***  v1    0.1 Found expected string: ("/* ... */ comment contains /*")
*    top   0.1 RESETTING after ../../../bin/varnishtest/tests/r00655.vtc
**   v1    0.1 Wait
**** v1    0.1 CLI TX|backend.list
***  v1    0.1 CLI RX  101
**** v1    0.1 CLI RX|Unknown request in manager process (child not running).
**** v1    0.1 CLI RX|Type 'help' for more info.
**   v1    0.1 Stop
**** v1    0.1 CLI TX|stop
***  v1    0.1 CLI RX  300
**** v1    0.1 CLI RX|Child in state stopped
**** v1    0.1 CLI TX|status
***  v1    0.1 CLI RX  200
**** v1    0.1 CLI RX|Child in state stopped
**** v1    0.1 STDOUT poll 0x10
**   v1    0.1 R 83267 Status: 0000 (u 0.004000 s 0.018000)
*    diag  0.0 ............................................................
#    top  TEST ../../../bin/varnishtest/tests/r00655.vtc TIMED OUT (kill -9)
#    top  TEST ../../../bin/varnishtest/tests/r00655.vtc FAILED (60.002) signal=9

1 @ SunOS 5.11 i86pc 1.04 32_sun12.4 uplex

*    top   0.0 TEST ../../../bin/varnishtest/tests/r00655.vtc starting
[...]
*    top   0.0 TEST Test nested /*...*/ comments
[...]
**** v1    0.1 CLI TX|
**** v1    0.1 CLI TX|\t/* foo
**** v1    0.1 CLI TX|\t\t/* bar
**** v1    0.1 CLI TX|\t*/
**** v1    0.1 CLI TX|
**** v1    0.1 CLI TX|%XJEIFLH|)Xspa8P
***  v1    0.1 CLI RX  106
**** v1    0.1 CLI RX|Message from VCC-compiler:
**** v1    0.1 CLI RX|Security: Privilege proc_setid missing, will not change uid/gid
**** v1    0.1 CLI RX|/* ... */ comment contains /*
**** v1    0.1 CLI RX|('<vcl.inline>' Line 4 Pos 9)
**** v1    0.1 CLI RX|        /* foo
**** v1    0.1 CLI RX|--------##----
**** v1    0.1 CLI RX|
**** v1    0.1 CLI RX|('<vcl.inline>' Line 5 Pos 17)
**** v1    0.1 CLI RX|                /* bar
**** v1    0.1 CLI RX|----------------##----
**** v1    0.1 CLI RX|
**** v1    0.1 CLI RX|Running VCC-compiler failed, exited with 2
**** v1    0.1 CLI RX|VCL compilation failed
**   v1    0.1 VCL compilation failed (as expected)
***  v1    0.1 Found expected string: ("/* ... */ comment contains /*")
*    top   0.1 RESETTING after ../../../bin/varnishtest/tests/r00655.vtc
**   v1    0.1 Wait
**** v1    0.1 CLI TX|backend.list
***  v1    0.1 CLI RX  101
**** v1    0.1 CLI RX|Unknown request in manager process (child not running).
**** v1    0.1 CLI RX|Type 'help' for more info.
**   v1    0.1 Stop
**** v1    0.1 CLI TX|stop
***  v1    0.1 CLI RX  300
**** v1    0.1 CLI RX|Child in state stopped
**** v1    0.1 CLI TX|status
***  v1    0.1 CLI RX  200
**** v1    0.1 CLI RX|Child in state stopped
**** v1    0.1 STDOUT poll 0x10
**   v1    0.1 R 77589 Status: 0000 (u 0.004000 s 0.017000)
*    diag  0.0 ............................................................
#    top  TEST ../../../bin/varnishtest/tests/r00655.vtc TIMED OUT (kill -9)
#    top  TEST ../../../bin/varnishtest/tests/r00655.vtc FAILED (60.002) signal=9

1 @ Ubuntu LTS i686 1.04 fgs

*    top   0.0 TEST ../../../bin/varnishtest/tests/r00655.vtc starting
[...]
*    top   0.0 TEST Test nested /*...*/ comments
[...]
**** v1    0.1 CLI TX|
**** v1    0.1 CLI TX|
**** v1    0.1 CLI TX|\t/* foo
**** v1    0.1 CLI TX|\t\t/* bar
**** v1    0.1 CLI TX|\t*/
**** v1    0.1 CLI TX|
**** v1    0.1 CLI TX|%XJEIFLH|)Xspa8P
***  v1    0.1 CLI RX  106
**** v1    0.1 CLI RX|Message from VCC-compiler:
**** v1    0.1 CLI RX|/* ... */ comment contains /*
**** v1    0.1 CLI RX|('<vcl.inline>' Line 4 Pos 9)
**** v1    0.1 CLI RX|        /* foo
**** v1    0.1 CLI RX|--------##----
**** v1    0.1 CLI RX|
**** v1    0.1 CLI RX|('<vcl.inline>' Line 5 Pos 17)
**** v1    0.1 CLI RX|                /* bar
**** v1    0.1 CLI RX|----------------##----
**** v1    0.1 CLI RX|
**** v1    0.1 CLI RX|Running VCC-compiler failed, exited with 2
**** v1    0.1 CLI RX|VCL compilation failed
**   v1    0.1 VCL compilation failed (as expected)
***  v1    0.1 Found expected string: ("/* ... */ comment contains /*")
*    top   0.1 RESETTING after ../../../bin/varnishtest/tests/r00655.vtc
**   v1    0.1 Wait
**** v1    0.1 CLI TX|backend.list
***  v1    0.2 CLI RX  101
**** v1    0.2 CLI RX|Unknown request in manager process (child not running).
**** v1    0.2 CLI RX|Type 'help' for more info.
**   v1    0.2 Stop
**** v1    0.2 CLI TX|stop
***  v1    0.2 CLI RX  300
**** v1    0.2 CLI RX|Child in state stopped
**** v1    0.2 CLI TX|status
***  v1    0.2 CLI RX  200
**** v1    0.2 CLI RX|Child in state stopped
**** v1    0.3 STDOUT poll 0x10
**   v1    0.3 R 25254 Status: 0000 (u 0.004000 s 0.004000)
*    diag  0.0 ............................................................
#    top  TEST ../../../bin/varnishtest/tests/r00655.vtc TIMED OUT (kill -9)
#    top  TEST ../../../bin/varnishtest/tests/r00655.vtc FAILED (60.001) signal=9

1 @ Ubuntu LTS i686 1.04 fgs

*    top   0.0 TEST ../../../bin/varnishtest/tests/r00655.vtc starting
[...]
*    top   0.0 TEST Test nested /*...*/ comments
[...]
**** v1    0.1 CLI TX|
**** v1    0.1 CLI TX|
**** v1    0.1 CLI TX|\t/* foo
**** v1    0.1 CLI TX|\t\t/* bar
**** v1    0.1 CLI TX|\t*/
**** v1    0.1 CLI TX|
**** v1    0.1 CLI TX|%XJEIFLH|)Xspa8P
***  v1    0.1 CLI RX  106
**** v1    0.1 CLI RX|Message from VCC-compiler:
**** v1    0.1 CLI RX|/* ... */ comment contains /*
**** v1    0.1 CLI RX|('<vcl.inline>' Line 4 Pos 9)
**** v1    0.1 CLI RX|        /* foo
**** v1    0.1 CLI RX|--------##----
**** v1    0.1 CLI RX|
**** v1    0.1 CLI RX|('<vcl.inline>' Line 5 Pos 17)
**** v1    0.1 CLI RX|                /* bar
**** v1    0.1 CLI RX|----------------##----
**** v1    0.1 CLI RX|
**** v1    0.1 CLI RX|Running VCC-compiler failed, exited with 2
**** v1    0.1 CLI RX|VCL compilation failed
**   v1    0.1 VCL compilation failed (as expected)
***  v1    0.1 Found expected string: ("/* ... */ comment contains /*")
*    top   0.1 RESETTING after ../../../bin/varnishtest/tests/r00655.vtc
**   v1    0.1 Wait
**** v1    0.1 CLI TX|backend.list
***  v1    0.1 CLI RX  101
**** v1    0.1 CLI RX|Unknown request in manager process (child not running).
**** v1    0.1 CLI RX|Type 'help' for more info.
**   v1    0.1 Stop
**** v1    0.1 CLI TX|stop
***  v1    0.2 CLI RX  300
**** v1    0.2 CLI RX|Child in state stopped
**** v1    0.2 CLI TX|status
***  v1    0.2 CLI RX  200
**** v1    0.2 CLI RX|Child in state stopped
**** v1    0.2 STDOUT poll 0x10
**   v1    0.2 R 28156 Status: 0000 (u 0.004000 s 0.000000)
*    diag  0.0 ............................................................
#    top  TEST ../../../bin/varnishtest/tests/r00655.vtc TIMED OUT (kill -9)
#    top  TEST ../../../bin/varnishtest/tests/r00655.vtc FAILED (60.001) signal=9

1 @ Linux 3.10.0 x86_64 1.02 mblissett

*    top   0.0 TEST ../../../bin/varnishtest/tests/r00655.vtc starting
[...]
*    top   0.0 TEST Test nested /*...*/ comments
[...]
**** v1    0.1 CLI TX|
**** v1    0.1 CLI TX|
**** v1    0.1 CLI TX|\t/* foo
**** v1    0.1 CLI TX|\t\t/* bar
**** v1    0.1 CLI TX|\t*/
**** v1    0.1 CLI TX|
**** v1    0.1 CLI TX|%XJEIFLH|)Xspa8P
***  v1    0.1 CLI RX  106
**** v1    0.1 CLI RX|Message from VCC-compiler:
**** v1    0.1 CLI RX|/* ... */ comment contains /*
**** v1    0.1 CLI RX|('<vcl.inline>' Line 4 Pos 9)
**** v1    0.1 CLI RX|        /* foo
**** v1    0.1 CLI RX|--------##----
**** v1    0.1 CLI RX|
**** v1    0.1 CLI RX|('<vcl.inline>' Line 5 Pos 17)
**** v1    0.1 CLI RX|                /* bar
**** v1    0.1 CLI RX|----------------##----
**** v1    0.1 CLI RX|
**** v1    0.1 CLI RX|Running VCC-compiler failed, exited with 2
**** v1    0.1 CLI RX|VCL compilation failed
**   v1    0.1 VCL compilation failed (as expected)
***  v1    0.1 Found expected string: ("/* ... */ comment contains /*")
*    top   0.1 RESETTING after ../../../bin/varnishtest/tests/r00655.vtc
**   v1    0.1 Wait
**** v1    0.1 CLI TX|backend.list
***  v1    0.2 CLI RX  101
**** v1    0.2 CLI RX|Unknown request in manager process (child not running).
**** v1    0.2 CLI RX|Type 'help' for more info.
**   v1    0.2 Stop
**** v1    0.2 CLI TX|stop
***  v1    0.2 CLI RX  300
**** v1    0.2 CLI RX|Child in state stopped
**** v1    0.2 CLI TX|status
***  v1    0.2 CLI RX  200
**** v1    0.2 CLI RX|Child in state stopped
**** v1    0.2 STDOUT poll 0x10
**   v1    0.2 R 32464 Status: 0000 (u 0.004028 s 0.014276)
*    diag  0.0 ............................................................
#    top  TEST ../../../bin/varnishtest/tests/r00655.vtc TIMED OUT (kill -9)
#    top  TEST ../../../bin/varnishtest/tests/r00655.vtc FAILED (60.001) signal=9

1 @ Linux 3.10.0 x86_64 1.02 mblissett

*    top   0.0 TEST ../../../bin/varnishtest/tests/r00655.vtc starting
[...]
*    top   0.0 TEST Test nested /*...*/ comments
[...]
**** v1    0.1 CLI TX|
**** v1    0.1 CLI TX|
**** v1    0.1 CLI TX|\t/* foo
**** v1    0.1 CLI TX|\t\t/* bar
**** v1    0.1 CLI TX|\t*/
**** v1    0.1 CLI TX|
**** v1    0.1 CLI TX|%XJEIFLH|)Xspa8P
***  v1    0.1 CLI RX  106
**** v1    0.1 CLI RX|Message from VCC-compiler:
**** v1    0.1 CLI RX|/* ... */ comment contains /*
**** v1    0.1 CLI RX|('<vcl.inline>' Line 4 Pos 9)
**** v1    0.1 CLI RX|        /* foo
**** v1    0.1 CLI RX|--------##----
**** v1    0.1 CLI RX|
**** v1    0.1 CLI RX|('<vcl.inline>' Line 5 Pos 17)
**** v1    0.1 CLI RX|                /* bar
**** v1    0.1 CLI RX|----------------##----
**** v1    0.1 CLI RX|
**** v1    0.1 CLI RX|Running VCC-compiler failed, exited with 2
**** v1    0.1 CLI RX|VCL compilation failed
**   v1    0.1 VCL compilation failed (as expected)
***  v1    0.1 Found expected string: ("/* ... */ comment contains /*")
*    top   0.1 RESETTING after ../../../bin/varnishtest/tests/r00655.vtc
**   v1    0.1 Wait
**** v1    0.1 CLI TX|backend.list
***  v1    0.2 CLI RX  101
**** v1    0.2 CLI RX|Unknown request in manager process (child not running).
**** v1    0.2 CLI RX|Type 'help' for more info.
**   v1    0.2 Stop
**** v1    0.2 CLI TX|stop
***  v1    0.2 CLI RX  300
**** v1    0.2 CLI RX|Child in state stopped
**** v1    0.2 CLI TX|status
***  v1    0.2 CLI RX  200
**** v1    0.2 CLI RX|Child in state stopped
**** v1    0.2 STDOUT poll 0x10
**   v1    0.2 R 26128 Status: 0000 (u 0.003535 s 0.010917)
*    diag  0.0 ............................................................
#    top  TEST ../../../bin/varnishtest/tests/r00655.vtc TIMED OUT (kill -9)
#    top  TEST ../../../bin/varnishtest/tests/r00655.vtc FAILED (60.002) signal=9

1 @ Linux 3.10.0 x86_64 1.02 mblissett

*    top   0.0 TEST ../../../bin/varnishtest/tests/r00655.vtc starting
[...]
*    top   0.0 TEST Test nested /*...*/ comments
[...]
**** v1    0.1 CLI TX|
**** v1    0.1 CLI TX|
**** v1    0.1 CLI TX|\t/* foo
**** v1    0.1 CLI TX|\t\t/* bar
**** v1    0.1 CLI TX|\t*/
**** v1    0.1 CLI TX|
**** v1    0.1 CLI TX|%XJEIFLH|)Xspa8P
***  v1    0.1 CLI RX  106
**** v1    0.1 CLI RX|Message from VCC-compiler:
**** v1    0.1 CLI RX|/* ... */ comment contains /*
**** v1    0.1 CLI RX|('<vcl.inline>' Line 4 Pos 9)
**** v1    0.1 CLI RX|        /* foo
**** v1    0.1 CLI RX|--------##----
**** v1    0.1 CLI RX|
**** v1    0.1 CLI RX|('<vcl.inline>' Line 5 Pos 17)
**** v1    0.1 CLI RX|                /* bar
**** v1    0.1 CLI RX|----------------##----
**** v1    0.1 CLI RX|
**** v1    0.1 CLI RX|Running VCC-compiler failed, exited with 2
**** v1    0.1 CLI RX|VCL compilation failed
**   v1    0.1 VCL compilation failed (as expected)
***  v1    0.1 Found expected string: ("/* ... */ comment contains /*")
*    top   0.1 RESETTING after ../../../bin/varnishtest/tests/r00655.vtc
**   v1    0.1 Wait
**** v1    0.1 CLI TX|backend.list
***  v1    0.2 CLI RX  101
**** v1    0.2 CLI RX|Unknown request in manager process (child not running).
**** v1    0.2 CLI RX|Type 'help' for more info.
**   v1    0.2 Stop
**** v1    0.2 CLI TX|stop
***  v1    0.2 CLI RX  300
**** v1    0.2 CLI RX|Child in state stopped
**** v1    0.2 CLI TX|status
***  v1    0.2 CLI RX  200
**** v1    0.2 CLI RX|Child in state stopped
**** v1    0.2 STDOUT poll 0x10
**   v1    0.2 R 29325 Status: 0000 (u 0.004730 s 0.011417)
*    diag  0.0 ............................................................
#    top  TEST ../../../bin/varnishtest/tests/r00655.vtc TIMED OUT (kill -9)
#    top  TEST ../../../bin/varnishtest/tests/r00655.vtc FAILED (60.001) signal=9

1 @ SunOS 5.11 i86pc 1.04 32_sun12.4 uplex

*    top   0.0 TEST ../../../bin/varnishtest/tests/r00655.vtc starting
[...]
*    top   0.0 TEST Test nested /*...*/ comments
[...]
**** v1    0.1 CLI TX|
**** v1    0.1 CLI TX|\t/* foo
**** v1    0.1 CLI TX|\t\t/* bar
**** v1    0.1 CLI TX|\t*/
**** v1    0.1 CLI TX|
**** v1    0.1 CLI TX|%XJEIFLH|)Xspa8P
***  v1    0.1 CLI RX  106
**** v1    0.1 CLI RX|Message from VCC-compiler:
**** v1    0.1 CLI RX|Security: Privilege proc_setid missing, will not change uid/gid
**** v1    0.1 CLI RX|/* ... */ comment contains /*
**** v1    0.1 CLI RX|('<vcl.inline>' Line 4 Pos 9)
**** v1    0.1 CLI RX|        /* foo
**** v1    0.1 CLI RX|--------##----
**** v1    0.1 CLI RX|
**** v1    0.1 CLI RX|('<vcl.inline>' Line 5 Pos 17)
**** v1    0.1 CLI RX|                /* bar
**** v1    0.1 CLI RX|----------------##----
**** v1    0.1 CLI RX|
**** v1    0.1 CLI RX|Running VCC-compiler failed, exited with 2
**** v1    0.1 CLI RX|VCL compilation failed
**   v1    0.1 VCL compilation failed (as expected)
***  v1    0.1 Found expected string: ("/* ... */ comment contains /*")
*    top   0.1 RESETTING after ../../../bin/varnishtest/tests/r00655.vtc
**   v1    0.1 Wait
**** v1    0.1 CLI TX|backend.list
***  v1    0.1 CLI RX  101
**** v1    0.1 CLI RX|Unknown request in manager process (child not running).
**** v1    0.1 CLI RX|Type 'help' for more info.
**   v1    0.1 Stop
**** v1    0.1 CLI TX|stop
***  v1    0.1 CLI RX  300
**** v1    0.1 CLI RX|Child in state stopped
**** v1    0.1 CLI TX|status
***  v1    0.1 CLI RX  200
**** v1    0.1 CLI RX|Child in state stopped
**** v1    0.1 STDOUT poll 0x10
**   v1    0.1 R 71532 Status: 0000 (u 0.004000 s 0.017000)
*    diag  0.0 ............................................................
#    top  TEST ../../../bin/varnishtest/tests/r00655.vtc TIMED OUT (kill -9)
#    top  TEST ../../../bin/varnishtest/tests/r00655.vtc FAILED (60.002) signal=9

1 @ SunOS 5.11 i86pc 1.04 32_sun12.4 uplex

*    top   0.0 TEST ../../../bin/varnishtest/tests/r00655.vtc starting
[...]
*    top   0.0 TEST Test nested /*...*/ comments
[...]
**** v1    0.1 CLI TX|
**** v1    0.1 CLI TX|\t/* foo
**** v1    0.1 CLI TX|\t\t/* bar
**** v1    0.1 CLI TX|\t*/
**** v1    0.1 CLI TX|
**** v1    0.1 CLI TX|%XJEIFLH|)Xspa8P
***  v1    0.1 CLI RX  106
**** v1    0.1 CLI RX|Message from VCC-compiler:
**** v1    0.1 CLI RX|Security: Privilege proc_setid missing, will not change uid/gid
**** v1    0.1 CLI RX|/* ... */ comment contains /*
**** v1    0.1 CLI RX|('<vcl.inline>' Line 4 Pos 9)
**** v1    0.1 CLI RX|        /* foo
**** v1    0.1 CLI RX|--------##----
**** v1    0.1 CLI RX|
**** v1    0.1 CLI RX|('<vcl.inline>' Line 5 Pos 17)
**** v1    0.1 CLI RX|                /* bar
**** v1    0.1 CLI RX|----------------##----
**** v1    0.1 CLI RX|
**** v1    0.1 CLI RX|Running VCC-compiler failed, exited with 2
**** v1    0.1 CLI RX|VCL compilation failed
**   v1    0.1 VCL compilation failed (as expected)
***  v1    0.1 Found expected string: ("/* ... */ comment contains /*")
*    top   0.1 RESETTING after ../../../bin/varnishtest/tests/r00655.vtc
**   v1    0.1 Wait
**** v1    0.1 CLI TX|backend.list
***  v1    0.1 CLI RX  101
**** v1    0.1 CLI RX|Unknown request in manager process (child not running).
**** v1    0.1 CLI RX|Type 'help' for more info.
**   v1    0.1 Stop
**** v1    0.1 CLI TX|stop
***  v1    0.1 CLI RX  300
**** v1    0.1 CLI RX|Child in state stopped
**** v1    0.1 CLI TX|status
***  v1    0.1 CLI RX  200
**** v1    0.1 CLI RX|Child in state stopped
**** v1    0.1 STDOUT poll 0x10
**   v1    0.1 R 56917 Status: 0000 (u 0.004000 s 0.016000)
*    diag  0.0 ............................................................
#    top  TEST ../../../bin/varnishtest/tests/r00655.vtc TIMED OUT (kill -9)
#    top  TEST ../../../bin/varnishtest/tests/r00655.vtc FAILED (60.002) signal=9

1 @ Linux 3.10.0 x86_64 1.02 mblissett

*    top   0.0 TEST ../../../bin/varnishtest/tests/r00655.vtc starting
[...]
*    top   0.0 TEST Test nested /*...*/ comments
[...]
**** v1    0.1 CLI TX|
**** v1    0.1 CLI TX|
**** v1    0.1 CLI TX|\t/* foo
**** v1    0.1 CLI TX|\t\t/* bar
**** v1    0.1 CLI TX|\t*/
**** v1    0.1 CLI TX|
**** v1    0.1 CLI TX|%XJEIFLH|)Xspa8P
***  v1    0.1 CLI RX  106
**** v1    0.1 CLI RX|Message from VCC-compiler:
**** v1    0.1 CLI RX|/* ... */ comment contains /*
**** v1    0.1 CLI RX|('<vcl.inline>' Line 4 Pos 9)
**** v1    0.1 CLI RX|        /* foo
**** v1    0.1 CLI RX|--------##----
**** v1    0.1 CLI RX|
**** v1    0.1 CLI RX|('<vcl.inline>' Line 5 Pos 17)
**** v1    0.1 CLI RX|                /* bar
**** v1    0.1 CLI RX|----------------##----
**** v1    0.1 CLI RX|
**** v1    0.1 CLI RX|Running VCC-compiler failed, exited with 2
**** v1    0.1 CLI RX|VCL compilation failed
**   v1    0.1 VCL compilation failed (as expected)
***  v1    0.1 Found expected string: ("/* ... */ comment contains /*")
*    top   0.1 RESETTING after ../../../bin/varnishtest/tests/r00655.vtc
**   v1    0.1 Wait
**** v1    0.1 CLI TX|backend.list
***  v1    0.2 CLI RX  101
**** v1    0.2 CLI RX|Unknown request in manager process (child not running).
**** v1    0.2 CLI RX|Type 'help' for more info.
**   v1    0.2 Stop
**** v1    0.2 CLI TX|stop
***  v1    0.2 CLI RX  300
**** v1    0.2 CLI RX|Child in state stopped
**** v1    0.2 CLI TX|status
***  v1    0.2 CLI RX  200
**** v1    0.2 CLI RX|Child in state stopped
**** v1    0.2 STDOUT poll 0x10
**   v1    0.2 R 23006 Status: 0000 (u 0.003902 s 0.016527)
*    diag  0.0 ............................................................
#    top  TEST ../../../bin/varnishtest/tests/r00655.vtc TIMED OUT (kill -9)
#    top  TEST ../../../bin/varnishtest/tests/r00655.vtc FAILED (60.001) signal=9

1 @ SunOS 5.11 i86pc 1.04 32_sun12.4 uplex

*    top   0.0 TEST ../../../bin/varnishtest/tests/r00655.vtc starting
[...]
*    top   0.0 TEST Test nested /*...*/ comments
[...]
**** v1    0.1 CLI TX|
**** v1    0.1 CLI TX|\t/* foo
**** v1    0.1 CLI TX|\t\t/* bar
**** v1    0.1 CLI TX|\t*/
**** v1    0.1 CLI TX|
**** v1    0.1 CLI TX|%XJEIFLH|)Xspa8P
***  v1    0.1 CLI RX  106
**** v1    0.1 CLI RX|Message from VCC-compiler:
**** v1    0.1 CLI RX|Security: Privilege proc_setid missing, will not change uid/gid
**** v1    0.1 CLI RX|/* ... */ comment contains /*
**** v1    0.1 CLI RX|('<vcl.inline>' Line 4 Pos 9)
**** v1    0.1 CLI RX|        /* foo
**** v1    0.1 CLI RX|--------##----
**** v1    0.1 CLI RX|
**** v1    0.1 CLI RX|('<vcl.inline>' Line 5 Pos 17)
**** v1    0.1 CLI RX|                /* bar
**** v1    0.1 CLI RX|----------------##----
**** v1    0.1 CLI RX|
**** v1    0.1 CLI RX|Running VCC-compiler failed, exited with 2
**** v1    0.1 CLI RX|VCL compilation failed
**   v1    0.1 VCL compilation failed (as expected)
***  v1    0.1 Found expected string: ("/* ... */ comment contains /*")
*    top   0.1 RESETTING after ../../../bin/varnishtest/tests/r00655.vtc
**   v1    0.1 Wait
**** v1    0.1 CLI TX|backend.list
***  v1    0.1 CLI RX  101
**** v1    0.1 CLI RX|Unknown request in manager process (child not running).
**** v1    0.1 CLI RX|Type 'help' for more info.
**   v1    0.1 Stop
**** v1    0.1 CLI TX|stop
***  v1    0.1 CLI RX  300
**** v1    0.1 CLI RX|Child in state stopped
**** v1    0.1 CLI TX|status
***  v1    0.1 CLI RX  200
**** v1    0.1 CLI RX|Child in state stopped
**** v1    0.1 STDOUT poll 0x10
**   v1    0.1 R 91527 Status: 0000 (u 0.004000 s 0.016000)
*    diag  0.0 ............................................................
#    top  TEST ../../../bin/varnishtest/tests/r00655.vtc TIMED OUT (kill -9)
#    top  TEST ../../../bin/varnishtest/tests/r00655.vtc FAILED (60.002) signal=9

1 @ Ubuntu LTS i686 1.04 fgs

*    top   0.0 TEST ../../../bin/varnishtest/tests/r00655.vtc starting
[...]
*    top   0.0 TEST Test nested /*...*/ comments
[...]
**** v1    0.1 CLI TX|
**** v1    0.1 CLI TX|
**** v1    0.1 CLI TX|\t/* foo
**** v1    0.1 CLI TX|\t\t/* bar
**** v1    0.1 CLI TX|\t*/
**** v1    0.1 CLI TX|
**** v1    0.1 CLI TX|%XJEIFLH|)Xspa8P
***  v1    0.1 CLI RX  106
**** v1    0.1 CLI RX|Message from VCC-compiler:
**** v1    0.1 CLI RX|/* ... */ comment contains /*
**** v1    0.1 CLI RX|('<vcl.inline>' Line 4 Pos 9)
**** v1    0.1 CLI RX|        /* foo
**** v1    0.1 CLI RX|--------##----
**** v1    0.1 CLI RX|
**** v1    0.1 CLI RX|('<vcl.inline>' Line 5 Pos 17)
**** v1    0.1 CLI RX|                /* bar
**** v1    0.1 CLI RX|----------------##----
**** v1    0.1 CLI RX|
**** v1    0.1 CLI RX|Running VCC-compiler failed, exited with 2
**** v1    0.1 CLI RX|VCL compilation failed
**   v1    0.1 VCL compilation failed (as expected)
***  v1    0.1 Found expected string: ("/* ... */ comment contains /*")
*    top   0.1 RESETTING after ../../../bin/varnishtest/tests/r00655.vtc
**   v1    0.1 Wait
**** v1    0.1 CLI TX|backend.list
***  v1    0.1 CLI RX  101
**** v1    0.1 CLI RX|Unknown request in manager process (child not running).
**** v1    0.1 CLI RX|Type 'help' for more info.
**   v1    0.1 Stop
**** v1    0.1 CLI TX|stop
***  v1    0.2 CLI RX  300
**** v1    0.2 CLI RX|Child in state stopped
**** v1    0.2 CLI TX|status
***  v1    0.2 CLI RX  200
**** v1    0.2 CLI RX|Child in state stopped
**** v1    0.2 STDOUT poll 0x10
**   v1    0.2 R 2032 Status: 0000 (u 0.004000 s 0.000000)
*    diag  0.0 ............................................................
#    top  TEST ../../../bin/varnishtest/tests/r00655.vtc TIMED OUT (kill -9)
#    top  TEST ../../../bin/varnishtest/tests/r00655.vtc FAILED (60.001) signal=9

bd4794e

1 @ Ubuntu LTS i686 1.04 fgs

*    top   0.0 TEST ../../../bin/varnishtest/tests/r00655.vtc starting
[...]
*    top   0.0 TEST Test nested /*...*/ comments
[...]
**** v1    0.1 CLI TX|vcl 4.0;
**** v1    0.1 CLI TX|
**** v1    0.1 CLI TX|
**** v1    0.1 CLI TX|\t/* foo
**** v1    0.1 CLI TX|\t\t/* bar
**** v1    0.1 CLI TX|\t*/
**** v1    0.1 CLI TX|
**** v1    0.1 CLI TX|%XJEIFLH|)Xspa8P
***  v1    0.1 CLI RX  106
**** v1    0.1 CLI RX|Message from VCC-compiler:
**** v1    0.1 CLI RX|/* ... */ comment contains /*
**** v1    0.1 CLI RX|('<vcl.inline>' Line 4 Pos 9)
**** v1    0.1 CLI RX|        /* foo
**** v1    0.1 CLI RX|--------##----
**** v1    0.1 CLI RX|
**** v1    0.1 CLI RX|('<vcl.inline>' Line 5 Pos 17)
**** v1    0.1 CLI RX|                /* bar
**** v1    0.1 CLI RX|----------------##----
**** v1    0.1 CLI RX|
**** v1    0.1 CLI RX|Running VCC-compiler failed, exited with 2
**** v1    0.1 CLI RX|VCL compilation failed
**   v1    0.1 VCL compilation failed (as expected)
***  v1    0.1 Found expected string: ("/* ... */ comment contains /*")
*    top   0.1 RESETTING after ../../../bin/varnishtest/tests/r00655.vtc
**   v1    0.1 Wait
**** v1    0.1 CLI TX|backend.list
***  v1    0.1 CLI RX  101
**** v1    0.1 CLI RX|Unknown request in manager process (child not running).
**** v1    0.1 CLI RX|Type 'help' for more info.
**   v1    0.1 Stop
**** v1    0.1 CLI TX|stop
***  v1    0.2 CLI RX  300
**** v1    0.2 CLI RX|Child in state stopped
**** v1    0.2 CLI TX|status
***  v1    0.2 CLI RX  200
**** v1    0.2 CLI RX|Child in state stopped
**** v1    0.2 STDOUT poll 0x10
**   v1    0.2 R 3327 Status: 0000 (u 0.000000 s 0.004000)
#    top  TEST ../../../bin/varnishtest/tests/r00655.vtc TIMED OUT (kill -9)
#    top  TEST ../../../bin/varnishtest/tests/r00655.vtc FAILED (60.086) signal=9

1 @ Ubuntu LTS i686 1.04 fgs

*    top   0.0 TEST ../../../bin/varnishtest/tests/r00655.vtc starting
[...]
*    top   0.0 TEST Test nested /*...*/ comments
[...]
**** v1    0.1 CLI TX|vcl 4.0;
**** v1    0.1 CLI TX|
**** v1    0.1 CLI TX|
**** v1    0.1 CLI TX|\t/* foo
**** v1    0.1 CLI TX|\t\t/* bar
**** v1    0.1 CLI TX|\t*/
**** v1    0.1 CLI TX|
**** v1    0.1 CLI TX|%XJEIFLH|)Xspa8P
***  v1    0.1 CLI RX  106
**** v1    0.1 CLI RX|Message from VCC-compiler:
**** v1    0.1 CLI RX|/* ... */ comment contains /*
**** v1    0.1 CLI RX|('<vcl.inline>' Line 4 Pos 9)
**** v1    0.1 CLI RX|        /* foo
**** v1    0.1 CLI RX|--------##----
**** v1    0.1 CLI RX|
**** v1    0.1 CLI RX|('<vcl.inline>' Line 5 Pos 17)
**** v1    0.1 CLI RX|                /* bar
**** v1    0.1 CLI RX|----------------##----
**** v1    0.1 CLI RX|
**** v1    0.1 CLI RX|Running VCC-compiler failed, exited with 2
**** v1    0.1 CLI RX|VCL compilation failed
**   v1    0.1 VCL compilation failed (as expected)
***  v1    0.1 Found expected string: ("/* ... */ comment contains /*")
*    top   0.1 RESETTING after ../../../bin/varnishtest/tests/r00655.vtc
**   v1    0.1 Wait
**** v1    0.1 CLI TX|backend.list
***  v1    0.1 CLI RX  101
**** v1    0.1 CLI RX|Unknown request in manager process (child not running).
**** v1    0.1 CLI RX|Type 'help' for more info.
**   v1    0.1 Stop
**** v1    0.1 CLI TX|stop
***  v1    0.2 CLI RX  300
**** v1    0.2 CLI RX|Child in state stopped
**** v1    0.2 CLI TX|status
***  v1    0.2 CLI RX  200
**** v1    0.2 CLI RX|Child in state stopped
**** v1    0.2 STDOUT poll 0x10
**   v1    0.2 R 15654 Status: 0000 (u 0.004000 s 0.004000)
#    top  TEST ../../../bin/varnishtest/tests/r00655.vtc TIMED OUT (kill -9)
#    top  TEST ../../../bin/varnishtest/tests/r00655.vtc FAILED (60.064) signal=9

1 @ Linux 3.10.0 x86_64 1.02 mblissett

*    top   0.0 TEST ../../../bin/varnishtest/tests/r00655.vtc starting
[...]
*    top   0.0 TEST Test nested /*...*/ comments
[...]
**** v1    0.1 CLI TX|vcl 4.0;
**** v1    0.1 CLI TX|
**** v1    0.1 CLI TX|
**** v1    0.1 CLI TX|\t/* foo
**** v1    0.1 CLI TX|\t\t/* bar
**** v1    0.1 CLI TX|\t*/
**** v1    0.1 CLI TX|
**** v1    0.1 CLI TX|%XJEIFLH|)Xspa8P
***  v1    0.1 CLI RX  106
**** v1    0.1 CLI RX|Message from VCC-compiler:
**** v1    0.1 CLI RX|/* ... */ comment contains /*
**** v1    0.1 CLI RX|('<vcl.inline>' Line 4 Pos 9)
**** v1    0.1 CLI RX|        /* foo
**** v1    0.1 CLI RX|--------##----
**** v1    0.1 CLI RX|
**** v1    0.1 CLI RX|('<vcl.inline>' Line 5 Pos 17)
**** v1    0.1 CLI RX|                /* bar
**** v1    0.1 CLI RX|----------------##----
**** v1    0.1 CLI RX|
**** v1    0.1 CLI RX|Running VCC-compiler failed, exited with 2
**** v1    0.1 CLI RX|VCL compilation failed
**   v1    0.1 VCL compilation failed (as expected)
***  v1    0.1 Found expected string: ("/* ... */ comment contains /*")
*    top   0.1 RESETTING after ../../../bin/varnishtest/tests/r00655.vtc
**   v1    0.1 Wait
**** v1    0.1 CLI TX|backend.list
***  v1    0.2 CLI RX  101
**** v1    0.2 CLI RX|Unknown request in manager process (child not running).
**** v1    0.2 CLI RX|Type 'help' for more info.
**   v1    0.2 Stop
**** v1    0.2 CLI TX|stop
***  v1    0.2 CLI RX  300
**** v1    0.2 CLI RX|Child in state stopped
**** v1    0.2 CLI TX|status
***  v1    0.2 CLI RX  200
**** v1    0.2 CLI RX|Child in state stopped
**** v1    0.2 STDOUT poll 0x10
**   v1    0.2 R 3956 Status: 0000 (u 0.003628 s 0.016541)
#    top  TEST ../../../bin/varnishtest/tests/r00655.vtc TIMED OUT (kill -9)
#    top  TEST ../../../bin/varnishtest/tests/r00655.vtc FAILED (60.056) signal=9

1 @ Ubuntu LTS i686 1.04 fgs

*    top   0.0 TEST ../../../bin/varnishtest/tests/r00655.vtc starting
[...]
*    top   0.0 TEST Test nested /*...*/ comments
[...]
**** v1    0.1 CLI TX|vcl 4.0;
**** v1    0.1 CLI TX|
**** v1    0.1 CLI TX|
**** v1    0.1 CLI TX|\t/* foo
**** v1    0.1 CLI TX|\t\t/* bar
**** v1    0.1 CLI TX|\t*/
**** v1    0.1 CLI TX|
**** v1    0.1 CLI TX|%XJEIFLH|)Xspa8P
***  v1    0.1 CLI RX  106
**** v1    0.1 CLI RX|Message from VCC-compiler:
**** v1    0.1 CLI RX|/* ... */ comment contains /*
**** v1    0.1 CLI RX|('<vcl.inline>' Line 4 Pos 9)
**** v1    0.1 CLI RX|        /* foo
**** v1    0.1 CLI RX|--------##----
**** v1    0.1 CLI RX|
**** v1    0.1 CLI RX|('<vcl.inline>' Line 5 Pos 17)
**** v1    0.1 CLI RX|                /* bar
**** v1    0.1 CLI RX|----------------##----
**** v1    0.1 CLI RX|
**** v1    0.1 CLI RX|Running VCC-compiler failed, exited with 2
**** v1    0.1 CLI RX|VCL compilation failed
**   v1    0.1 VCL compilation failed (as expected)
***  v1    0.1 Found expected string: ("/* ... */ comment contains /*")
*    top   0.1 RESETTING after ../../../bin/varnishtest/tests/r00655.vtc
**   v1    0.1 Wait
**** v1    0.1 CLI TX|backend.list
***  v1    0.1 CLI RX  101
**** v1    0.1 CLI RX|Unknown request in manager process (child not running).
**** v1    0.1 CLI RX|Type 'help' for more info.
**   v1    0.1 Stop
**** v1    0.1 CLI TX|stop
***  v1    0.2 CLI RX  300
**** v1    0.2 CLI RX|Child in state stopped
**** v1    0.2 CLI TX|status
***  v1    0.2 CLI RX  200
**** v1    0.2 CLI RX|Child in state stopped
**** v1    0.2 STDOUT poll 0x10
**   v1    0.2 R 9403 Status: 0000 (u 0.004000 s 0.000000)
#    top  TEST ../../../bin/varnishtest/tests/r00655.vtc TIMED OUT (kill -9)
#    top  TEST ../../../bin/varnishtest/tests/r00655.vtc FAILED (60.097) signal=9

1 @ Linux 3.10.0 x86_64 1.02 mblissett

*    top   0.0 TEST ../../../bin/varnishtest/tests/r00655.vtc starting
[...]
*    top   0.0 TEST Test nested /*...*/ comments
[...]
**** v1    0.1 CLI TX|
**** v1    0.1 CLI TX|
**** v1    0.1 CLI TX|\t/* foo
**** v1    0.1 CLI TX|\t\t/* bar
**** v1    0.1 CLI TX|\t*/
**** v1    0.1 CLI TX|
**** v1    0.1 CLI TX|%XJEIFLH|)Xspa8P
***  v1    0.1 CLI RX  106
**** v1    0.1 CLI RX|Message from VCC-compiler:
**** v1    0.1 CLI RX|/* ... */ comment contains /*
**** v1    0.1 CLI RX|('<vcl.inline>' Line 4 Pos 9)
**** v1    0.1 CLI RX|        /* foo
**** v1    0.1 CLI RX|--------##----
**** v1    0.1 CLI RX|
**** v1    0.1 CLI RX|('<vcl.inline>' Line 5 Pos 17)
**** v1    0.1 CLI RX|                /* bar
**** v1    0.1 CLI RX|----------------##----
**** v1    0.1 CLI RX|
**** v1    0.1 CLI RX|Running VCC-compiler failed, exited with 2
**** v1    0.1 CLI RX|VCL compilation failed
**   v1    0.1 VCL compilation failed (as expected)
***  v1    0.1 Found expected string: ("/* ... */ comment contains /*")
*    top   0.1 RESETTING after ../../../bin/varnishtest/tests/r00655.vtc
**   v1    0.1 Wait
**** v1    0.1 CLI TX|backend.list
***  v1    0.2 CLI RX  101
**** v1    0.2 CLI RX|Unknown request in manager process (child not running).
**** v1    0.2 CLI RX|Type 'help' for more info.
**   v1    0.2 Stop
**** v1    0.2 CLI TX|stop
***  v1    0.2 CLI RX  300
**** v1    0.2 CLI RX|Child in state stopped
**** v1    0.2 CLI TX|status
***  v1    0.2 CLI RX  200
**** v1    0.2 CLI RX|Child in state stopped
**** v1    0.2 STDOUT poll 0x10
**   v1    0.2 R 760 Status: 0000 (u 0.003268 s 0.009723)
---- v1   60.1 vsm|Could not get hold of varnishd, is it running?
*    top  60.1 TEST ../../../bin/varnishtest/tests/r00655.vtc FAILED
#    top  TEST ../../../bin/varnishtest/tests/r00655.vtc FAILED (60.060) exit=2

1 @ SunOS 5.11 i86pc 1.04 32_sun12.4 uplex

*    top   0.0 TEST ../../../bin/varnishtest/tests/r00655.vtc starting
[...]
*    top   0.0 TEST Test nested /*...*/ comments
[...]
**** v1    0.1 CLI TX|
**** v1    0.1 CLI TX|
**** v1    0.1 CLI TX|\t/* foo
**** v1    0.1 CLI TX|\t\t/* bar
**** v1    0.1 CLI TX|\t*/
**** v1    0.1 CLI TX|
**** v1    0.1 CLI TX|%XJEIFLH|)Xspa8P
***  v1    0.1 CLI RX  106
**** v1    0.1 CLI RX|Message from VCC-compiler:
**** v1    0.1 CLI RX|Security: Privilege proc_setid missing, will not change uid/gid
**** v1    0.1 CLI RX|/* ... */ comment contains /*
**** v1    0.1 CLI RX|('<vcl.inline>' Line 4 Pos 9)
**** v1    0.1 CLI RX|        /* foo
**** v1    0.1 CLI RX|--------##----
**** v1    0.1 CLI RX|
**** v1    0.1 CLI RX|('<vcl.inline>' Line 5 Pos 17)
**** v1    0.1 CLI RX|                /* bar
**** v1    0.1 CLI RX|----------------##----
**** v1    0.1 CLI RX|
**** v1    0.1 CLI RX|Running VCC-compiler failed, exited with 2
**** v1    0.1 CLI RX|VCL compilation failed
**   v1    0.1 VCL compilation failed (as expected)
***  v1    0.1 Found expected string: ("/* ... */ comment contains /*")
*    top   0.1 RESETTING after ../../../bin/varnishtest/tests/r00655.vtc
**   v1    0.1 Wait
**** v1    0.1 CLI TX|backend.list
***  v1    0.1 CLI RX  101
**** v1    0.1 CLI RX|Unknown request in manager process (child not running).
**** v1    0.1 CLI RX|Type 'help' for more info.
**   v1    0.1 Stop
**** v1    0.1 CLI TX|stop
***  v1    0.1 CLI RX  300
**** v1    0.1 CLI RX|Child in state stopped
**** v1    0.1 CLI TX|status
***  v1    0.1 CLI RX  200
**** v1    0.1 CLI RX|Child in state stopped
**** v1    0.1 STDOUT poll 0x10
**   v1    0.1 R 12297 Status: 0000 (u 0.004000 s 0.016000)
#    top  TEST ../../../bin/varnishtest/tests/r00655.vtc TIMED OUT (kill -9)
#    top  TEST ../../../bin/varnishtest/tests/r00655.vtc FAILED (60.002) signal=9

1 @ SunOS 5.11 i86pc 1.04 32_sun12.4 uplex

*    top   0.0 TEST ../../../bin/varnishtest/tests/r00655.vtc starting
[...]
*    top   0.0 TEST Test nested /*...*/ comments
[...]
**** v1    0.1 CLI TX|
**** v1    0.1 CLI TX|
**** v1    0.1 CLI TX|\t/* foo
**** v1    0.1 CLI TX|\t\t/* bar
**** v1    0.1 CLI TX|\t*/
**** v1    0.1 CLI TX|
**** v1    0.1 CLI TX|%XJEIFLH|)Xspa8P
***  v1    0.1 CLI RX  106
**** v1    0.1 CLI RX|Message from VCC-compiler:
**** v1    0.1 CLI RX|Security: Privilege proc_setid missing, will not change uid/gid
**** v1    0.1 CLI RX|/* ... */ comment contains /*
**** v1    0.1 CLI RX|('<vcl.inline>' Line 4 Pos 9)
**** v1    0.1 CLI RX|        /* foo
**** v1    0.1 CLI RX|--------##----
**** v1    0.1 CLI RX|
**** v1    0.1 CLI RX|('<vcl.inline>' Line 5 Pos 17)
**** v1    0.1 CLI RX|                /* bar
**** v1    0.1 CLI RX|----------------##----
**** v1    0.1 CLI RX|
**** v1    0.1 CLI RX|Running VCC-compiler failed, exited with 2
**** v1    0.1 CLI RX|VCL compilation failed
**   v1    0.1 VCL compilation failed (as expected)
***  v1    0.1 Found expected string: ("/* ... */ comment contains /*")
*    top   0.1 RESETTING after ../../../bin/varnishtest/tests/r00655.vtc
**   v1    0.1 Wait
**** v1    0.1 CLI TX|backend.list
***  v1    0.1 CLI RX  101
**** v1    0.1 CLI RX|Unknown request in manager process (child not running).
**** v1    0.1 CLI RX|Type 'help' for more info.
**   v1    0.1 Stop
**** v1    0.1 CLI TX|stop
***  v1    0.1 CLI RX  300
**** v1    0.1 CLI RX|Child in state stopped
**** v1    0.1 CLI TX|status
***  v1    0.1 CLI RX  200
**** v1    0.1 CLI RX|Child in state stopped
**** v1    0.1 STDOUT poll 0x10
**   v1    0.1 R 74331 Status: 0000 (u 0.004000 s 0.017000)
#    top  TEST ../../../bin/varnishtest/tests/r00655.vtc TIMED OUT (kill -9)
#    top  TEST ../../../bin/varnishtest/tests/r00655.vtc FAILED (60.002) signal=9

1 @ Linux 3.10.0 x86_64 1.02 mblissett

*    top   0.0 TEST ../../../bin/varnishtest/tests/r00655.vtc starting
[...]
*    top   0.0 TEST Test nested /*...*/ comments
[...]
**** v1    0.1 CLI TX|
**** v1    0.1 CLI TX|
**** v1    0.1 CLI TX|\t/* foo
**** v1    0.1 CLI TX|\t\t/* bar
**** v1    0.1 CLI TX|\t*/
**** v1    0.1 CLI TX|
**** v1    0.1 CLI TX|%XJEIFLH|)Xspa8P
***  v1    0.1 CLI RX  106
**** v1    0.1 CLI RX|Message from VCC-compiler:
**** v1    0.1 CLI RX|/* ... */ comment contains /*
**** v1    0.1 CLI RX|('<vcl.inline>' Line 4 Pos 9)
**** v1    0.1 CLI RX|        /* foo
**** v1    0.1 CLI RX|--------##----
**** v1    0.1 CLI RX|
**** v1    0.1 CLI RX|('<vcl.inline>' Line 5 Pos 17)
**** v1    0.1 CLI RX|                /* bar
**** v1    0.1 CLI RX|----------------##----
**** v1    0.1 CLI RX|
**** v1    0.1 CLI RX|Running VCC-compiler failed, exited with 2
**** v1    0.1 CLI RX|VCL compilation failed
**   v1    0.1 VCL compilation failed (as expected)
***  v1    0.1 Found expected string: ("/* ... */ comment contains /*")
*    top   0.1 RESETTING after ../../../bin/varnishtest/tests/r00655.vtc
**   v1    0.1 Wait
**** v1    0.1 CLI TX|backend.list
***  v1    0.2 CLI RX  101
**** v1    0.2 CLI RX|Unknown request in manager process (child not running).
**** v1    0.2 CLI RX|Type 'help' for more info.
**   v1    0.2 Stop
**** v1    0.2 CLI TX|stop
***  v1    0.2 CLI RX  300
**** v1    0.2 CLI RX|Child in state stopped
**** v1    0.2 CLI TX|status
***  v1    0.2 CLI RX  200
**** v1    0.2 CLI RX|Child in state stopped
**** v1    0.2 STDOUT poll 0x10
**   v1    0.2 R 13610 Status: 0000 (u 0.004620 s 0.014156)
---- v1   60.1 vsm|Could not get hold of varnishd, is it running?
*    top  60.1 TEST ../../../bin/varnishtest/tests/r00655.vtc FAILED
#    top  TEST ../../../bin/varnishtest/tests/r00655.vtc FAILED (60.055) exit=2

1 @ Linux 3.10.0 x86_64 1.02 mblissett

*    top   0.0 TEST ../../../bin/varnishtest/tests/r00655.vtc starting
[...]
*    top   0.0 TEST Test nested /*...*/ comments
[...]
**** v1    0.1 CLI TX|
**** v1    0.1 CLI TX|
**** v1    0.1 CLI TX|\t/* foo
**** v1    0.1 CLI TX|\t\t/* bar
**** v1    0.1 CLI TX|\t*/
**** v1    0.1 CLI TX|
**** v1    0.1 CLI TX|%XJEIFLH|)Xspa8P
***  v1    0.1 CLI RX  106
**** v1    0.1 CLI RX|Message from VCC-compiler:
**** v1    0.1 CLI RX|/* ... */ comment contains /*
**** v1    0.1 CLI RX|('<vcl.inline>' Line 4 Pos 9)
**** v1    0.1 CLI RX|        /* foo
**** v1    0.1 CLI RX|--------##----
**** v1    0.1 CLI RX|
**** v1    0.1 CLI RX|('<vcl.inline>' Line 5 Pos 17)
**** v1    0.1 CLI RX|                /* bar
**** v1    0.1 CLI RX|----------------##----
**** v1    0.1 CLI RX|
**** v1    0.1 CLI RX|Running VCC-compiler failed, exited with 2
**** v1    0.1 CLI RX|VCL compilation failed
**   v1    0.1 VCL compilation failed (as expected)
***  v1    0.1 Found expected string: ("/* ... */ comment contains /*")
*    top   0.1 RESETTING after ../../../bin/varnishtest/tests/r00655.vtc
**   v1    0.1 Wait
**** v1    0.1 CLI TX|backend.list
***  v1    0.2 CLI RX  101
**** v1    0.2 CLI RX|Unknown request in manager process (child not running).
**** v1    0.2 CLI RX|Type 'help' for more info.
**   v1    0.2 Stop
**** v1    0.2 CLI TX|stop
***  v1    0.2 CLI RX  300
**** v1    0.2 CLI RX|Child in state stopped
**** v1    0.2 CLI TX|status
***  v1    0.2 CLI RX  200
**** v1    0.2 CLI RX|Child in state stopped
**** v1    0.2 STDOUT poll 0x10
**   v1    0.2 R 10484 Status: 0000 (u 0.003639 s 0.008702)
---- v1   60.1 vsm|Could not get hold of varnishd, is it running?
*    top  60.1 TEST ../../../bin/varnishtest/tests/r00655.vtc FAILED
#    top  TEST ../../../bin/varnishtest/tests/r00655.vtc FAILED (60.066) exit=2

1 @ Linux 3.10.0 x86_64 1.02 mblissett

*    top   0.0 TEST ../../../bin/varnishtest/tests/r00655.vtc starting
[...]
*    top   0.0 TEST Test nested /*...*/ comments
[...]
**** v1    0.1 CLI TX|
**** v1    0.1 CLI TX|
**** v1    0.1 CLI TX|\t/* foo
**** v1    0.1 CLI TX|\t\t/* bar
**** v1    0.1 CLI TX|\t*/
**** v1    0.1 CLI TX|
**** v1    0.1 CLI TX|%XJEIFLH|)Xspa8P
***  v1    0.1 CLI RX  106
**** v1    0.1 CLI RX|Message from VCC-compiler:
**** v1    0.1 CLI RX|/* ... */ comment contains /*
**** v1    0.1 CLI RX|('<vcl.inline>' Line 4 Pos 9)
**** v1    0.1 CLI RX|        /* foo
**** v1    0.1 CLI RX|--------##----
**** v1    0.1 CLI RX|
**** v1    0.1 CLI RX|('<vcl.inline>' Line 5 Pos 17)
**** v1    0.1 CLI RX|                /* bar
**** v1    0.1 CLI RX|----------------##----
**** v1    0.1 CLI RX|
**** v1    0.1 CLI RX|Running VCC-compiler failed, exited with 2
**** v1    0.1 CLI RX|VCL compilation failed
**   v1    0.1 VCL compilation failed (as expected)
***  v1    0.1 Found expected string: ("/* ... */ comment contains /*")
*    top   0.1 RESETTING after ../../../bin/varnishtest/tests/r00655.vtc
**   v1    0.1 Wait
**** v1    0.1 CLI TX|backend.list
***  v1    0.2 CLI RX  101
**** v1    0.2 CLI RX|Unknown request in manager process (child not running).
**** v1    0.2 CLI RX|Type 'help' for more info.
**   v1    0.2 Stop
**** v1    0.2 CLI TX|stop
***  v1    0.2 CLI RX  300
**** v1    0.2 CLI RX|Child in state stopped
**** v1    0.2 CLI TX|status
***  v1    0.2 CLI RX  200
**** v1    0.2 CLI RX|Child in state stopped
**** v1    0.2 STDOUT poll 0x10
**   v1    0.2 R 19815 Status: 0000 (u 0.005943 s 0.009567)
---- v1   60.1 vsm|Could not get hold of varnishd, is it running?
*    top  60.1 TEST ../../../bin/varnishtest/tests/r00655.vtc FAILED
#    top  TEST ../../../bin/varnishtest/tests/r00655.vtc FAILED (60.060) exit=2

1 @ Linux 3.10.0 x86_64 1.02 mblissett

*    top   0.0 TEST ../../../bin/varnishtest/tests/r00655.vtc starting
[...]
*    top   0.0 TEST Test nested /*...*/ comments
[...]
**** v1    0.1 CLI TX|
**** v1    0.1 CLI TX|
**** v1    0.1 CLI TX|\t/* foo
**** v1    0.1 CLI TX|\t\t/* bar
**** v1    0.1 CLI TX|\t*/
**** v1    0.1 CLI TX|
**** v1    0.1 CLI TX|%XJEIFLH|)Xspa8P
***  v1    0.1 CLI RX  106
**** v1    0.1 CLI RX|Message from VCC-compiler:
**** v1    0.1 CLI RX|/* ... */ comment contains /*
**** v1    0.1 CLI RX|('<vcl.inline>' Line 4 Pos 9)
**** v1    0.1 CLI RX|        /* foo
**** v1    0.1 CLI RX|--------##----
**** v1    0.1 CLI RX|
**** v1    0.1 CLI RX|('<vcl.inline>' Line 5 Pos 17)
**** v1    0.1 CLI RX|                /* bar
**** v1    0.1 CLI RX|----------------##----
**** v1    0.1 CLI RX|
**** v1    0.1 CLI RX|Running VCC-compiler failed, exited with 2
**** v1    0.1 CLI RX|VCL compilation failed
**   v1    0.1 VCL compilation failed (as expected)
***  v1    0.1 Found expected string: ("/* ... */ comment contains /*")
*    top   0.1 RESETTING after ../../../bin/varnishtest/tests/r00655.vtc
**   v1    0.1 Wait
**** v1    0.1 CLI TX|backend.list
***  v1    0.2 CLI RX  101
**** v1    0.2 CLI RX|Unknown request in manager process (child not running).
**** v1    0.2 CLI RX|Type 'help' for more info.
**   v1    0.2 Stop
**** v1    0.2 CLI TX|stop
***  v1    0.2 CLI RX  300
**** v1    0.2 CLI RX|Child in state stopped
**** v1    0.2 CLI TX|status
***  v1    0.2 CLI RX  200
**** v1    0.2 CLI RX|Child in state stopped
**** v1    0.2 STDOUT poll 0x10
**   v1    0.2 R 30068 Status: 0000 (u 0.004717 s 0.011957)
---- v1   60.0 vsm|Could not get hold of varnishd, is it running?
*    top  60.0 TEST ../../../bin/varnishtest/tests/r00655.vtc FAILED
#    top  TEST ../../../bin/varnishtest/tests/r00655.vtc FAILED (60.050) exit=2

1 @ Ubuntu LTS i686 1.04 fgs

*    top   0.0 TEST ../../../bin/varnishtest/tests/r00655.vtc starting
[...]
*    top   0.0 TEST Test nested /*...*/ comments
[...]
**** v1    0.1 CLI TX|vcl 4.0;
**** v1    0.1 CLI TX|
**** v1    0.1 CLI TX|
**** v1    0.1 CLI TX|\t/* foo
**** v1    0.1 CLI TX|\t\t/* bar
**** v1    0.1 CLI TX|\t*/
**** v1    0.1 CLI TX|
**** v1    0.1 CLI TX|%XJEIFLH|)Xspa8P
***  v1    0.1 CLI RX  106
**** v1    0.1 CLI RX|Message from VCC-compiler:
**** v1    0.1 CLI RX|/* ... */ comment contains /*
**** v1    0.1 CLI RX|('<vcl.inline>' Line 4 Pos 9)
**** v1    0.1 CLI RX|        /* foo
**** v1    0.1 CLI RX|--------##----
**** v1    0.1 CLI RX|
**** v1    0.1 CLI RX|('<vcl.inline>' Line 5 Pos 17)
**** v1    0.1 CLI RX|                /* bar
**** v1    0.1 CLI RX|----------------##----
**** v1    0.1 CLI RX|
**** v1    0.1 CLI RX|Running VCC-compiler failed, exited with 2
**** v1    0.1 CLI RX|VCL compilation failed
**   v1    0.1 VCL compilation failed (as expected)
***  v1    0.1 Found expected string: ("/* ... */ comment contains /*")
*    top   0.1 RESETTING after ../../../bin/varnishtest/tests/r00655.vtc
**   v1    0.1 Wait
**** v1    0.1 CLI TX|backend.list
***  v1    0.1 CLI RX  101
**** v1    0.1 CLI RX|Unknown request in manager process (child not running).
**** v1    0.1 CLI RX|Type 'help' for more info.
**   v1    0.1 Stop
**** v1    0.1 CLI TX|stop
***  v1    0.2 CLI RX  300
**** v1    0.2 CLI RX|Child in state stopped
**** v1    0.2 CLI TX|status
***  v1    0.2 CLI RX  200
**** v1    0.2 CLI RX|Child in state stopped
**** v1    0.2 STDOUT poll 0x10
**   v1    0.2 R 12413 Status: 0000 (u 0.004000 s 0.000000)
#    top  TEST ../../../bin/varnishtest/tests/r00655.vtc TIMED OUT (kill -9)
#    top  TEST ../../../bin/varnishtest/tests/r00655.vtc FAILED (60.100) signal=9

1 @ Ubuntu LTS i686 1.04 fgs

*    top   0.0 TEST ../../../bin/varnishtest/tests/r00655.vtc starting
[...]
*    top   0.0 TEST Test nested /*...*/ comments
[...]
**** v1    0.1 CLI TX|vcl 4.0;
**** v1    0.1 CLI TX|
**** v1    0.1 CLI TX|
**** v1    0.1 CLI TX|\t/* foo
**** v1    0.1 CLI TX|\t\t/* bar
**** v1    0.1 CLI TX|\t*/
**** v1    0.1 CLI TX|
**** v1    0.1 CLI TX|%XJEIFLH|)Xspa8P
***  v1    0.1 CLI RX  106
**** v1    0.1 CLI RX|Message from VCC-compiler:
**** v1    0.1 CLI RX|/* ... */ comment contains /*
**** v1    0.1 CLI RX|('<vcl.inline>' Line 4 Pos 9)
**** v1    0.1 CLI RX|        /* foo
**** v1    0.1 CLI RX|--------##----
**** v1    0.1 CLI RX|
**** v1    0.1 CLI RX|('<vcl.inline>' Line 5 Pos 17)
**** v1    0.1 CLI RX|                /* bar
**** v1    0.1 CLI RX|----------------##----
**** v1    0.1 CLI RX|
**** v1    0.1 CLI RX|Running VCC-compiler failed, exited with 2
**** v1    0.1 CLI RX|VCL compilation failed
**   v1    0.1 VCL compilation failed (as expected)
***  v1    0.1 Found expected string: ("/* ... */ comment contains /*")
*    top   0.1 RESETTING after ../../../bin/varnishtest/tests/r00655.vtc
**   v1    0.1 Wait
**** v1    0.1 CLI TX|backend.list
***  v1    0.1 CLI RX  101
**** v1    0.1 CLI RX|Unknown request in manager process (child not running).
**** v1    0.1 CLI RX|Type 'help' for more info.
**   v1    0.1 Stop
**** v1    0.1 CLI TX|stop
***  v1    0.2 CLI RX  300
**** v1    0.2 CLI RX|Child in state stopped
**** v1    0.2 CLI TX|status
***  v1    0.2 CLI RX  200
**** v1    0.2 CLI RX|Child in state stopped
**** v1    0.2 STDOUT poll 0x10
**   v1    0.2 R 32743 Status: 0000 (u 0.000000 s 0.004000)
#    top  TEST ../../../bin/varnishtest/tests/r00655.vtc TIMED OUT (kill -9)
#    top  TEST ../../../bin/varnishtest/tests/r00655.vtc FAILED (60.092) signal=9

1 @ SunOS 5.11 i86pc 1.04 32_sun12.4 uplex

*    top   0.0 TEST ../../../bin/varnishtest/tests/r00655.vtc starting
[...]
*    top   0.0 TEST Test nested /*...*/ comments
[...]
**** v1    0.1 CLI TX|
**** v1    0.1 CLI TX|
**** v1    0.1 CLI TX|\t/* foo
**** v1    0.1 CLI TX|\t\t/* bar
**** v1    0.1 CLI TX|\t*/
**** v1    0.1 CLI TX|
**** v1    0.1 CLI TX|%XJEIFLH|)Xspa8P
***  v1    0.1 CLI RX  106
**** v1    0.1 CLI RX|Message from VCC-compiler:
**** v1    0.1 CLI RX|Security: Privilege proc_setid missing, will not change uid/gid
**** v1    0.1 CLI RX|/* ... */ comment contains /*
**** v1    0.1 CLI RX|('<vcl.inline>' Line 4 Pos 9)
**** v1    0.1 CLI RX|        /* foo
**** v1    0.1 CLI RX|--------##----
**** v1    0.1 CLI RX|
**** v1    0.1 CLI RX|('<vcl.inline>' Line 5 Pos 17)
**** v1    0.1 CLI RX|                /* bar
**** v1    0.1 CLI RX|----------------##----
**** v1    0.1 CLI RX|
**** v1    0.1 CLI RX|Running VCC-compiler failed, exited with 2
**** v1    0.1 CLI RX|VCL compilation failed
**   v1    0.1 VCL compilation failed (as expected)
***  v1    0.1 Found expected string: ("/* ... */ comment contains /*")
*    top   0.1 RESETTING after ../../../bin/varnishtest/tests/r00655.vtc
**   v1    0.1 Wait
**** v1    0.1 CLI TX|backend.list
***  v1    0.1 CLI RX  101
**** v1    0.1 CLI RX|Unknown request in manager process (child not running).
**** v1    0.1 CLI RX|Type 'help' for more info.
**   v1    0.1 Stop
**** v1    0.1 CLI TX|stop
***  v1    0.1 CLI RX  300
**** v1    0.1 CLI RX|Child in state stopped
**** v1    0.1 CLI TX|status
***  v1    0.1 CLI RX  200
**** v1    0.1 CLI RX|Child in state stopped
**** v1    0.1 STDOUT poll 0x10
**   v1    0.1 R 23770 Status: 0000 (u 0.005000 s 0.020000)
#    top  TEST ../../../bin/varnishtest/tests/r00655.vtc TIMED OUT (kill -9)
#    top  TEST ../../../bin/varnishtest/tests/r00655.vtc FAILED (60.002) signal=9

1 @ Linux 3.10.0 x86_64 1.02 mblissett

*    top   0.0 TEST ../../../bin/varnishtest/tests/r00655.vtc starting
[...]
*    top   0.0 TEST Test nested /*...*/ comments
[...]
**** v1    0.1 CLI TX|vcl 4.0;
**** v1    0.1 CLI TX|
**** v1    0.1 CLI TX|
**** v1    0.1 CLI TX|\t/* foo
**** v1    0.1 CLI TX|\t\t/* bar
**** v1    0.1 CLI TX|\t*/
**** v1    0.1 CLI TX|
**** v1    0.1 CLI TX|%XJEIFLH|)Xspa8P
***  v1    0.1 CLI RX  106
**** v1    0.1 CLI RX|Message from VCC-compiler:
**** v1    0.1 CLI RX|/* ... */ comment contains /*
**** v1    0.1 CLI RX|('<vcl.inline>' Line 4 Pos 9)
**** v1    0.1 CLI RX|        /* foo
**** v1    0.1 CLI RX|--------##----
**** v1    0.1 CLI RX|
**** v1    0.1 CLI RX|('<vcl.inline>' Line 5 Pos 17)
**** v1    0.1 CLI RX|                /* bar
**** v1    0.1 CLI RX|----------------##----
**** v1    0.1 CLI RX|
**** v1    0.1 CLI RX|Running VCC-compiler failed, exited with 2
**** v1    0.1 CLI RX|VCL compilation failed
**   v1    0.1 VCL compilation failed (as expected)
***  v1    0.1 Found expected string: ("/* ... */ comment contains /*")
*    top   0.1 RESETTING after ../../../bin/varnishtest/tests/r00655.vtc
**   v1    0.1 Wait
**** v1    0.1 CLI TX|backend.list
***  v1    0.2 CLI RX  101
**** v1    0.2 CLI RX|Unknown request in manager process (child not running).
**** v1    0.2 CLI RX|Type 'help' for more info.
**   v1    0.2 Stop
**** v1    0.2 CLI TX|stop
***  v1    0.2 CLI RX  300
**** v1    0.2 CLI RX|Child in state stopped
**** v1    0.2 CLI TX|status
***  v1    0.2 CLI RX  200
**** v1    0.2 CLI RX|Child in state stopped
**** v1    0.2 STDOUT poll 0x10
**   v1    0.2 R 7108 Status: 0000 (u 0.003045 s 0.011042)
#    top  TEST ../../../bin/varnishtest/tests/r00655.vtc TIMED OUT (kill -9)
#    top  TEST ../../../bin/varnishtest/tests/r00655.vtc FAILED (60.019) signal=9

1 @ Ubuntu LTS i686 1.04 fgs

*    top   0.0 TEST ../../../bin/varnishtest/tests/r00655.vtc starting
[...]
*    top   0.0 TEST Test nested /*...*/ comments
[...]
**** v1    0.1 CLI TX|vcl 4.0;
**** v1    0.1 CLI TX|
**** v1    0.1 CLI TX|
**** v1    0.1 CLI TX|\t/* foo
**** v1    0.1 CLI TX|\t\t/* bar
**** v1    0.1 CLI TX|\t*/
**** v1    0.1 CLI TX|
**** v1    0.1 CLI TX|%XJEIFLH|)Xspa8P
***  v1    0.1 CLI RX  106
**** v1    0.1 CLI RX|Message from VCC-compiler:
**** v1    0.1 CLI RX|/* ... */ comment contains /*
**** v1    0.1 CLI RX|('<vcl.inline>' Line 4 Pos 9)
**** v1    0.1 CLI RX|        /* foo
**** v1    0.1 CLI RX|--------##----
**** v1    0.1 CLI RX|
**** v1    0.1 CLI RX|('<vcl.inline>' Line 5 Pos 17)
**** v1    0.1 CLI RX|                /* bar
**** v1    0.1 CLI RX|----------------##----
**** v1    0.1 CLI RX|
**** v1    0.1 CLI RX|Running VCC-compiler failed, exited with 2
**** v1    0.1 CLI RX|VCL compilation failed
**   v1    0.1 VCL compilation failed (as expected)
***  v1    0.1 Found expected string: ("/* ... */ comment contains /*")
*    top   0.1 RESETTING after ../../../bin/varnishtest/tests/r00655.vtc
**   v1    0.1 Wait
**** v1    0.1 CLI TX|backend.list
***  v1    0.2 CLI RX  101
**** v1    0.2 CLI RX|Unknown request in manager process (child not running).
**** v1    0.2 CLI RX|Type 'help' for more info.
**   v1    0.2 Stop
**** v1    0.2 CLI TX|stop
***  v1    0.2 CLI RX  300
**** v1    0.2 CLI RX|Child in state stopped
**** v1    0.2 CLI TX|status
***  v1    0.2 CLI RX  200
**** v1    0.2 CLI RX|Child in state stopped
**** v1    0.2 STDOUT poll 0x10
**   v1    0.2 R 29491 Status: 0000 (u 0.004000 s 0.000000)
#    top  TEST ../../../bin/varnishtest/tests/r00655.vtc TIMED OUT (kill -9)
#    top  TEST ../../../bin/varnishtest/tests/r00655.vtc FAILED (60.099) signal=9

1 @ Ubuntu LTS i686 1.04 fgs

*    top   0.0 TEST ../../../bin/varnishtest/tests/r00655.vtc starting
[...]
*    top   0.0 TEST Test nested /*...*/ comments
[...]
**** v1    0.1 CLI TX|vcl 4.0;
**** v1    0.1 CLI TX|
**** v1    0.1 CLI TX|
**** v1    0.1 CLI TX|\t/* foo
**** v1    0.1 CLI TX|\t\t/* bar
**** v1    0.1 CLI TX|\t*/
**** v1    0.1 CLI TX|
**** v1    0.1 CLI TX|%XJEIFLH|)Xspa8P
***  v1    0.1 CLI RX  106
**** v1    0.1 CLI RX|Message from VCC-compiler:
**** v1    0.1 CLI RX|/* ... */ comment contains /*
**** v1    0.1 CLI RX|('<vcl.inline>' Line 4 Pos 9)
**** v1    0.1 CLI RX|        /* foo
**** v1    0.1 CLI RX|--------##----
**** v1    0.1 CLI RX|
**** v1    0.1 CLI RX|('<vcl.inline>' Line 5 Pos 17)
**** v1    0.1 CLI RX|                /* bar
**** v1    0.1 CLI RX|----------------##----
**** v1    0.1 CLI RX|
**** v1    0.1 CLI RX|Running VCC-compiler failed, exited with 2
**** v1    0.1 CLI RX|VCL compilation failed
**   v1    0.1 VCL compilation failed (as expected)
***  v1    0.1 Found expected string: ("/* ... */ comment contains /*")
*    top   0.1 RESETTING after ../../../bin/varnishtest/tests/r00655.vtc
**   v1    0.1 Wait
**** v1    0.1 CLI TX|backend.list
***  v1    0.2 CLI RX  101
**** v1    0.2 CLI RX|Unknown request in manager process (child not running).
**** v1    0.2 CLI RX|Type 'help' for more info.
**   v1    0.2 Stop
**** v1    0.2 CLI TX|stop
***  v1    0.2 CLI RX  300
**** v1    0.2 CLI RX|Child in state stopped
**** v1    0.2 CLI TX|status
***  v1    0.2 CLI RX  200
**** v1    0.2 CLI RX|Child in state stopped
**** v1    0.2 STDOUT poll 0x10
**   v1    0.2 R 18884 Status: 0000 (u 0.000000 s 0.008000)
#    top  TEST ../../../bin/varnishtest/tests/r00655.vtc TIMED OUT (kill -9)
#    top  TEST ../../../bin/varnishtest/tests/r00655.vtc FAILED (60.099) signal=9

1 @ Ubuntu LTS i686 1.04 fgs

*    top   0.0 TEST ../../../bin/varnishtest/tests/r00655.vtc starting
[...]
*    top   0.0 TEST Test nested /*...*/ comments
[...]
**** v1    0.1 CLI TX|vcl 4.0;
**** v1    0.1 CLI TX|
**** v1    0.1 CLI TX|
**** v1    0.1 CLI TX|\t/* foo
**** v1    0.1 CLI TX|\t\t/* bar
**** v1    0.1 CLI TX|\t*/
**** v1    0.1 CLI TX|
**** v1    0.1 CLI TX|%XJEIFLH|)Xspa8P
***  v1    0.1 CLI RX  106
**** v1    0.1 CLI RX|Message from VCC-compiler:
**** v1    0.1 CLI RX|/* ... */ comment contains /*
**** v1    0.1 CLI RX|('<vcl.inline>' Line 4 Pos 9)
**** v1    0.1 CLI RX|        /* foo
**** v1    0.1 CLI RX|--------##----
**** v1    0.1 CLI RX|
**** v1    0.1 CLI RX|('<vcl.inline>' Line 5 Pos 17)
**** v1    0.1 CLI RX|                /* bar
**** v1    0.1 CLI RX|----------------##----
**** v1    0.1 CLI RX|
**** v1    0.1 CLI RX|Running VCC-compiler failed, exited with 2
**** v1    0.1 CLI RX|VCL compilation failed
**   v1    0.1 VCL compilation failed (as expected)
***  v1    0.1 Found expected string: ("/* ... */ comment contains /*")
*    top   0.1 RESETTING after ../../../bin/varnishtest/tests/r00655.vtc
**   v1    0.1 Wait
**** v1    0.1 CLI TX|backend.list
***  v1    0.1 CLI RX  101
**** v1    0.1 CLI RX|Unknown request in manager process (child not running).
**** v1    0.1 CLI RX|Type 'help' for more info.
**   v1    0.1 Stop
**** v1    0.1 CLI TX|stop
***  v1    0.2 CLI RX  300
**** v1    0.2 CLI RX|Child in state stopped
**** v1    0.2 CLI TX|status
***  v1    0.2 CLI RX  200
**** v1    0.2 CLI RX|Child in state stopped
**** v1    0.2 STDOUT poll 0x10
**   v1    0.2 R 6243 Status: 0000 (u 0.000000 s 0.004000)
#    top  TEST ../../../bin/varnishtest/tests/r00655.vtc TIMED OUT (kill -9)
#    top  TEST ../../../bin/varnishtest/tests/r00655.vtc FAILED (60.086) signal=9

1 @ SunOS 5.11 i86pc 1.04 32_sun12.4 uplex

*    top   0.0 TEST ../../../bin/varnishtest/tests/r00655.vtc starting
[...]
*    top   0.0 TEST Test nested /*...*/ comments
[...]
**** v1    0.1 CLI TX|
**** v1    0.1 CLI TX|
**** v1    0.1 CLI TX|\t/* foo
**** v1    0.1 CLI TX|\t\t/* bar
**** v1    0.1 CLI TX|\t*/
**** v1    0.1 CLI TX|
**** v1    0.1 CLI TX|%XJEIFLH|)Xspa8P
***  v1    0.1 CLI RX  106
**** v1    0.1 CLI RX|Message from VCC-compiler:
**** v1    0.1 CLI RX|Security: Privilege proc_setid missing, will not change uid/gid
**** v1    0.1 CLI RX|/* ... */ comment contains /*
**** v1    0.1 CLI RX|('<vcl.inline>' Line 4 Pos 9)
**** v1    0.1 CLI RX|        /* foo
**** v1    0.1 CLI RX|--------##----
**** v1    0.1 CLI RX|
**** v1    0.1 CLI RX|('<vcl.inline>' Line 5 Pos 17)
**** v1    0.1 CLI RX|                /* bar
**** v1    0.1 CLI RX|----------------##----
**** v1    0.1 CLI RX|
**** v1    0.1 CLI RX|Running VCC-compiler failed, exited with 2
**** v1    0.1 CLI RX|VCL compilation failed
**   v1    0.1 VCL compilation failed (as expected)
***  v1    0.1 Found expected string: ("/* ... */ comment contains /*")
*    top   0.1 RESETTING after ../../../bin/varnishtest/tests/r00655.vtc
**   v1    0.1 Wait
**** v1    0.1 CLI TX|backend.list
***  v1    0.1 CLI RX  101
**** v1    0.1 CLI RX|Unknown request in manager process (child not running).
**** v1    0.1 CLI RX|Type 'help' for more info.
**   v1    0.1 Stop
**** v1    0.1 CLI TX|stop
***  v1    0.1 CLI RX  300
**** v1    0.1 CLI RX|Child in state stopped
**** v1    0.1 CLI TX|status
***  v1    0.1 CLI RX  200
**** v1    0.1 CLI RX|Child in state stopped
**** v1    0.1 STDOUT poll 0x10
**   v1    0.1 R 71092 Status: 0000 (u 0.004000 s 0.017000)
#    top  TEST ../../../bin/varnishtest/tests/r00655.vtc TIMED OUT (kill -9)
#    top  TEST ../../../bin/varnishtest/tests/r00655.vtc FAILED (60.002) signal=9

1 @ SunOS 5.11 i86pc 1.04 32_sun12.4 uplex

*    top   0.0 TEST ../../../bin/varnishtest/tests/r00655.vtc starting
[...]
*    top   0.0 TEST Test nested /*...*/ comments
[...]
**** v1    0.1 CLI TX|
**** v1    0.1 CLI TX|
**** v1    0.1 CLI TX|\t/* foo
**** v1    0.1 CLI TX|\t\t/* bar
**** v1    0.1 CLI TX|\t*/
**** v1    0.1 CLI TX|
**** v1    0.1 CLI TX|%XJEIFLH|)Xspa8P
***  v1    0.1 CLI RX  106
**** v1    0.1 CLI RX|Message from VCC-compiler:
**** v1    0.1 CLI RX|Security: Privilege proc_setid missing, will not change uid/gid
**** v1    0.1 CLI RX|/* ... */ comment contains /*
**** v1    0.1 CLI RX|('<vcl.inline>' Line 4 Pos 9)
**** v1    0.1 CLI RX|        /* foo
**** v1    0.1 CLI RX|--------##----
**** v1    0.1 CLI RX|
**** v1    0.1 CLI RX|('<vcl.inline>' Line 5 Pos 17)
**** v1    0.1 CLI RX|                /* bar
**** v1    0.1 CLI RX|----------------##----
**** v1    0.1 CLI RX|
**** v1    0.1 CLI RX|Running VCC-compiler failed, exited with 2
**** v1    0.1 CLI RX|VCL compilation failed
**   v1    0.1 VCL compilation failed (as expected)
***  v1    0.1 Found expected string: ("/* ... */ comment contains /*")
*    top   0.1 RESETTING after ../../../bin/varnishtest/tests/r00655.vtc
**   v1    0.1 Wait
**** v1    0.1 CLI TX|backend.list
***  v1    0.1 CLI RX  101
**** v1    0.1 CLI RX|Unknown request in manager process (child not running).
**** v1    0.1 CLI RX|Type 'help' for more info.
**   v1    0.1 Stop
**** v1    0.1 CLI TX|stop
***  v1    0.1 CLI RX  300
**** v1    0.1 CLI RX|Child in state stopped
**** v1    0.1 CLI TX|status
***  v1    0.1 CLI RX  200
**** v1    0.1 CLI RX|Child in state stopped
**** v1    0.1 STDOUT poll 0x10
**   v1    0.1 R 72917 Status: 0000 (u 0.005000 s 0.020000)
#    top  TEST ../../../bin/varnishtest/tests/r00655.vtc TIMED OUT (kill -9)
#    top  TEST ../../../bin/varnishtest/tests/r00655.vtc FAILED (60.002) signal=9

1 @ SunOS 5.11 i86pc 1.04 32_sun12.4 uplex

*    top   0.0 TEST ../../../bin/varnishtest/tests/r00655.vtc starting
[...]
*    top   0.0 TEST Test nested /*...*/ comments
[...]
**** v1    0.1 CLI TX|
**** v1    0.1 CLI TX|
**** v1    0.1 CLI TX|\t/* foo
**** v1    0.1 CLI TX|\t\t/* bar
**** v1    0.1 CLI TX|\t*/
**** v1    0.1 CLI TX|
**** v1    0.1 CLI TX|%XJEIFLH|)Xspa8P
***  v1    0.1 CLI RX  106
**** v1    0.1 CLI RX|Message from VCC-compiler:
**** v1    0.1 CLI RX|Security: Privilege proc_setid missing, will not change uid/gid
**** v1    0.1 CLI RX|/* ... */ comment contains /*
**** v1    0.1 CLI RX|('<vcl.inline>' Line 4 Pos 9)
**** v1    0.1 CLI RX|        /* foo
**** v1    0.1 CLI RX|--------##----
**** v1    0.1 CLI RX|
**** v1    0.1 CLI RX|('<vcl.inline>' Line 5 Pos 17)
**** v1    0.1 CLI RX|                /* bar
**** v1    0.1 CLI RX|----------------##----
**** v1    0.1 CLI RX|
**** v1    0.1 CLI RX|Running VCC-compiler failed, exited with 2
**** v1    0.1 CLI RX|VCL compilation failed
**   v1    0.1 VCL compilation failed (as expected)
***  v1    0.1 Found expected string: ("/* ... */ comment contains /*")
*    top   0.1 RESETTING after ../../../bin/varnishtest/tests/r00655.vtc
**   v1    0.1 Wait
**** v1    0.1 CLI TX|backend.list
***  v1    0.1 CLI RX  101
**** v1    0.1 CLI RX|Unknown request in manager process (child not running).
**** v1    0.1 CLI RX|Type 'help' for more info.
**   v1    0.1 Stop
**** v1    0.1 CLI TX|stop
***  v1    0.1 CLI RX  300
**** v1    0.1 CLI RX|Child in state stopped
**** v1    0.1 CLI TX|status
***  v1    0.1 CLI RX  200
**** v1    0.1 CLI RX|Child in state stopped
**** v1    0.1 STDOUT poll 0x10
**   v1    0.1 R 97635 Status: 0000 (u 0.004000 s 0.017000)
#    top  TEST ../../../bin/varnishtest/tests/r00655.vtc TIMED OUT (kill -9)
#    top  TEST ../../../bin/varnishtest/tests/r00655.vtc FAILED (60.002) signal=9

1 @ Linux 3.10.0 x86_64 1.02 mblissett

*    top   0.0 TEST ../../../bin/varnishtest/tests/r00655.vtc starting
[...]
*    top   0.0 TEST Test nested /*...*/ comments
[...]
**** v1    0.1 CLI TX|
**** v1    0.1 CLI TX|
**** v1    0.1 CLI TX|\t/* foo
**** v1    0.1 CLI TX|\t\t/* bar
**** v1    0.1 CLI TX|\t*/
**** v1    0.1 CLI TX|
**** v1    0.1 CLI TX|%XJEIFLH|)Xspa8P
***  v1    0.1 CLI RX  106
**** v1    0.1 CLI RX|Message from VCC-compiler:
**** v1    0.1 CLI RX|/* ... */ comment contains /*
**** v1    0.1 CLI RX|('<vcl.inline>' Line 4 Pos 9)
**** v1    0.1 CLI RX|        /* foo
**** v1    0.1 CLI RX|--------##----
**** v1    0.1 CLI RX|
**** v1    0.1 CLI RX|('<vcl.inline>' Line 5 Pos 17)
**** v1    0.1 CLI RX|                /* bar
**** v1    0.1 CLI RX|----------------##----
**** v1    0.1 CLI RX|
**** v1    0.1 CLI RX|Running VCC-compiler failed, exited with 2
**** v1    0.1 CLI RX|VCL compilation failed
**   v1    0.1 VCL compilation failed (as expected)
***  v1    0.1 Found expected string: ("/* ... */ comment contains /*")
*    top   0.1 RESETTING after ../../../bin/varnishtest/tests/r00655.vtc
**   v1    0.1 Wait
**** v1    0.1 CLI TX|backend.list
***  v1    0.2 CLI RX  101
**** v1    0.2 CLI RX|Unknown request in manager process (child not running).
**** v1    0.2 CLI RX|Type 'help' for more info.
**   v1    0.2 Stop
**** v1    0.2 CLI TX|stop
***  v1    0.2 CLI RX  300
**** v1    0.2 CLI RX|Child in state stopped
**** v1    0.2 CLI TX|status
***  v1    0.2 CLI RX  200
**** v1    0.2 CLI RX|Child in state stopped
**** v1    0.2 STDOUT poll 0x10
**   v1    0.2 R 16750 Status: 0000 (u 0.000000 s 0.012396)
---- v1   60.1 vsm|Could not get hold of varnishd, is it running?
*    top  60.1 TEST ../../../bin/varnishtest/tests/r00655.vtc FAILED
#    top  TEST ../../../bin/varnishtest/tests/r00655.vtc FAILED (60.059) exit=2