r00916

8bbbdfa

1 @ SunOS 5.11 i86pc 1.04 64_gcc4.7 uplex

*    top   0.0 TEST ../../../bin/varnishtest/tests/r00916.vtc starting
[...]
*    top   0.0 TEST VCC reference bug
[...]
**** v1    0.1 CLI TX|\t    if (bereq.backend == s-1){
**** v1    0.1 CLI TX|\t\tset bereq.backend = s-1;
**** v1    0.1 CLI TX|\t    }
**** v1    0.1 CLI TX|\t}
**** v1    0.1 CLI TX|
**** v1    0.1 CLI TX|%XJEIFLH|)Xspa8P
***  v1    0.1 CLI RX  106
**** v1    0.1 CLI RX|Message from VCC-compiler:
**** v1    0.1 CLI RX|Security: Privilege proc_setid missing, will not change uid/gid
**** v1    0.1 CLI RX|Symbol not found: 's-1' (expected type BACKEND):
**** v1    0.1 CLI RX|('<vcl.inline>' Line 7 Pos 34)
**** v1    0.1 CLI RX|            if (bereq.backend == s-1){
**** v1    0.1 CLI RX|---------------------------------###--
**** v1    0.1 CLI RX|
**** v1    0.1 CLI RX|Running VCC-compiler failed, exited with 2
**** v1    0.1 CLI RX|VCL compilation failed
**   v1    0.1 VCL compilation failed (as expected)
***  v1    0.1 Found expected string: ("Symbol not found: 's-1' (expected type BACKEND):")
*    top   0.1 RESETTING after ../../../bin/varnishtest/tests/r00916.vtc
**   s1    0.1 Waiting for server (3/-1)
**** s1    0.1 macro undef s1_addr
**** s1    0.1 macro undef s1_port
**** s1    0.1 macro undef s1_sock
**   v1    0.1 Wait
**** v1    0.1 CLI TX|backend.list
***  v1    0.1 CLI RX  101
**** v1    0.1 CLI RX|Unknown request in manager process (child not running).
**** v1    0.1 CLI RX|Type 'help' for more info.
**   v1    0.1 Stop
**** v1    0.1 CLI TX|stop
***  v1    0.1 CLI RX  300
**** v1    0.1 CLI RX|Child in state stopped
**** v1    0.1 CLI TX|status
***  v1    0.1 CLI RX  200
**** v1    0.1 CLI RX|Child in state stopped
**** v1    0.1 STDOUT poll 0x10
**   v1    0.1 R 94954 Status: 0000 (u 0.007000 s 0.022000)
*    diag  0.0 ............................................................
#    top  TEST ../../../bin/varnishtest/tests/r00916.vtc TIMED OUT (kill -9)
#    top  TEST ../../../bin/varnishtest/tests/r00916.vtc FAILED (60.004) signal=9

1 @ SunOS 5.11 i86pc 1.04 32_sun12.4 uplex

*    top   0.0 TEST ../../../bin/varnishtest/tests/r00916.vtc starting
[...]
*    top   0.0 TEST VCC reference bug
[...]
**** v1    0.1 CLI TX|\t    if (bereq.backend == s-1){
**** v1    0.1 CLI TX|\t\tset bereq.backend = s-1;
**** v1    0.1 CLI TX|\t    }
**** v1    0.1 CLI TX|\t}
**** v1    0.1 CLI TX|
**** v1    0.1 CLI TX|%XJEIFLH|)Xspa8P
***  v1    0.1 CLI RX  106
**** v1    0.1 CLI RX|Message from VCC-compiler:
**** v1    0.1 CLI RX|Security: Privilege proc_setid missing, will not change uid/gid
**** v1    0.1 CLI RX|Symbol not found: 's-1' (expected type BACKEND):
**** v1    0.1 CLI RX|('<vcl.inline>' Line 7 Pos 34)
**** v1    0.1 CLI RX|            if (bereq.backend == s-1){
**** v1    0.1 CLI RX|---------------------------------###--
**** v1    0.1 CLI RX|
**** v1    0.1 CLI RX|Running VCC-compiler failed, exited with 2
**** v1    0.1 CLI RX|VCL compilation failed
**   v1    0.1 VCL compilation failed (as expected)
***  v1    0.1 Found expected string: ("Symbol not found: 's-1' (expected type BACKEND):")
*    top   0.1 RESETTING after ../../../bin/varnishtest/tests/r00916.vtc
**   s1    0.1 Waiting for server (3/-1)
**** s1    0.1 macro undef s1_addr
**** s1    0.1 macro undef s1_port
**** s1    0.1 macro undef s1_sock
**   v1    0.1 Wait
**** v1    0.1 CLI TX|backend.list
***  v1    0.1 CLI RX  101
**** v1    0.1 CLI RX|Unknown request in manager process (child not running).
**** v1    0.1 CLI RX|Type 'help' for more info.
**   v1    0.1 Stop
**** v1    0.1 CLI TX|stop
***  v1    0.1 CLI RX  300
**** v1    0.1 CLI RX|Child in state stopped
**** v1    0.1 CLI TX|status
***  v1    0.1 CLI RX  200
**** v1    0.1 CLI RX|Child in state stopped
**** v1    0.1 STDOUT poll 0x10
**   v1    0.1 R 56255 Status: 0000 (u 0.005000 s 0.019000)
*    diag  0.0 ............................................................
#    top  TEST ../../../bin/varnishtest/tests/r00916.vtc TIMED OUT (kill -9)
#    top  TEST ../../../bin/varnishtest/tests/r00916.vtc FAILED (60.002) signal=9

1 @ SunOS 5.11 i86pc 1.04 64_gcc4.7 uplex

*    top   0.0 TEST ../../../bin/varnishtest/tests/r00916.vtc starting
[...]
*    top   0.0 TEST VCC reference bug
[...]
**** v1    0.1 CLI TX|\t    if (bereq.backend == s-1){
**** v1    0.1 CLI TX|\t\tset bereq.backend = s-1;
**** v1    0.1 CLI TX|\t    }
**** v1    0.1 CLI TX|\t}
**** v1    0.1 CLI TX|
**** v1    0.1 CLI TX|%XJEIFLH|)Xspa8P
***  v1    0.1 CLI RX  106
**** v1    0.1 CLI RX|Message from VCC-compiler:
**** v1    0.1 CLI RX|Security: Privilege proc_setid missing, will not change uid/gid
**** v1    0.1 CLI RX|Symbol not found: 's-1' (expected type BACKEND):
**** v1    0.1 CLI RX|('<vcl.inline>' Line 7 Pos 34)
**** v1    0.1 CLI RX|            if (bereq.backend == s-1){
**** v1    0.1 CLI RX|---------------------------------###--
**** v1    0.1 CLI RX|
**** v1    0.1 CLI RX|Running VCC-compiler failed, exited with 2
**** v1    0.1 CLI RX|VCL compilation failed
**   v1    0.1 VCL compilation failed (as expected)
***  v1    0.1 Found expected string: ("Symbol not found: 's-1' (expected type BACKEND):")
*    top   0.1 RESETTING after ../../../bin/varnishtest/tests/r00916.vtc
**   s1    0.1 Waiting for server (3/-1)
**** s1    0.1 macro undef s1_addr
**** s1    0.1 macro undef s1_port
**** s1    0.1 macro undef s1_sock
**   v1    0.1 Wait
**** v1    0.1 CLI TX|backend.list
***  v1    0.1 CLI RX  101
**** v1    0.1 CLI RX|Unknown request in manager process (child not running).
**** v1    0.1 CLI RX|Type 'help' for more info.
**   v1    0.1 Stop
**** v1    0.1 CLI TX|stop
***  v1    0.1 CLI RX  300
**** v1    0.1 CLI RX|Child in state stopped
**** v1    0.1 CLI TX|status
***  v1    0.1 CLI RX  200
**** v1    0.1 CLI RX|Child in state stopped
**** v1    0.1 STDOUT poll 0x10
**   v1    0.1 R 82955 Status: 0000 (u 0.007000 s 0.025000)
*    diag  0.0 ............................................................
#    top  TEST ../../../bin/varnishtest/tests/r00916.vtc TIMED OUT (kill -9)
#    top  TEST ../../../bin/varnishtest/tests/r00916.vtc FAILED (60.004) signal=9

1 @ SunOS 5.11 i86pc 1.04 32_sun12.4 uplex

*    top   0.0 TEST ../../../bin/varnishtest/tests/r00916.vtc starting
[...]
*    top   0.0 TEST VCC reference bug
[...]
**** v1    0.1 CLI TX|\t    if (bereq.backend == s-1){
**** v1    0.1 CLI TX|\t\tset bereq.backend = s-1;
**** v1    0.1 CLI TX|\t    }
**** v1    0.1 CLI TX|\t}
**** v1    0.1 CLI TX|
**** v1    0.1 CLI TX|%XJEIFLH|)Xspa8P
***  v1    0.2 CLI RX  106
**** v1    0.2 CLI RX|Message from VCC-compiler:
**** v1    0.2 CLI RX|Security: Privilege proc_setid missing, will not change uid/gid
**** v1    0.2 CLI RX|Symbol not found: 's-1' (expected type BACKEND):
**** v1    0.2 CLI RX|('<vcl.inline>' Line 7 Pos 34)
**** v1    0.2 CLI RX|            if (bereq.backend == s-1){
**** v1    0.2 CLI RX|---------------------------------###--
**** v1    0.2 CLI RX|
**** v1    0.2 CLI RX|Running VCC-compiler failed, exited with 2
**** v1    0.2 CLI RX|VCL compilation failed
**   v1    0.2 VCL compilation failed (as expected)
***  v1    0.2 Found expected string: ("Symbol not found: 's-1' (expected type BACKEND):")
*    top   0.2 RESETTING after ../../../bin/varnishtest/tests/r00916.vtc
**   s1    0.2 Waiting for server (3/-1)
**** s1    0.2 macro undef s1_addr
**** s1    0.2 macro undef s1_port
**** s1    0.2 macro undef s1_sock
**   v1    0.2 Wait
**** v1    0.2 CLI TX|backend.list
***  v1    0.2 CLI RX  101
**** v1    0.2 CLI RX|Unknown request in manager process (child not running).
**** v1    0.2 CLI RX|Type 'help' for more info.
**   v1    0.2 Stop
**** v1    0.2 CLI TX|stop
***  v1    0.2 CLI RX  300
**** v1    0.2 CLI RX|Child in state stopped
**** v1    0.2 CLI TX|status
***  v1    0.2 CLI RX  200
**** v1    0.2 CLI RX|Child in state stopped
**** v1    0.2 STDOUT poll 0x10
**   v1    0.2 R 5964 Status: 0000 (u 0.008000 s 0.029000)
*    diag  0.0 ............................................................
#    top  TEST ../../../bin/varnishtest/tests/r00916.vtc TIMED OUT (kill -9)
#    top  TEST ../../../bin/varnishtest/tests/r00916.vtc FAILED (60.002) signal=9

1 @ Ubuntu LTS i686 1.04 fgs

*    top   0.0 TEST ../../../bin/varnishtest/tests/r00916.vtc starting
[...]
*    top   0.0 TEST VCC reference bug
[...]
**** v1    0.1 CLI TX|\tsub vcl_backend_response {
**** v1    0.1 CLI TX|\t    if (bereq.backend == s-1){
**** v1    0.1 CLI TX|\t\tset bereq.backend = s-1;
**** v1    0.1 CLI TX|\t    }
**** v1    0.1 CLI TX|\t}
**** v1    0.1 CLI TX|
**** v1    0.1 CLI TX|%XJEIFLH|)Xspa8P
***  v1    0.1 CLI RX  106
**** v1    0.1 CLI RX|Message from VCC-compiler:
**** v1    0.1 CLI RX|Symbol not found: 's-1' (expected type BACKEND):
**** v1    0.1 CLI RX|('<vcl.inline>' Line 7 Pos 34)
**** v1    0.1 CLI RX|            if (bereq.backend == s-1){
**** v1    0.1 CLI RX|---------------------------------###--
**** v1    0.1 CLI RX|
**** v1    0.1 CLI RX|Running VCC-compiler failed, exited with 2
**** v1    0.1 CLI RX|VCL compilation failed
**   v1    0.1 VCL compilation failed (as expected)
***  v1    0.1 Found expected string: ("Symbol not found: 's-1' (expected type BACKEND):")
*    top   0.1 RESETTING after ../../../bin/varnishtest/tests/r00916.vtc
**   s1    0.1 Waiting for server (4/-1)
**** s1    0.1 macro undef s1_addr
**** s1    0.1 macro undef s1_port
**** s1    0.1 macro undef s1_sock
**   v1    0.1 Wait
**** v1    0.1 CLI TX|backend.list
***  v1    0.1 CLI RX  101
**** v1    0.1 CLI RX|Unknown request in manager process (child not running).
**** v1    0.1 CLI RX|Type 'help' for more info.
**   v1    0.1 Stop
**** v1    0.1 CLI TX|stop
***  v1    0.2 CLI RX  300
**** v1    0.2 CLI RX|Child in state stopped
**** v1    0.2 CLI TX|status
***  v1    0.2 CLI RX  200
**** v1    0.2 CLI RX|Child in state stopped
**** v1    0.2 STDOUT poll 0x10
**   v1    0.2 R 19577 Status: 0000 (u 0.000000 s 0.004000)
*    diag  0.0 ............................................................
#    top  TEST ../../../bin/varnishtest/tests/r00916.vtc TIMED OUT (kill -9)
#    top  TEST ../../../bin/varnishtest/tests/r00916.vtc FAILED (60.001) signal=9

1 @ SunOS 5.11 i86pc 1.04 64_gcc4.7 uplex

*    top   0.0 TEST ../../../bin/varnishtest/tests/r00916.vtc starting
[...]
*    top   0.0 TEST VCC reference bug
[...]
**** v1    0.1 CLI TX|\t    if (bereq.backend == s-1){
**** v1    0.1 CLI TX|\t\tset bereq.backend = s-1;
**** v1    0.1 CLI TX|\t    }
**** v1    0.1 CLI TX|\t}
**** v1    0.1 CLI TX|
**** v1    0.1 CLI TX|%XJEIFLH|)Xspa8P
***  v1    0.2 CLI RX  106
**** v1    0.2 CLI RX|Message from VCC-compiler:
**** v1    0.2 CLI RX|Security: Privilege proc_setid missing, will not change uid/gid
**** v1    0.2 CLI RX|Symbol not found: 's-1' (expected type BACKEND):
**** v1    0.2 CLI RX|('<vcl.inline>' Line 7 Pos 34)
**** v1    0.2 CLI RX|            if (bereq.backend == s-1){
**** v1    0.2 CLI RX|---------------------------------###--
**** v1    0.2 CLI RX|
**** v1    0.2 CLI RX|Running VCC-compiler failed, exited with 2
**** v1    0.2 CLI RX|VCL compilation failed
**   v1    0.2 VCL compilation failed (as expected)
***  v1    0.2 Found expected string: ("Symbol not found: 's-1' (expected type BACKEND):")
*    top   0.2 RESETTING after ../../../bin/varnishtest/tests/r00916.vtc
**   s1    0.2 Waiting for server (3/-1)
**** s1    0.2 macro undef s1_addr
**** s1    0.2 macro undef s1_port
**** s1    0.2 macro undef s1_sock
**   v1    0.2 Wait
**** v1    0.2 CLI TX|backend.list
***  v1    0.2 CLI RX  101
**** v1    0.2 CLI RX|Unknown request in manager process (child not running).
**** v1    0.2 CLI RX|Type 'help' for more info.
**   v1    0.2 Stop
**** v1    0.2 CLI TX|stop
***  v1    0.2 CLI RX  300
**** v1    0.2 CLI RX|Child in state stopped
**** v1    0.2 CLI TX|status
***  v1    0.2 CLI RX  200
**** v1    0.2 CLI RX|Child in state stopped
**** v1    0.2 STDOUT poll 0x10
**   v1    0.2 R 93149 Status: 0000 (u 0.010000 s 0.034000)
*    diag  0.0 ............................................................
#    top  TEST ../../../bin/varnishtest/tests/r00916.vtc TIMED OUT (kill -9)
#    top  TEST ../../../bin/varnishtest/tests/r00916.vtc FAILED (60.005) signal=9

1 @ SunOS 5.11 i86pc 1.04 64_gcc4.7 uplex

*    top   0.0 TEST ../../../bin/varnishtest/tests/r00916.vtc starting
[...]
*    top   0.0 TEST VCC reference bug
[...]
**** v1    0.1 CLI TX|\t    if (bereq.backend == s-1){
**** v1    0.1 CLI TX|\t\tset bereq.backend = s-1;
**** v1    0.1 CLI TX|\t    }
**** v1    0.1 CLI TX|\t}
**** v1    0.1 CLI TX|
**** v1    0.1 CLI TX|%XJEIFLH|)Xspa8P
***  v1    0.1 CLI RX  106
**** v1    0.1 CLI RX|Message from VCC-compiler:
**** v1    0.1 CLI RX|Security: Privilege proc_setid missing, will not change uid/gid
**** v1    0.1 CLI RX|Symbol not found: 's-1' (expected type BACKEND):
**** v1    0.1 CLI RX|('<vcl.inline>' Line 7 Pos 34)
**** v1    0.1 CLI RX|            if (bereq.backend == s-1){
**** v1    0.1 CLI RX|---------------------------------###--
**** v1    0.1 CLI RX|
**** v1    0.1 CLI RX|Running VCC-compiler failed, exited with 2
**** v1    0.1 CLI RX|VCL compilation failed
**   v1    0.1 VCL compilation failed (as expected)
***  v1    0.1 Found expected string: ("Symbol not found: 's-1' (expected type BACKEND):")
*    top   0.1 RESETTING after ../../../bin/varnishtest/tests/r00916.vtc
**   s1    0.1 Waiting for server (3/-1)
**** s1    0.1 macro undef s1_addr
**** s1    0.1 macro undef s1_port
**** s1    0.1 macro undef s1_sock
**   v1    0.1 Wait
**** v1    0.1 CLI TX|backend.list
***  v1    0.1 CLI RX  101
**** v1    0.1 CLI RX|Unknown request in manager process (child not running).
**** v1    0.1 CLI RX|Type 'help' for more info.
**   v1    0.1 Stop
**** v1    0.1 CLI TX|stop
***  v1    0.1 CLI RX  300
**** v1    0.1 CLI RX|Child in state stopped
**** v1    0.1 CLI TX|status
***  v1    0.1 CLI RX  200
**** v1    0.1 CLI RX|Child in state stopped
**** v1    0.1 STDOUT poll 0x10
**   v1    0.1 R 75247 Status: 0000 (u 0.007000 s 0.022000)
*    diag  0.0 ............................................................
#    top  TEST ../../../bin/varnishtest/tests/r00916.vtc TIMED OUT (kill -9)
#    top  TEST ../../../bin/varnishtest/tests/r00916.vtc FAILED (60.003) signal=9

1 @ SunOS 5.11 i86pc 1.04 64_sun12.4 uplex

*    top   0.0 TEST ../../../bin/varnishtest/tests/r00916.vtc starting
[...]
*    top   0.0 TEST VCC reference bug
[...]
**** v1    0.1 CLI TX|\t    if (bereq.backend == s-1){
**** v1    0.1 CLI TX|\t\tset bereq.backend = s-1;
**** v1    0.1 CLI TX|\t    }
**** v1    0.1 CLI TX|\t}
**** v1    0.1 CLI TX|
**** v1    0.1 CLI TX|%XJEIFLH|)Xspa8P
***  v1    0.1 CLI RX  106
**** v1    0.1 CLI RX|Message from VCC-compiler:
**** v1    0.1 CLI RX|Security: Privilege proc_setid missing, will not change uid/gid
**** v1    0.1 CLI RX|Symbol not found: 's-1' (expected type BACKEND):
**** v1    0.1 CLI RX|('<vcl.inline>' Line 7 Pos 34)
**** v1    0.1 CLI RX|            if (bereq.backend == s-1){
**** v1    0.1 CLI RX|---------------------------------###--
**** v1    0.1 CLI RX|
**** v1    0.1 CLI RX|Running VCC-compiler failed, exited with 2
**** v1    0.1 CLI RX|VCL compilation failed
**   v1    0.1 VCL compilation failed (as expected)
***  v1    0.1 Found expected string: ("Symbol not found: 's-1' (expected type BACKEND):")
*    top   0.1 RESETTING after ../../../bin/varnishtest/tests/r00916.vtc
**   s1    0.1 Waiting for server (3/-1)
**** s1    0.1 macro undef s1_addr
**** s1    0.1 macro undef s1_port
**** s1    0.1 macro undef s1_sock
**   v1    0.1 Wait
**** v1    0.1 CLI TX|backend.list
***  v1    0.1 CLI RX  101
**** v1    0.1 CLI RX|Unknown request in manager process (child not running).
**** v1    0.1 CLI RX|Type 'help' for more info.
**   v1    0.1 Stop
**** v1    0.1 CLI TX|stop
***  v1    0.1 CLI RX  300
**** v1    0.1 CLI RX|Child in state stopped
**** v1    0.1 CLI TX|status
***  v1    0.1 CLI RX  200
**** v1    0.1 CLI RX|Child in state stopped
**** v1    0.1 STDOUT poll 0x10
**   v1    0.1 R 32405 Status: 0000 (u 0.007000 s 0.022000)
*    diag  0.0 ............................................................
#    top  TEST ../../../bin/varnishtest/tests/r00916.vtc TIMED OUT (kill -9)
#    top  TEST ../../../bin/varnishtest/tests/r00916.vtc FAILED (60.004) signal=9

1 @ Linux 3.10.0 x86_64 1.02 mblissett

*    top   0.0 TEST ../../../bin/varnishtest/tests/r00916.vtc starting
[...]
*    top   0.0 TEST VCC reference bug
[...]
**** v1    0.1 CLI TX|\tsub vcl_backend_response {
**** v1    0.1 CLI TX|\t    if (bereq.backend == s-1){
**** v1    0.1 CLI TX|\t\tset bereq.backend = s-1;
**** v1    0.1 CLI TX|\t    }
**** v1    0.1 CLI TX|\t}
**** v1    0.1 CLI TX|
**** v1    0.1 CLI TX|%XJEIFLH|)Xspa8P
***  v1    0.1 CLI RX  106
**** v1    0.1 CLI RX|Message from VCC-compiler:
**** v1    0.1 CLI RX|Symbol not found: 's-1' (expected type BACKEND):
**** v1    0.1 CLI RX|('<vcl.inline>' Line 7 Pos 34)
**** v1    0.1 CLI RX|            if (bereq.backend == s-1){
**** v1    0.1 CLI RX|---------------------------------###--
**** v1    0.1 CLI RX|
**** v1    0.1 CLI RX|Running VCC-compiler failed, exited with 2
**** v1    0.1 CLI RX|VCL compilation failed
**   v1    0.1 VCL compilation failed (as expected)
***  v1    0.1 Found expected string: ("Symbol not found: 's-1' (expected type BACKEND):")
*    top   0.1 RESETTING after ../../../bin/varnishtest/tests/r00916.vtc
**   s1    0.1 Waiting for server (4/-1)
**** s1    0.1 macro undef s1_addr
**** s1    0.1 macro undef s1_port
**** s1    0.1 macro undef s1_sock
**   v1    0.1 Wait
**** v1    0.1 CLI TX|backend.list
***  v1    0.2 CLI RX  101
**** v1    0.2 CLI RX|Unknown request in manager process (child not running).
**** v1    0.2 CLI RX|Type 'help' for more info.
**   v1    0.2 Stop
**** v1    0.2 CLI TX|stop
***  v1    0.2 CLI RX  300
**** v1    0.2 CLI RX|Child in state stopped
**** v1    0.2 CLI TX|status
***  v1    0.2 CLI RX  200
**** v1    0.2 CLI RX|Child in state stopped
**** v1    0.2 STDOUT poll 0x10
**   v1    0.2 R 8241 Status: 0000 (u 0.007599 s 0.018829)
*    diag  0.0 ............................................................
#    top  TEST ../../../bin/varnishtest/tests/r00916.vtc TIMED OUT (kill -9)
#    top  TEST ../../../bin/varnishtest/tests/r00916.vtc FAILED (60.001) signal=9

1 @ Ubuntu LTS i686 1.04 fgs

*    top   0.0 TEST ../../../bin/varnishtest/tests/r00916.vtc starting
[...]
*    top   0.0 TEST VCC reference bug
[...]
**** v1    0.1 CLI TX|\tsub vcl_backend_response {
**** v1    0.1 CLI TX|\t    if (bereq.backend == s-1){
**** v1    0.1 CLI TX|\t\tset bereq.backend = s-1;
**** v1    0.1 CLI TX|\t    }
**** v1    0.1 CLI TX|\t}
**** v1    0.1 CLI TX|
**** v1    0.1 CLI TX|%XJEIFLH|)Xspa8P
***  v1    0.1 CLI RX  106
**** v1    0.1 CLI RX|Message from VCC-compiler:
**** v1    0.1 CLI RX|Symbol not found: 's-1' (expected type BACKEND):
**** v1    0.1 CLI RX|('<vcl.inline>' Line 7 Pos 34)
**** v1    0.1 CLI RX|            if (bereq.backend == s-1){
**** v1    0.1 CLI RX|---------------------------------###--
**** v1    0.1 CLI RX|
**** v1    0.1 CLI RX|Running VCC-compiler failed, exited with 2
**** v1    0.1 CLI RX|VCL compilation failed
**   v1    0.1 VCL compilation failed (as expected)
***  v1    0.1 Found expected string: ("Symbol not found: 's-1' (expected type BACKEND):")
*    top   0.1 RESETTING after ../../../bin/varnishtest/tests/r00916.vtc
**   s1    0.1 Waiting for server (4/-1)
**** s1    0.1 macro undef s1_addr
**** s1    0.1 macro undef s1_port
**** s1    0.1 macro undef s1_sock
**   v1    0.1 Wait
**** v1    0.1 CLI TX|backend.list
***  v1    0.1 CLI RX  101
**** v1    0.1 CLI RX|Unknown request in manager process (child not running).
**** v1    0.1 CLI RX|Type 'help' for more info.
**   v1    0.1 Stop
**** v1    0.1 CLI TX|stop
***  v1    0.2 CLI RX  300
**** v1    0.2 CLI RX|Child in state stopped
**** v1    0.2 CLI TX|status
***  v1    0.2 CLI RX  200
**** v1    0.2 CLI RX|Child in state stopped
**** v1    0.2 STDOUT poll 0x10
**   v1    0.2 R 8782 Status: 0000 (u 0.004000 s 0.004000)
*    diag  0.0 ............................................................
#    top  TEST ../../../bin/varnishtest/tests/r00916.vtc TIMED OUT (kill -9)
#    top  TEST ../../../bin/varnishtest/tests/r00916.vtc FAILED (60.002) signal=9

1 @ SunOS 5.11 i86pc 1.04 64_gcc4.7 uplex

*    top   0.0 TEST ../../../bin/varnishtest/tests/r00916.vtc starting
[...]
*    top   0.0 TEST VCC reference bug
[...]
**** v1    0.2 CLI TX|\t    if (bereq.backend == s-1){
**** v1    0.2 CLI TX|\t\tset bereq.backend = s-1;
**** v1    0.2 CLI TX|\t    }
**** v1    0.2 CLI TX|\t}
**** v1    0.2 CLI TX|
**** v1    0.2 CLI TX|%XJEIFLH|)Xspa8P
***  v1    0.2 CLI RX  106
**** v1    0.2 CLI RX|Message from VCC-compiler:
**** v1    0.2 CLI RX|Security: Privilege proc_setid missing, will not change uid/gid
**** v1    0.2 CLI RX|Symbol not found: 's-1' (expected type BACKEND):
**** v1    0.2 CLI RX|('<vcl.inline>' Line 7 Pos 34)
**** v1    0.2 CLI RX|            if (bereq.backend == s-1){
**** v1    0.2 CLI RX|---------------------------------###--
**** v1    0.2 CLI RX|
**** v1    0.2 CLI RX|Running VCC-compiler failed, exited with 2
**** v1    0.2 CLI RX|VCL compilation failed
**   v1    0.2 VCL compilation failed (as expected)
***  v1    0.2 Found expected string: ("Symbol not found: 's-1' (expected type BACKEND):")
*    top   0.2 RESETTING after ../../../bin/varnishtest/tests/r00916.vtc
**   s1    0.2 Waiting for server (3/-1)
**** s1    0.2 macro undef s1_addr
**** s1    0.2 macro undef s1_port
**** s1    0.2 macro undef s1_sock
**   v1    0.2 Wait
**** v1    0.2 CLI TX|backend.list
***  v1    0.2 CLI RX  101
**** v1    0.2 CLI RX|Unknown request in manager process (child not running).
**** v1    0.2 CLI RX|Type 'help' for more info.
**   v1    0.2 Stop
**** v1    0.2 CLI TX|stop
***  v1    0.2 CLI RX  300
**** v1    0.2 CLI RX|Child in state stopped
**** v1    0.2 CLI TX|status
***  v1    0.2 CLI RX  200
**** v1    0.2 CLI RX|Child in state stopped
**** v1    0.2 STDOUT poll 0x10
**   v1    0.2 R 2765 Status: 0000 (u 0.011000 s 0.037000)
*    diag  0.0 ............................................................
#    top  TEST ../../../bin/varnishtest/tests/r00916.vtc TIMED OUT (kill -9)
#    top  TEST ../../../bin/varnishtest/tests/r00916.vtc FAILED (60.005) signal=9

1 @ Linux 3.10.0 x86_64 1.02 mblissett

*    top   0.0 TEST ../../../bin/varnishtest/tests/r00916.vtc starting
[...]
*    top   0.0 TEST VCC reference bug
[...]
**** v1    0.1 CLI TX|\tsub vcl_backend_response {
**** v1    0.1 CLI TX|\t    if (bereq.backend == s-1){
**** v1    0.1 CLI TX|\t\tset bereq.backend = s-1;
**** v1    0.1 CLI TX|\t    }
**** v1    0.1 CLI TX|\t}
**** v1    0.1 CLI TX|
**** v1    0.1 CLI TX|%XJEIFLH|)Xspa8P
***  v1    0.1 CLI RX  106
**** v1    0.1 CLI RX|Message from VCC-compiler:
**** v1    0.1 CLI RX|Symbol not found: 's-1' (expected type BACKEND):
**** v1    0.1 CLI RX|('<vcl.inline>' Line 7 Pos 34)
**** v1    0.1 CLI RX|            if (bereq.backend == s-1){
**** v1    0.1 CLI RX|---------------------------------###--
**** v1    0.1 CLI RX|
**** v1    0.1 CLI RX|Running VCC-compiler failed, exited with 2
**** v1    0.1 CLI RX|VCL compilation failed
**   v1    0.1 VCL compilation failed (as expected)
***  v1    0.1 Found expected string: ("Symbol not found: 's-1' (expected type BACKEND):")
*    top   0.1 RESETTING after ../../../bin/varnishtest/tests/r00916.vtc
**   s1    0.1 Waiting for server (4/-1)
**** s1    0.1 macro undef s1_addr
**** s1    0.1 macro undef s1_port
**** s1    0.1 macro undef s1_sock
**   v1    0.1 Wait
**** v1    0.1 CLI TX|backend.list
***  v1    0.2 CLI RX  101
**** v1    0.2 CLI RX|Unknown request in manager process (child not running).
**** v1    0.2 CLI RX|Type 'help' for more info.
**   v1    0.2 Stop
**** v1    0.2 CLI TX|stop
***  v1    0.2 CLI RX  300
**** v1    0.2 CLI RX|Child in state stopped
**** v1    0.2 CLI TX|status
***  v1    0.2 CLI RX  200
**** v1    0.2 CLI RX|Child in state stopped
**** v1    0.2 STDOUT poll 0x10
**   v1    0.2 R 31196 Status: 0000 (u 0.004766 s 0.017005)
*    diag  0.0 ............................................................
#    top  TEST ../../../bin/varnishtest/tests/r00916.vtc TIMED OUT (kill -9)
#    top  TEST ../../../bin/varnishtest/tests/r00916.vtc FAILED (60.002) signal=9

1 @ Linux 3.10.0 x86_64 1.02 mblissett

*    top   0.0 TEST ../../../bin/varnishtest/tests/r00916.vtc starting
[...]
*    top   0.0 TEST VCC reference bug
[...]
**** v1    0.1 CLI TX|\tsub vcl_backend_response {
**** v1    0.1 CLI TX|\t    if (bereq.backend == s-1){
**** v1    0.1 CLI TX|\t\tset bereq.backend = s-1;
**** v1    0.1 CLI TX|\t    }
**** v1    0.1 CLI TX|\t}
**** v1    0.1 CLI TX|
**** v1    0.1 CLI TX|%XJEIFLH|)Xspa8P
***  v1    0.1 CLI RX  106
**** v1    0.1 CLI RX|Message from VCC-compiler:
**** v1    0.1 CLI RX|Symbol not found: 's-1' (expected type BACKEND):
**** v1    0.1 CLI RX|('<vcl.inline>' Line 7 Pos 34)
**** v1    0.1 CLI RX|            if (bereq.backend == s-1){
**** v1    0.1 CLI RX|---------------------------------###--
**** v1    0.1 CLI RX|
**** v1    0.1 CLI RX|Running VCC-compiler failed, exited with 2
**** v1    0.1 CLI RX|VCL compilation failed
**   v1    0.1 VCL compilation failed (as expected)
***  v1    0.1 Found expected string: ("Symbol not found: 's-1' (expected type BACKEND):")
*    top   0.1 RESETTING after ../../../bin/varnishtest/tests/r00916.vtc
**   s1    0.1 Waiting for server (4/-1)
**** s1    0.1 macro undef s1_addr
**** s1    0.1 macro undef s1_port
**** s1    0.1 macro undef s1_sock
**   v1    0.1 Wait
**** v1    0.1 CLI TX|backend.list
***  v1    0.2 CLI RX  101
**** v1    0.2 CLI RX|Unknown request in manager process (child not running).
**** v1    0.2 CLI RX|Type 'help' for more info.
**   v1    0.2 Stop
**** v1    0.2 CLI TX|stop
***  v1    0.2 CLI RX  300
**** v1    0.2 CLI RX|Child in state stopped
**** v1    0.2 CLI TX|status
***  v1    0.2 CLI RX  200
**** v1    0.2 CLI RX|Child in state stopped
**** v1    0.2 STDOUT poll 0x10
**   v1    0.2 R 15376 Status: 0000 (u 0.003485 s 0.008123)
*    diag  0.0 ............................................................
#    top  TEST ../../../bin/varnishtest/tests/r00916.vtc TIMED OUT (kill -9)
#    top  TEST ../../../bin/varnishtest/tests/r00916.vtc FAILED (60.001) signal=9

1 @ SunOS 5.11 i86pc 1.04 64_gcc4.7 uplex

*    top   0.0 TEST ../../../bin/varnishtest/tests/r00916.vtc starting
[...]
*    top   0.0 TEST VCC reference bug
[...]
**** v1    0.1 CLI TX|\t    if (bereq.backend == s-1){
**** v1    0.1 CLI TX|\t\tset bereq.backend = s-1;
**** v1    0.1 CLI TX|\t    }
**** v1    0.1 CLI TX|\t}
**** v1    0.1 CLI TX|
**** v1    0.1 CLI TX|%XJEIFLH|)Xspa8P
***  v1    0.1 CLI RX  106
**** v1    0.1 CLI RX|Message from VCC-compiler:
**** v1    0.1 CLI RX|Security: Privilege proc_setid missing, will not change uid/gid
**** v1    0.1 CLI RX|Symbol not found: 's-1' (expected type BACKEND):
**** v1    0.1 CLI RX|('<vcl.inline>' Line 7 Pos 34)
**** v1    0.1 CLI RX|            if (bereq.backend == s-1){
**** v1    0.1 CLI RX|---------------------------------###--
**** v1    0.1 CLI RX|
**** v1    0.1 CLI RX|Running VCC-compiler failed, exited with 2
**** v1    0.1 CLI RX|VCL compilation failed
**   v1    0.1 VCL compilation failed (as expected)
***  v1    0.1 Found expected string: ("Symbol not found: 's-1' (expected type BACKEND):")
*    top   0.1 RESETTING after ../../../bin/varnishtest/tests/r00916.vtc
**   s1    0.1 Waiting for server (3/-1)
**** s1    0.1 macro undef s1_addr
**** s1    0.1 macro undef s1_port
**** s1    0.1 macro undef s1_sock
**   v1    0.1 Wait
**** v1    0.1 CLI TX|backend.list
***  v1    0.1 CLI RX  101
**** v1    0.1 CLI RX|Unknown request in manager process (child not running).
**** v1    0.1 CLI RX|Type 'help' for more info.
**   v1    0.1 Stop
**** v1    0.1 CLI TX|stop
***  v1    0.1 CLI RX  300
**** v1    0.1 CLI RX|Child in state stopped
**** v1    0.1 CLI TX|status
***  v1    0.1 CLI RX  200
**** v1    0.1 CLI RX|Child in state stopped
**** v1    0.1 STDOUT poll 0x10
**   v1    0.1 R 45243 Status: 0000 (u 0.007000 s 0.022000)
*    diag  0.0 ............................................................
#    top  TEST ../../../bin/varnishtest/tests/r00916.vtc TIMED OUT (kill -9)
#    top  TEST ../../../bin/varnishtest/tests/r00916.vtc FAILED (60.004) signal=9

1 @ SunOS 5.11 i86pc 1.04 32_sun12.4 uplex

*    top   0.0 TEST ../../../bin/varnishtest/tests/r00916.vtc starting
[...]
*    top   0.0 TEST VCC reference bug
[...]
**** v1    0.1 CLI TX|\t    if (bereq.backend == s-1){
**** v1    0.1 CLI TX|\t\tset bereq.backend = s-1;
**** v1    0.1 CLI TX|\t    }
**** v1    0.1 CLI TX|\t}
**** v1    0.1 CLI TX|
**** v1    0.1 CLI TX|%XJEIFLH|)Xspa8P
***  v1    0.1 CLI RX  106
**** v1    0.1 CLI RX|Message from VCC-compiler:
**** v1    0.1 CLI RX|Security: Privilege proc_setid missing, will not change uid/gid
**** v1    0.1 CLI RX|Symbol not found: 's-1' (expected type BACKEND):
**** v1    0.1 CLI RX|('<vcl.inline>' Line 7 Pos 34)
**** v1    0.1 CLI RX|            if (bereq.backend == s-1){
**** v1    0.1 CLI RX|---------------------------------###--
**** v1    0.1 CLI RX|
**** v1    0.1 CLI RX|Running VCC-compiler failed, exited with 2
**** v1    0.1 CLI RX|VCL compilation failed
**   v1    0.1 VCL compilation failed (as expected)
***  v1    0.1 Found expected string: ("Symbol not found: 's-1' (expected type BACKEND):")
*    top   0.1 RESETTING after ../../../bin/varnishtest/tests/r00916.vtc
**   s1    0.1 Waiting for server (3/-1)
**** s1    0.1 macro undef s1_addr
**** s1    0.1 macro undef s1_port
**** s1    0.1 macro undef s1_sock
**   v1    0.1 Wait
**** v1    0.1 CLI TX|backend.list
***  v1    0.1 CLI RX  101
**** v1    0.1 CLI RX|Unknown request in manager process (child not running).
**** v1    0.1 CLI RX|Type 'help' for more info.
**   v1    0.1 Stop
**** v1    0.1 CLI TX|stop
***  v1    0.1 CLI RX  300
**** v1    0.1 CLI RX|Child in state stopped
**** v1    0.1 CLI TX|status
***  v1    0.1 CLI RX  200
**** v1    0.1 CLI RX|Child in state stopped
**** v1    0.1 STDOUT poll 0x10
**   v1    0.1 R 78560 Status: 0000 (u 0.004000 s 0.019000)
*    diag  0.0 ............................................................
#    top  TEST ../../../bin/varnishtest/tests/r00916.vtc TIMED OUT (kill -9)
#    top  TEST ../../../bin/varnishtest/tests/r00916.vtc FAILED (60.002) signal=9

1 @ SunOS 5.11 i86pc 1.04 64_sun12.4 uplex

*    top   0.0 TEST ../../../bin/varnishtest/tests/r00916.vtc starting
[...]
*    top   0.0 TEST VCC reference bug
[...]
**** v1    0.1 CLI TX|\t    if (bereq.backend == s-1){
**** v1    0.1 CLI TX|\t\tset bereq.backend = s-1;
**** v1    0.1 CLI TX|\t    }
**** v1    0.1 CLI TX|\t}
**** v1    0.1 CLI TX|
**** v1    0.1 CLI TX|%XJEIFLH|)Xspa8P
***  v1    0.2 CLI RX  106
**** v1    0.2 CLI RX|Message from VCC-compiler:
**** v1    0.2 CLI RX|Security: Privilege proc_setid missing, will not change uid/gid
**** v1    0.2 CLI RX|Symbol not found: 's-1' (expected type BACKEND):
**** v1    0.2 CLI RX|('<vcl.inline>' Line 7 Pos 34)
**** v1    0.2 CLI RX|            if (bereq.backend == s-1){
**** v1    0.2 CLI RX|---------------------------------###--
**** v1    0.2 CLI RX|
**** v1    0.2 CLI RX|Running VCC-compiler failed, exited with 2
**** v1    0.2 CLI RX|VCL compilation failed
**   v1    0.2 VCL compilation failed (as expected)
***  v1    0.2 Found expected string: ("Symbol not found: 's-1' (expected type BACKEND):")
*    top   0.2 RESETTING after ../../../bin/varnishtest/tests/r00916.vtc
**   s1    0.2 Waiting for server (3/-1)
**** s1    0.2 macro undef s1_addr
**** s1    0.2 macro undef s1_port
**** s1    0.2 macro undef s1_sock
**   v1    0.2 Wait
**** v1    0.2 CLI TX|backend.list
***  v1    0.2 CLI RX  101
**** v1    0.2 CLI RX|Unknown request in manager process (child not running).
**** v1    0.2 CLI RX|Type 'help' for more info.
**   v1    0.2 Stop
**** v1    0.2 CLI TX|stop
***  v1    0.2 CLI RX  300
**** v1    0.2 CLI RX|Child in state stopped
**** v1    0.2 CLI TX|status
***  v1    0.2 CLI RX  200
**** v1    0.2 CLI RX|Child in state stopped
**** v1    0.2 STDOUT poll 0x10
**   v1    0.2 R 33095 Status: 0000 (u 0.009000 s 0.029000)
*    diag  0.0 ............................................................
#    top  TEST ../../../bin/varnishtest/tests/r00916.vtc TIMED OUT (kill -9)
#    top  TEST ../../../bin/varnishtest/tests/r00916.vtc FAILED (60.004) signal=9

1 @ Linux 3.10.0 x86_64 1.02 mblissett

*    top   0.0 TEST ../../../bin/varnishtest/tests/r00916.vtc starting
[...]
*    top   0.0 TEST VCC reference bug
[...]
**** v1    0.1 CLI TX|\tsub vcl_backend_response {
**** v1    0.1 CLI TX|\t    if (bereq.backend == s-1){
**** v1    0.1 CLI TX|\t\tset bereq.backend = s-1;
**** v1    0.1 CLI TX|\t    }
**** v1    0.1 CLI TX|\t}
**** v1    0.1 CLI TX|
**** v1    0.1 CLI TX|%XJEIFLH|)Xspa8P
***  v1    0.1 CLI RX  106
**** v1    0.1 CLI RX|Message from VCC-compiler:
**** v1    0.1 CLI RX|Symbol not found: 's-1' (expected type BACKEND):
**** v1    0.1 CLI RX|('<vcl.inline>' Line 7 Pos 34)
**** v1    0.1 CLI RX|            if (bereq.backend == s-1){
**** v1    0.1 CLI RX|---------------------------------###--
**** v1    0.1 CLI RX|
**** v1    0.1 CLI RX|Running VCC-compiler failed, exited with 2
**** v1    0.1 CLI RX|VCL compilation failed
**   v1    0.1 VCL compilation failed (as expected)
***  v1    0.1 Found expected string: ("Symbol not found: 's-1' (expected type BACKEND):")
*    top   0.1 RESETTING after ../../../bin/varnishtest/tests/r00916.vtc
**   s1    0.1 Waiting for server (4/-1)
**** s1    0.1 macro undef s1_addr
**** s1    0.1 macro undef s1_port
**** s1    0.1 macro undef s1_sock
**   v1    0.1 Wait
**** v1    0.1 CLI TX|backend.list
***  v1    0.2 CLI RX  101
**** v1    0.2 CLI RX|Unknown request in manager process (child not running).
**** v1    0.2 CLI RX|Type 'help' for more info.
**   v1    0.2 Stop
**** v1    0.2 CLI TX|stop
***  v1    0.2 CLI RX  300
**** v1    0.2 CLI RX|Child in state stopped
**** v1    0.2 CLI TX|status
***  v1    0.2 CLI RX  200
**** v1    0.2 CLI RX|Child in state stopped
**** v1    0.2 STDOUT poll 0x10
**   v1    0.2 R 14682 Status: 0000 (u 0.002021 s 0.016953)
*    diag  0.0 ............................................................
#    top  TEST ../../../bin/varnishtest/tests/r00916.vtc TIMED OUT (kill -9)
#    top  TEST ../../../bin/varnishtest/tests/r00916.vtc FAILED (60.001) signal=9

1 @ SunOS 5.11 i86pc 1.04 64_gcc4.7 uplex

*    top   0.0 TEST ../../../bin/varnishtest/tests/r00916.vtc starting
[...]
*    top   0.0 TEST VCC reference bug
[...]
**** v1    0.2 CLI TX|\t    if (bereq.backend == s-1){
**** v1    0.2 CLI TX|\t\tset bereq.backend = s-1;
**** v1    0.2 CLI TX|\t    }
**** v1    0.2 CLI TX|\t}
**** v1    0.2 CLI TX|
**** v1    0.2 CLI TX|%XJEIFLH|)Xspa8P
***  v1    0.2 CLI RX  106
**** v1    0.2 CLI RX|Message from VCC-compiler:
**** v1    0.2 CLI RX|Security: Privilege proc_setid missing, will not change uid/gid
**** v1    0.2 CLI RX|Symbol not found: 's-1' (expected type BACKEND):
**** v1    0.2 CLI RX|('<vcl.inline>' Line 7 Pos 34)
**** v1    0.2 CLI RX|            if (bereq.backend == s-1){
**** v1    0.2 CLI RX|---------------------------------###--
**** v1    0.2 CLI RX|
**** v1    0.2 CLI RX|Running VCC-compiler failed, exited with 2
**** v1    0.2 CLI RX|VCL compilation failed
**   v1    0.2 VCL compilation failed (as expected)
***  v1    0.2 Found expected string: ("Symbol not found: 's-1' (expected type BACKEND):")
*    top   0.2 RESETTING after ../../../bin/varnishtest/tests/r00916.vtc
**   s1    0.2 Waiting for server (3/-1)
**** s1    0.2 macro undef s1_addr
**** s1    0.2 macro undef s1_port
**** s1    0.2 macro undef s1_sock
**   v1    0.2 Wait
**** v1    0.2 CLI TX|backend.list
***  v1    0.2 CLI RX  101
**** v1    0.2 CLI RX|Unknown request in manager process (child not running).
**** v1    0.2 CLI RX|Type 'help' for more info.
**   v1    0.2 Stop
**** v1    0.2 CLI TX|stop
***  v1    0.2 CLI RX  300
**** v1    0.2 CLI RX|Child in state stopped
**** v1    0.2 CLI TX|status
***  v1    0.2 CLI RX  200
**** v1    0.2 CLI RX|Child in state stopped
**** v1    0.2 STDOUT poll 0x10
**   v1    0.2 R 67919 Status: 0000 (u 0.010000 s 0.032000)
*    diag  0.0 ............................................................
#    top  TEST ../../../bin/varnishtest/tests/r00916.vtc TIMED OUT (kill -9)
#    top  TEST ../../../bin/varnishtest/tests/r00916.vtc FAILED (60.005) signal=9

1 @ SunOS 5.11 i86pc 1.04 64_gcc4.7 uplex

*    top   0.0 TEST ../../../bin/varnishtest/tests/r00916.vtc starting
[...]
*    top   0.0 TEST VCC reference bug
[...]
**** v1    0.1 CLI TX|\t    if (bereq.backend == s-1){
**** v1    0.1 CLI TX|\t\tset bereq.backend = s-1;
**** v1    0.1 CLI TX|\t    }
**** v1    0.1 CLI TX|\t}
**** v1    0.1 CLI TX|
**** v1    0.1 CLI TX|%XJEIFLH|)Xspa8P
***  v1    0.1 CLI RX  106
**** v1    0.1 CLI RX|Message from VCC-compiler:
**** v1    0.1 CLI RX|Security: Privilege proc_setid missing, will not change uid/gid
**** v1    0.1 CLI RX|Symbol not found: 's-1' (expected type BACKEND):
**** v1    0.1 CLI RX|('<vcl.inline>' Line 7 Pos 34)
**** v1    0.1 CLI RX|            if (bereq.backend == s-1){
**** v1    0.1 CLI RX|---------------------------------###--
**** v1    0.1 CLI RX|
**** v1    0.1 CLI RX|Running VCC-compiler failed, exited with 2
**** v1    0.1 CLI RX|VCL compilation failed
**   v1    0.1 VCL compilation failed (as expected)
***  v1    0.1 Found expected string: ("Symbol not found: 's-1' (expected type BACKEND):")
*    top   0.1 RESETTING after ../../../bin/varnishtest/tests/r00916.vtc
**   s1    0.1 Waiting for server (3/-1)
**** s1    0.1 macro undef s1_addr
**** s1    0.1 macro undef s1_port
**** s1    0.1 macro undef s1_sock
**   v1    0.1 Wait
**** v1    0.1 CLI TX|backend.list
***  v1    0.1 CLI RX  101
**** v1    0.1 CLI RX|Unknown request in manager process (child not running).
**** v1    0.1 CLI RX|Type 'help' for more info.
**   v1    0.1 Stop
**** v1    0.1 CLI TX|stop
***  v1    0.1 CLI RX  300
**** v1    0.1 CLI RX|Child in state stopped
**** v1    0.1 CLI TX|status
***  v1    0.1 CLI RX  200
**** v1    0.1 CLI RX|Child in state stopped
**** v1    0.1 STDOUT poll 0x10
**   v1    0.1 R 22767 Status: 0000 (u 0.007000 s 0.022000)
*    diag  0.0 ............................................................
#    top  TEST ../../../bin/varnishtest/tests/r00916.vtc TIMED OUT (kill -9)
#    top  TEST ../../../bin/varnishtest/tests/r00916.vtc FAILED (60.003) signal=9

1 @ Linux 3.10.0 x86_64 1.02 mblissett

*    top   0.0 TEST ../../../bin/varnishtest/tests/r00916.vtc starting
[...]
*    top   0.0 TEST VCC reference bug
[...]
**** v1    0.1 CLI TX|\tsub vcl_backend_response {
**** v1    0.1 CLI TX|\t    if (bereq.backend == s-1){
**** v1    0.1 CLI TX|\t\tset bereq.backend = s-1;
**** v1    0.1 CLI TX|\t    }
**** v1    0.1 CLI TX|\t}
**** v1    0.1 CLI TX|
**** v1    0.1 CLI TX|%XJEIFLH|)Xspa8P
***  v1    0.1 CLI RX  106
**** v1    0.1 CLI RX|Message from VCC-compiler:
**** v1    0.1 CLI RX|Symbol not found: 's-1' (expected type BACKEND):
**** v1    0.1 CLI RX|('<vcl.inline>' Line 7 Pos 34)
**** v1    0.1 CLI RX|            if (bereq.backend == s-1){
**** v1    0.1 CLI RX|---------------------------------###--
**** v1    0.1 CLI RX|
**** v1    0.1 CLI RX|Running VCC-compiler failed, exited with 2
**** v1    0.1 CLI RX|VCL compilation failed
**   v1    0.1 VCL compilation failed (as expected)
***  v1    0.1 Found expected string: ("Symbol not found: 's-1' (expected type BACKEND):")
*    top   0.1 RESETTING after ../../../bin/varnishtest/tests/r00916.vtc
**   s1    0.1 Waiting for server (4/-1)
**** s1    0.1 macro undef s1_addr
**** s1    0.1 macro undef s1_port
**** s1    0.1 macro undef s1_sock
**   v1    0.1 Wait
**** v1    0.1 CLI TX|backend.list
***  v1    0.2 CLI RX  101
**** v1    0.2 CLI RX|Unknown request in manager process (child not running).
**** v1    0.2 CLI RX|Type 'help' for more info.
**   v1    0.2 Stop
**** v1    0.2 CLI TX|stop
***  v1    0.2 CLI RX  300
**** v1    0.2 CLI RX|Child in state stopped
**** v1    0.2 CLI TX|status
***  v1    0.2 CLI RX  200
**** v1    0.2 CLI RX|Child in state stopped
**** v1    0.2 STDOUT poll 0x10
**   v1    0.2 R 5074 Status: 0000 (u 0.002768 s 0.016608)
*    diag  0.0 ............................................................
#    top  TEST ../../../bin/varnishtest/tests/r00916.vtc TIMED OUT (kill -9)
#    top  TEST ../../../bin/varnishtest/tests/r00916.vtc FAILED (60.002) signal=9

1 @ SunOS 5.11 i86pc 1.04 64_gcc4.7 uplex

*    top   0.0 TEST ../../../bin/varnishtest/tests/r00916.vtc starting
[...]
*    top   0.0 TEST VCC reference bug
[...]
**** v1    0.1 CLI TX|\t    if (bereq.backend == s-1){
**** v1    0.1 CLI TX|\t\tset bereq.backend = s-1;
**** v1    0.1 CLI TX|\t    }
**** v1    0.1 CLI TX|\t}
**** v1    0.1 CLI TX|
**** v1    0.1 CLI TX|%XJEIFLH|)Xspa8P
***  v1    0.1 CLI RX  106
**** v1    0.1 CLI RX|Message from VCC-compiler:
**** v1    0.1 CLI RX|Security: Privilege proc_setid missing, will not change uid/gid
**** v1    0.1 CLI RX|Symbol not found: 's-1' (expected type BACKEND):
**** v1    0.1 CLI RX|('<vcl.inline>' Line 7 Pos 34)
**** v1    0.1 CLI RX|            if (bereq.backend == s-1){
**** v1    0.1 CLI RX|---------------------------------###--
**** v1    0.1 CLI RX|
**** v1    0.1 CLI RX|Running VCC-compiler failed, exited with 2
**** v1    0.1 CLI RX|VCL compilation failed
**   v1    0.1 VCL compilation failed (as expected)
***  v1    0.1 Found expected string: ("Symbol not found: 's-1' (expected type BACKEND):")
*    top   0.1 RESETTING after ../../../bin/varnishtest/tests/r00916.vtc
**   s1    0.1 Waiting for server (3/-1)
**** s1    0.1 macro undef s1_addr
**** s1    0.1 macro undef s1_port
**** s1    0.1 macro undef s1_sock
**   v1    0.1 Wait
**** v1    0.1 CLI TX|backend.list
***  v1    0.1 CLI RX  101
**** v1    0.1 CLI RX|Unknown request in manager process (child not running).
**** v1    0.1 CLI RX|Type 'help' for more info.
**   v1    0.1 Stop
**** v1    0.1 CLI TX|stop
***  v1    0.1 CLI RX  300
**** v1    0.1 CLI RX|Child in state stopped
**** v1    0.1 CLI TX|status
***  v1    0.1 CLI RX  200
**** v1    0.1 CLI RX|Child in state stopped
**** v1    0.1 STDOUT poll 0x10
**   v1    0.1 R 24835 Status: 0000 (u 0.007000 s 0.021000)
*    diag  0.0 ............................................................
#    top  TEST ../../../bin/varnishtest/tests/r00916.vtc TIMED OUT (kill -9)
#    top  TEST ../../../bin/varnishtest/tests/r00916.vtc FAILED (60.004) signal=9

1 @ Ubuntu LTS i686 1.04 fgs

*    top   0.0 TEST ../../../bin/varnishtest/tests/r00916.vtc starting
[...]
*    top   0.0 TEST VCC reference bug
[...]
**** v1    0.1 CLI TX|\tsub vcl_backend_response {
**** v1    0.1 CLI TX|\t    if (bereq.backend == s-1){
**** v1    0.1 CLI TX|\t\tset bereq.backend = s-1;
**** v1    0.1 CLI TX|\t    }
**** v1    0.1 CLI TX|\t}
**** v1    0.1 CLI TX|
**** v1    0.1 CLI TX|%XJEIFLH|)Xspa8P
***  v1    0.1 CLI RX  106
**** v1    0.1 CLI RX|Message from VCC-compiler:
**** v1    0.1 CLI RX|Symbol not found: 's-1' (expected type BACKEND):
**** v1    0.1 CLI RX|('<vcl.inline>' Line 7 Pos 34)
**** v1    0.1 CLI RX|            if (bereq.backend == s-1){
**** v1    0.1 CLI RX|---------------------------------###--
**** v1    0.1 CLI RX|
**** v1    0.1 CLI RX|Running VCC-compiler failed, exited with 2
**** v1    0.1 CLI RX|VCL compilation failed
**   v1    0.1 VCL compilation failed (as expected)
***  v1    0.1 Found expected string: ("Symbol not found: 's-1' (expected type BACKEND):")
*    top   0.1 RESETTING after ../../../bin/varnishtest/tests/r00916.vtc
**   s1    0.1 Waiting for server (4/-1)
**** s1    0.1 macro undef s1_addr
**** s1    0.1 macro undef s1_port
**** s1    0.1 macro undef s1_sock
**   v1    0.1 Wait
**** v1    0.1 CLI TX|backend.list
***  v1    0.1 CLI RX  101
**** v1    0.1 CLI RX|Unknown request in manager process (child not running).
**** v1    0.1 CLI RX|Type 'help' for more info.
**   v1    0.1 Stop
**** v1    0.1 CLI TX|stop
***  v1    0.2 CLI RX  300
**** v1    0.2 CLI RX|Child in state stopped
**** v1    0.2 CLI TX|status
***  v1    0.2 CLI RX  200
**** v1    0.2 CLI RX|Child in state stopped
**** v1    0.2 STDOUT poll 0x10
**   v1    0.2 R 25665 Status: 0000 (u 0.000000 s 0.004000)
*    diag  0.0 ............................................................
#    top  TEST ../../../bin/varnishtest/tests/r00916.vtc TIMED OUT (kill -9)
#    top  TEST ../../../bin/varnishtest/tests/r00916.vtc FAILED (60.000) signal=9

1 @ Ubuntu LTS i686 1.04 fgs

*    top   0.0 TEST ../../../bin/varnishtest/tests/r00916.vtc starting
[...]
*    top   0.0 TEST VCC reference bug
[...]
**** v1    0.1 CLI TX|\tsub vcl_backend_response {
**** v1    0.1 CLI TX|\t    if (bereq.backend == s-1){
**** v1    0.1 CLI TX|\t\tset bereq.backend = s-1;
**** v1    0.1 CLI TX|\t    }
**** v1    0.1 CLI TX|\t}
**** v1    0.1 CLI TX|
**** v1    0.1 CLI TX|%XJEIFLH|)Xspa8P
***  v1    0.1 CLI RX  106
**** v1    0.1 CLI RX|Message from VCC-compiler:
**** v1    0.1 CLI RX|Symbol not found: 's-1' (expected type BACKEND):
**** v1    0.1 CLI RX|('<vcl.inline>' Line 7 Pos 34)
**** v1    0.1 CLI RX|            if (bereq.backend == s-1){
**** v1    0.1 CLI RX|---------------------------------###--
**** v1    0.1 CLI RX|
**** v1    0.1 CLI RX|Running VCC-compiler failed, exited with 2
**** v1    0.1 CLI RX|VCL compilation failed
**   v1    0.1 VCL compilation failed (as expected)
***  v1    0.1 Found expected string: ("Symbol not found: 's-1' (expected type BACKEND):")
*    top   0.1 RESETTING after ../../../bin/varnishtest/tests/r00916.vtc
**   s1    0.1 Waiting for server (4/-1)
**** s1    0.1 macro undef s1_addr
**** s1    0.1 macro undef s1_port
**** s1    0.1 macro undef s1_sock
**   v1    0.1 Wait
**** v1    0.1 CLI TX|backend.list
***  v1    0.1 CLI RX  101
**** v1    0.1 CLI RX|Unknown request in manager process (child not running).
**** v1    0.1 CLI RX|Type 'help' for more info.
**   v1    0.1 Stop
**** v1    0.1 CLI TX|stop
***  v1    0.2 CLI RX  300
**** v1    0.2 CLI RX|Child in state stopped
**** v1    0.2 CLI TX|status
***  v1    0.2 CLI RX  200
**** v1    0.2 CLI RX|Child in state stopped
**** v1    0.2 STDOUT poll 0x10
**   v1    0.2 R 5563 Status: 0000 (u 0.000000 s 0.004000)
*    diag  0.0 ............................................................
#    top  TEST ../../../bin/varnishtest/tests/r00916.vtc TIMED OUT (kill -9)
#    top  TEST ../../../bin/varnishtest/tests/r00916.vtc FAILED (60.001) signal=9

1 @ Ubuntu LTS i686 1.04 fgs

*    top   0.0 TEST ../../../bin/varnishtest/tests/r00916.vtc starting
[...]
*    top   0.0 TEST VCC reference bug
[...]
**** v1    0.1 CLI TX|\tsub vcl_backend_response {
**** v1    0.1 CLI TX|\t    if (bereq.backend == s-1){
**** v1    0.1 CLI TX|\t\tset bereq.backend = s-1;
**** v1    0.1 CLI TX|\t    }
**** v1    0.1 CLI TX|\t}
**** v1    0.1 CLI TX|
**** v1    0.1 CLI TX|%XJEIFLH|)Xspa8P
***  v1    0.1 CLI RX  106
**** v1    0.1 CLI RX|Message from VCC-compiler:
**** v1    0.1 CLI RX|Symbol not found: 's-1' (expected type BACKEND):
**** v1    0.1 CLI RX|('<vcl.inline>' Line 7 Pos 34)
**** v1    0.1 CLI RX|            if (bereq.backend == s-1){
**** v1    0.1 CLI RX|---------------------------------###--
**** v1    0.1 CLI RX|
**** v1    0.1 CLI RX|Running VCC-compiler failed, exited with 2
**** v1    0.1 CLI RX|VCL compilation failed
**   v1    0.1 VCL compilation failed (as expected)
***  v1    0.1 Found expected string: ("Symbol not found: 's-1' (expected type BACKEND):")
*    top   0.1 RESETTING after ../../../bin/varnishtest/tests/r00916.vtc
**   s1    0.1 Waiting for server (4/-1)
**** s1    0.1 macro undef s1_addr
**** s1    0.1 macro undef s1_port
**** s1    0.1 macro undef s1_sock
**   v1    0.1 Wait
**** v1    0.1 CLI TX|backend.list
***  v1    0.1 CLI RX  101
**** v1    0.1 CLI RX|Unknown request in manager process (child not running).
**** v1    0.1 CLI RX|Type 'help' for more info.
**   v1    0.1 Stop
**** v1    0.1 CLI TX|stop
***  v1    0.2 CLI RX  300
**** v1    0.2 CLI RX|Child in state stopped
**** v1    0.2 CLI TX|status
***  v1    0.2 CLI RX  200
**** v1    0.2 CLI RX|Child in state stopped
**** v1    0.2 STDOUT poll 0x10
**   v1    0.2 R 28872 Status: 0000 (u 0.000000 s 0.004000)
*    diag  0.0 ............................................................
#    top  TEST ../../../bin/varnishtest/tests/r00916.vtc TIMED OUT (kill -9)
#    top  TEST ../../../bin/varnishtest/tests/r00916.vtc FAILED (60.001) signal=9

1 @ SunOS 5.11 i86pc 1.04 64_gcc4.7 uplex

*    top   0.0 TEST ../../../bin/varnishtest/tests/r00916.vtc starting
[...]
*    top   0.0 TEST VCC reference bug
[...]
**** v1    0.1 CLI TX|\t    if (bereq.backend == s-1){
**** v1    0.1 CLI TX|\t\tset bereq.backend = s-1;
**** v1    0.1 CLI TX|\t    }
**** v1    0.1 CLI TX|\t}
**** v1    0.1 CLI TX|
**** v1    0.1 CLI TX|%XJEIFLH|)Xspa8P
***  v1    0.1 CLI RX  106
**** v1    0.1 CLI RX|Message from VCC-compiler:
**** v1    0.1 CLI RX|Security: Privilege proc_setid missing, will not change uid/gid
**** v1    0.1 CLI RX|Symbol not found: 's-1' (expected type BACKEND):
**** v1    0.1 CLI RX|('<vcl.inline>' Line 7 Pos 34)
**** v1    0.1 CLI RX|            if (bereq.backend == s-1){
**** v1    0.1 CLI RX|---------------------------------###--
**** v1    0.1 CLI RX|
**** v1    0.1 CLI RX|Running VCC-compiler failed, exited with 2
**** v1    0.1 CLI RX|VCL compilation failed
**   v1    0.1 VCL compilation failed (as expected)
***  v1    0.1 Found expected string: ("Symbol not found: 's-1' (expected type BACKEND):")
*    top   0.1 RESETTING after ../../../bin/varnishtest/tests/r00916.vtc
**   s1    0.1 Waiting for server (3/-1)
**** s1    0.1 macro undef s1_addr
**** s1    0.1 macro undef s1_port
**** s1    0.1 macro undef s1_sock
**   v1    0.1 Wait
**** v1    0.1 CLI TX|backend.list
***  v1    0.1 CLI RX  101
**** v1    0.1 CLI RX|Unknown request in manager process (child not running).
**** v1    0.1 CLI RX|Type 'help' for more info.
**   v1    0.1 Stop
**** v1    0.1 CLI TX|stop
***  v1    0.1 CLI RX  300
**** v1    0.1 CLI RX|Child in state stopped
**** v1    0.1 CLI TX|status
***  v1    0.1 CLI RX  200
**** v1    0.1 CLI RX|Child in state stopped
**** v1    0.1 STDOUT poll 0x10
**   v1    0.1 R 11841 Status: 0000 (u 0.007000 s 0.023000)
*    diag  0.0 ............................................................
#    top  TEST ../../../bin/varnishtest/tests/r00916.vtc TIMED OUT (kill -9)
#    top  TEST ../../../bin/varnishtest/tests/r00916.vtc FAILED (60.004) signal=9

1 @ SunOS 5.11 i86pc 1.04 64_gcc4.7 uplex

*    top   0.0 TEST ../../../bin/varnishtest/tests/r00916.vtc starting
[...]
*    top   0.0 TEST VCC reference bug
[...]
**** v1    0.1 CLI TX|\t    if (bereq.backend == s-1){
**** v1    0.1 CLI TX|\t\tset bereq.backend = s-1;
**** v1    0.1 CLI TX|\t    }
**** v1    0.1 CLI TX|\t}
**** v1    0.1 CLI TX|
**** v1    0.1 CLI TX|%XJEIFLH|)Xspa8P
***  v1    0.1 CLI RX  106
**** v1    0.1 CLI RX|Message from VCC-compiler:
**** v1    0.1 CLI RX|Security: Privilege proc_setid missing, will not change uid/gid
**** v1    0.1 CLI RX|Symbol not found: 's-1' (expected type BACKEND):
**** v1    0.1 CLI RX|('<vcl.inline>' Line 7 Pos 34)
**** v1    0.1 CLI RX|            if (bereq.backend == s-1){
**** v1    0.1 CLI RX|---------------------------------###--
**** v1    0.1 CLI RX|
**** v1    0.1 CLI RX|Running VCC-compiler failed, exited with 2
**** v1    0.1 CLI RX|VCL compilation failed
**   v1    0.1 VCL compilation failed (as expected)
***  v1    0.1 Found expected string: ("Symbol not found: 's-1' (expected type BACKEND):")
*    top   0.1 RESETTING after ../../../bin/varnishtest/tests/r00916.vtc
**   s1    0.1 Waiting for server (3/-1)
**** s1    0.1 macro undef s1_addr
**** s1    0.1 macro undef s1_port
**** s1    0.1 macro undef s1_sock
**   v1    0.1 Wait
**** v1    0.1 CLI TX|backend.list
***  v1    0.1 CLI RX  101
**** v1    0.1 CLI RX|Unknown request in manager process (child not running).
**** v1    0.1 CLI RX|Type 'help' for more info.
**   v1    0.1 Stop
**** v1    0.1 CLI TX|stop
***  v1    0.1 CLI RX  300
**** v1    0.1 CLI RX|Child in state stopped
**** v1    0.1 CLI TX|status
***  v1    0.1 CLI RX  200
**** v1    0.1 CLI RX|Child in state stopped
**** v1    0.1 STDOUT poll 0x10
**   v1    0.1 R 94891 Status: 0000 (u 0.008000 s 0.024000)
*    diag  0.0 ............................................................
#    top  TEST ../../../bin/varnishtest/tests/r00916.vtc TIMED OUT (kill -9)
#    top  TEST ../../../bin/varnishtest/tests/r00916.vtc FAILED (60.004) signal=9

1 @ SunOS 5.11 i86pc 1.04 32_gcc4.7 uplex

*    top   0.0 TEST ../../../bin/varnishtest/tests/r00916.vtc starting
[...]
*    top   0.0 TEST VCC reference bug
[...]
**** v1    0.1 CLI TX|\t    if (bereq.backend == s-1){
**** v1    0.1 CLI TX|\t\tset bereq.backend = s-1;
**** v1    0.1 CLI TX|\t    }
**** v1    0.1 CLI TX|\t}
**** v1    0.1 CLI TX|
**** v1    0.1 CLI TX|%XJEIFLH|)Xspa8P
***  v1    0.1 CLI RX  106
**** v1    0.1 CLI RX|Message from VCC-compiler:
**** v1    0.1 CLI RX|Security: Privilege proc_setid missing, will not change uid/gid
**** v1    0.1 CLI RX|Symbol not found: 's-1' (expected type BACKEND):
**** v1    0.1 CLI RX|('<vcl.inline>' Line 7 Pos 34)
**** v1    0.1 CLI RX|            if (bereq.backend == s-1){
**** v1    0.1 CLI RX|---------------------------------###--
**** v1    0.1 CLI RX|
**** v1    0.1 CLI RX|Running VCC-compiler failed, exited with 2
**** v1    0.1 CLI RX|VCL compilation failed
**   v1    0.1 VCL compilation failed (as expected)
***  v1    0.1 Found expected string: ("Symbol not found: 's-1' (expected type BACKEND):")
*    top   0.1 RESETTING after ../../../bin/varnishtest/tests/r00916.vtc
**   s1    0.1 Waiting for server (3/-1)
**** s1    0.1 macro undef s1_addr
**** s1    0.1 macro undef s1_port
**** s1    0.1 macro undef s1_sock
**   v1    0.1 Wait
**** v1    0.1 CLI TX|backend.list
***  v1    0.1 CLI RX  101
**** v1    0.1 CLI RX|Unknown request in manager process (child not running).
**** v1    0.1 CLI RX|Type 'help' for more info.
**   v1    0.1 Stop
**** v1    0.1 CLI TX|stop
***  v1    0.1 CLI RX  300
**** v1    0.1 CLI RX|Child in state stopped
**** v1    0.1 CLI TX|status
***  v1    0.1 CLI RX  200
**** v1    0.1 CLI RX|Child in state stopped
**** v1    0.1 STDOUT poll 0x10
**   v1    0.1 R 58112 Status: 0000 (u 0.007000 s 0.024000)
*    diag  0.0 ............................................................
#    top  TEST ../../../bin/varnishtest/tests/r00916.vtc TIMED OUT (kill -9)
#    top  TEST ../../../bin/varnishtest/tests/r00916.vtc FAILED (60.003) signal=9

1 @ SunOS 5.11 i86pc 1.04 32_sun12.4 uplex

*    top   0.0 TEST ../../../bin/varnishtest/tests/r00916.vtc starting
[...]
*    top   0.0 TEST VCC reference bug
[...]
**** v1    0.1 CLI TX|\t    if (bereq.backend == s-1){
**** v1    0.1 CLI TX|\t\tset bereq.backend = s-1;
**** v1    0.1 CLI TX|\t    }
**** v1    0.1 CLI TX|\t}
**** v1    0.1 CLI TX|
**** v1    0.1 CLI TX|%XJEIFLH|)Xspa8P
***  v1    0.1 CLI RX  106
**** v1    0.1 CLI RX|Message from VCC-compiler:
**** v1    0.1 CLI RX|Security: Privilege proc_setid missing, will not change uid/gid
**** v1    0.1 CLI RX|Symbol not found: 's-1' (expected type BACKEND):
**** v1    0.1 CLI RX|('<vcl.inline>' Line 7 Pos 34)
**** v1    0.1 CLI RX|            if (bereq.backend == s-1){
**** v1    0.1 CLI RX|---------------------------------###--
**** v1    0.1 CLI RX|
**** v1    0.1 CLI RX|Running VCC-compiler failed, exited with 2
**** v1    0.1 CLI RX|VCL compilation failed
**   v1    0.1 VCL compilation failed (as expected)
***  v1    0.1 Found expected string: ("Symbol not found: 's-1' (expected type BACKEND):")
*    top   0.1 RESETTING after ../../../bin/varnishtest/tests/r00916.vtc
**   s1    0.1 Waiting for server (3/-1)
**** s1    0.1 macro undef s1_addr
**** s1    0.1 macro undef s1_port
**** s1    0.1 macro undef s1_sock
**   v1    0.1 Wait
**** v1    0.1 CLI TX|backend.list
***  v1    0.1 CLI RX  101
**** v1    0.1 CLI RX|Unknown request in manager process (child not running).
**** v1    0.1 CLI RX|Type 'help' for more info.
**   v1    0.1 Stop
**** v1    0.1 CLI TX|stop
***  v1    0.1 CLI RX  300
**** v1    0.1 CLI RX|Child in state stopped
**** v1    0.1 CLI TX|status
***  v1    0.1 CLI RX  200
**** v1    0.1 CLI RX|Child in state stopped
**** v1    0.1 STDOUT poll 0x10
**   v1    0.1 R 90522 Status: 0000 (u 0.005000 s 0.020000)
*    diag  0.0 ............................................................
#    top  TEST ../../../bin/varnishtest/tests/r00916.vtc TIMED OUT (kill -9)
#    top  TEST ../../../bin/varnishtest/tests/r00916.vtc FAILED (60.002) signal=9

1 @ Linux 3.10.0 x86_64 1.02 mblissett

*    top   0.0 TEST ../../../bin/varnishtest/tests/r00916.vtc starting
[...]
*    top   0.0 TEST VCC reference bug
[...]
**** v1    0.1 CLI TX|\tsub vcl_backend_response {
**** v1    0.1 CLI TX|\t    if (bereq.backend == s-1){
**** v1    0.1 CLI TX|\t\tset bereq.backend = s-1;
**** v1    0.1 CLI TX|\t    }
**** v1    0.1 CLI TX|\t}
**** v1    0.1 CLI TX|
**** v1    0.1 CLI TX|%XJEIFLH|)Xspa8P
***  v1    0.1 CLI RX  106
**** v1    0.1 CLI RX|Message from VCC-compiler:
**** v1    0.1 CLI RX|Symbol not found: 's-1' (expected type BACKEND):
**** v1    0.1 CLI RX|('<vcl.inline>' Line 7 Pos 34)
**** v1    0.1 CLI RX|            if (bereq.backend == s-1){
**** v1    0.1 CLI RX|---------------------------------###--
**** v1    0.1 CLI RX|
**** v1    0.1 CLI RX|Running VCC-compiler failed, exited with 2
**** v1    0.1 CLI RX|VCL compilation failed
**   v1    0.1 VCL compilation failed (as expected)
***  v1    0.1 Found expected string: ("Symbol not found: 's-1' (expected type BACKEND):")
*    top   0.1 RESETTING after ../../../bin/varnishtest/tests/r00916.vtc
**   s1    0.1 Waiting for server (4/-1)
**** s1    0.1 macro undef s1_addr
**** s1    0.1 macro undef s1_port
**** s1    0.1 macro undef s1_sock
**   v1    0.1 Wait
**** v1    0.1 CLI TX|backend.list
***  v1    0.2 CLI RX  101
**** v1    0.2 CLI RX|Unknown request in manager process (child not running).
**** v1    0.2 CLI RX|Type 'help' for more info.
**   v1    0.2 Stop
**** v1    0.2 CLI TX|stop
***  v1    0.2 CLI RX  300
**** v1    0.2 CLI RX|Child in state stopped
**** v1    0.2 CLI TX|status
***  v1    0.2 CLI RX  200
**** v1    0.2 CLI RX|Child in state stopped
**** v1    0.2 STDOUT poll 0x10
**   v1    0.2 R 11578 Status: 0000 (u 0.005637 s 0.010105)
*    diag  0.0 ............................................................
#    top  TEST ../../../bin/varnishtest/tests/r00916.vtc TIMED OUT (kill -9)
#    top  TEST ../../../bin/varnishtest/tests/r00916.vtc FAILED (60.002) signal=9

1 @ Ubuntu LTS i686 1.04 fgs

*    top   0.0 TEST ../../../bin/varnishtest/tests/r00916.vtc starting
[...]
*    top   0.0 TEST VCC reference bug
[...]
**** v1    0.1 CLI TX|\tsub vcl_backend_response {
**** v1    0.1 CLI TX|\t    if (bereq.backend == s-1){
**** v1    0.1 CLI TX|\t\tset bereq.backend = s-1;
**** v1    0.1 CLI TX|\t    }
**** v1    0.1 CLI TX|\t}
**** v1    0.1 CLI TX|
**** v1    0.1 CLI TX|%XJEIFLH|)Xspa8P
***  v1    0.1 CLI RX  106
**** v1    0.1 CLI RX|Message from VCC-compiler:
**** v1    0.1 CLI RX|Symbol not found: 's-1' (expected type BACKEND):
**** v1    0.1 CLI RX|('<vcl.inline>' Line 7 Pos 34)
**** v1    0.1 CLI RX|            if (bereq.backend == s-1){
**** v1    0.1 CLI RX|---------------------------------###--
**** v1    0.1 CLI RX|
**** v1    0.1 CLI RX|Running VCC-compiler failed, exited with 2
**** v1    0.1 CLI RX|VCL compilation failed
**   v1    0.1 VCL compilation failed (as expected)
***  v1    0.1 Found expected string: ("Symbol not found: 's-1' (expected type BACKEND):")
*    top   0.1 RESETTING after ../../../bin/varnishtest/tests/r00916.vtc
**   s1    0.1 Waiting for server (4/-1)
**** s1    0.1 macro undef s1_addr
**** s1    0.1 macro undef s1_port
**** s1    0.1 macro undef s1_sock
**   v1    0.1 Wait
**** v1    0.1 CLI TX|backend.list
***  v1    0.1 CLI RX  101
**** v1    0.1 CLI RX|Unknown request in manager process (child not running).
**** v1    0.1 CLI RX|Type 'help' for more info.
**   v1    0.1 Stop
**** v1    0.1 CLI TX|stop
***  v1    0.2 CLI RX  300
**** v1    0.2 CLI RX|Child in state stopped
**** v1    0.2 CLI TX|status
***  v1    0.2 CLI RX  200
**** v1    0.2 CLI RX|Child in state stopped
**** v1    0.2 STDOUT poll 0x10
**   v1    0.2 R 10710 Status: 0000 (u 0.000000 s 0.004000)
*    diag  0.0 ............................................................
#    top  TEST ../../../bin/varnishtest/tests/r00916.vtc TIMED OUT (kill -9)
#    top  TEST ../../../bin/varnishtest/tests/r00916.vtc FAILED (60.001) signal=9

1 @ Linux 3.10.0 x86_64 1.02 mblissett

*    top   0.0 TEST ../../../bin/varnishtest/tests/r00916.vtc starting
[...]
*    top   0.0 TEST VCC reference bug
[...]
**** v1    0.1 CLI TX|\tsub vcl_backend_response {
**** v1    0.1 CLI TX|\t    if (bereq.backend == s-1){
**** v1    0.1 CLI TX|\t\tset bereq.backend = s-1;
**** v1    0.1 CLI TX|\t    }
**** v1    0.1 CLI TX|\t}
**** v1    0.1 CLI TX|
**** v1    0.1 CLI TX|%XJEIFLH|)Xspa8P
***  v1    0.1 CLI RX  106
**** v1    0.1 CLI RX|Message from VCC-compiler:
**** v1    0.1 CLI RX|Symbol not found: 's-1' (expected type BACKEND):
**** v1    0.1 CLI RX|('<vcl.inline>' Line 7 Pos 34)
**** v1    0.1 CLI RX|            if (bereq.backend == s-1){
**** v1    0.1 CLI RX|---------------------------------###--
**** v1    0.1 CLI RX|
**** v1    0.1 CLI RX|Running VCC-compiler failed, exited with 2
**** v1    0.1 CLI RX|VCL compilation failed
**   v1    0.1 VCL compilation failed (as expected)
***  v1    0.1 Found expected string: ("Symbol not found: 's-1' (expected type BACKEND):")
*    top   0.1 RESETTING after ../../../bin/varnishtest/tests/r00916.vtc
**   s1    0.1 Waiting for server (4/-1)
**** s1    0.1 macro undef s1_addr
**** s1    0.1 macro undef s1_port
**** s1    0.1 macro undef s1_sock
**   v1    0.1 Wait
**** v1    0.1 CLI TX|backend.list
***  v1    0.2 CLI RX  101
**** v1    0.2 CLI RX|Unknown request in manager process (child not running).
**** v1    0.2 CLI RX|Type 'help' for more info.
**   v1    0.2 Stop
**** v1    0.2 CLI TX|stop
***  v1    0.2 CLI RX  300
**** v1    0.2 CLI RX|Child in state stopped
**** v1    0.2 CLI TX|status
***  v1    0.2 CLI RX  200
**** v1    0.2 CLI RX|Child in state stopped
**** v1    0.2 STDOUT poll 0x10
**   v1    0.2 R 12195 Status: 0000 (u 0.003450 s 0.013362)
*    diag  0.0 ............................................................
#    top  TEST ../../../bin/varnishtest/tests/r00916.vtc TIMED OUT (kill -9)
#    top  TEST ../../../bin/varnishtest/tests/r00916.vtc FAILED (60.001) signal=9

1 @ Linux 3.10.0 x86_64 1.02 mblissett

*    top   0.0 TEST ../../../bin/varnishtest/tests/r00916.vtc starting
[...]
*    top   0.0 TEST VCC reference bug
[...]
**** v1    0.1 CLI TX|\tsub vcl_backend_response {
**** v1    0.1 CLI TX|\t    if (bereq.backend == s-1){
**** v1    0.1 CLI TX|\t\tset bereq.backend = s-1;
**** v1    0.1 CLI TX|\t    }
**** v1    0.1 CLI TX|\t}
**** v1    0.1 CLI TX|
**** v1    0.1 CLI TX|%XJEIFLH|)Xspa8P
***  v1    0.1 CLI RX  106
**** v1    0.1 CLI RX|Message from VCC-compiler:
**** v1    0.1 CLI RX|Symbol not found: 's-1' (expected type BACKEND):
**** v1    0.1 CLI RX|('<vcl.inline>' Line 7 Pos 34)
**** v1    0.1 CLI RX|            if (bereq.backend == s-1){
**** v1    0.1 CLI RX|---------------------------------###--
**** v1    0.1 CLI RX|
**** v1    0.1 CLI RX|Running VCC-compiler failed, exited with 2
**** v1    0.1 CLI RX|VCL compilation failed
**   v1    0.1 VCL compilation failed (as expected)
***  v1    0.1 Found expected string: ("Symbol not found: 's-1' (expected type BACKEND):")
*    top   0.1 RESETTING after ../../../bin/varnishtest/tests/r00916.vtc
**   s1    0.1 Waiting for server (4/-1)
**** s1    0.1 macro undef s1_addr
**** s1    0.1 macro undef s1_port
**** s1    0.1 macro undef s1_sock
**   v1    0.1 Wait
**** v1    0.1 CLI TX|backend.list
***  v1    0.2 CLI RX  101
**** v1    0.2 CLI RX|Unknown request in manager process (child not running).
**** v1    0.2 CLI RX|Type 'help' for more info.
**   v1    0.2 Stop
**** v1    0.2 CLI TX|stop
***  v1    0.2 CLI RX  300
**** v1    0.2 CLI RX|Child in state stopped
**** v1    0.2 CLI TX|status
***  v1    0.2 CLI RX  200
**** v1    0.2 CLI RX|Child in state stopped
**** v1    0.2 STDOUT poll 0x10
**   v1    0.2 R 24847 Status: 0000 (u 0.002435 s 0.010315)
*    diag  0.0 ............................................................
#    top  TEST ../../../bin/varnishtest/tests/r00916.vtc TIMED OUT (kill -9)
#    top  TEST ../../../bin/varnishtest/tests/r00916.vtc FAILED (60.001) signal=9

1 @ SunOS 5.11 i86pc 1.04 64_gcc4.7 uplex

*    top   0.0 TEST ../../../bin/varnishtest/tests/r00916.vtc starting
[...]
*    top   0.0 TEST VCC reference bug
[...]
**** v1    0.1 CLI TX|\t    if (bereq.backend == s-1){
**** v1    0.1 CLI TX|\t\tset bereq.backend = s-1;
**** v1    0.1 CLI TX|\t    }
**** v1    0.1 CLI TX|\t}
**** v1    0.1 CLI TX|
**** v1    0.1 CLI TX|%XJEIFLH|)Xspa8P
***  v1    0.1 CLI RX  106
**** v1    0.1 CLI RX|Message from VCC-compiler:
**** v1    0.1 CLI RX|Security: Privilege proc_setid missing, will not change uid/gid
**** v1    0.1 CLI RX|Symbol not found: 's-1' (expected type BACKEND):
**** v1    0.1 CLI RX|('<vcl.inline>' Line 7 Pos 34)
**** v1    0.1 CLI RX|            if (bereq.backend == s-1){
**** v1    0.1 CLI RX|---------------------------------###--
**** v1    0.1 CLI RX|
**** v1    0.1 CLI RX|Running VCC-compiler failed, exited with 2
**** v1    0.1 CLI RX|VCL compilation failed
**   v1    0.1 VCL compilation failed (as expected)
***  v1    0.1 Found expected string: ("Symbol not found: 's-1' (expected type BACKEND):")
*    top   0.1 RESETTING after ../../../bin/varnishtest/tests/r00916.vtc
**   s1    0.1 Waiting for server (3/-1)
**** s1    0.1 macro undef s1_addr
**** s1    0.1 macro undef s1_port
**** s1    0.1 macro undef s1_sock
**   v1    0.1 Wait
**** v1    0.1 CLI TX|backend.list
***  v1    0.1 CLI RX  101
**** v1    0.1 CLI RX|Unknown request in manager process (child not running).
**** v1    0.1 CLI RX|Type 'help' for more info.
**   v1    0.1 Stop
**** v1    0.1 CLI TX|stop
***  v1    0.1 CLI RX  300
**** v1    0.1 CLI RX|Child in state stopped
**** v1    0.1 CLI TX|status
***  v1    0.1 CLI RX  200
**** v1    0.1 CLI RX|Child in state stopped
**** v1    0.1 STDOUT poll 0x10
**   v1    0.1 R 72510 Status: 0000 (u 0.007000 s 0.022000)
*    diag  0.0 ............................................................
#    top  TEST ../../../bin/varnishtest/tests/r00916.vtc TIMED OUT (kill -9)
#    top  TEST ../../../bin/varnishtest/tests/r00916.vtc FAILED (60.004) signal=9

1 @ Ubuntu LTS i686 1.04 fgs

*    top   0.0 TEST ../../../bin/varnishtest/tests/r00916.vtc starting
[...]
*    top   0.0 TEST VCC reference bug
[...]
**** v1    0.1 CLI TX|\tsub vcl_backend_response {
**** v1    0.1 CLI TX|\t    if (bereq.backend == s-1){
**** v1    0.1 CLI TX|\t\tset bereq.backend = s-1;
**** v1    0.1 CLI TX|\t    }
**** v1    0.1 CLI TX|\t}
**** v1    0.1 CLI TX|
**** v1    0.1 CLI TX|%XJEIFLH|)Xspa8P
***  v1    0.1 CLI RX  106
**** v1    0.1 CLI RX|Message from VCC-compiler:
**** v1    0.1 CLI RX|Symbol not found: 's-1' (expected type BACKEND):
**** v1    0.1 CLI RX|('<vcl.inline>' Line 7 Pos 34)
**** v1    0.1 CLI RX|            if (bereq.backend == s-1){
**** v1    0.1 CLI RX|---------------------------------###--
**** v1    0.1 CLI RX|
**** v1    0.1 CLI RX|Running VCC-compiler failed, exited with 2
**** v1    0.1 CLI RX|VCL compilation failed
**   v1    0.1 VCL compilation failed (as expected)
***  v1    0.1 Found expected string: ("Symbol not found: 's-1' (expected type BACKEND):")
*    top   0.1 RESETTING after ../../../bin/varnishtest/tests/r00916.vtc
**   s1    0.1 Waiting for server (4/-1)
**** s1    0.1 macro undef s1_addr
**** s1    0.1 macro undef s1_port
**** s1    0.1 macro undef s1_sock
**   v1    0.1 Wait
**** v1    0.1 CLI TX|backend.list
***  v1    0.1 CLI RX  101
**** v1    0.1 CLI RX|Unknown request in manager process (child not running).
**** v1    0.1 CLI RX|Type 'help' for more info.
**   v1    0.1 Stop
**** v1    0.1 CLI TX|stop
***  v1    0.2 CLI RX  300
**** v1    0.2 CLI RX|Child in state stopped
**** v1    0.2 CLI TX|status
***  v1    0.2 CLI RX  200
**** v1    0.2 CLI RX|Child in state stopped
**** v1    0.2 STDOUT poll 0x10
**   v1    0.2 R 16637 Status: 0000 (u 0.000000 s 0.004000)
*    diag  0.0 ............................................................
#    top  TEST ../../../bin/varnishtest/tests/r00916.vtc TIMED OUT (kill -9)
#    top  TEST ../../../bin/varnishtest/tests/r00916.vtc FAILED (60.000) signal=9

1 @ SunOS 5.11 i86pc 1.04 64_gcc4.7 uplex

*    top   0.0 TEST ../../../bin/varnishtest/tests/r00916.vtc starting
[...]
*    top   0.0 TEST VCC reference bug
[...]
**** v1    0.1 CLI TX|\t    if (bereq.backend == s-1){
**** v1    0.1 CLI TX|\t\tset bereq.backend = s-1;
**** v1    0.1 CLI TX|\t    }
**** v1    0.1 CLI TX|\t}
**** v1    0.1 CLI TX|
**** v1    0.1 CLI TX|%XJEIFLH|)Xspa8P
***  v1    0.1 CLI RX  106
**** v1    0.1 CLI RX|Message from VCC-compiler:
**** v1    0.1 CLI RX|Security: Privilege proc_setid missing, will not change uid/gid
**** v1    0.1 CLI RX|Symbol not found: 's-1' (expected type BACKEND):
**** v1    0.1 CLI RX|('<vcl.inline>' Line 7 Pos 34)
**** v1    0.1 CLI RX|            if (bereq.backend == s-1){
**** v1    0.1 CLI RX|---------------------------------###--
**** v1    0.1 CLI RX|
**** v1    0.1 CLI RX|Running VCC-compiler failed, exited with 2
**** v1    0.1 CLI RX|VCL compilation failed
**   v1    0.1 VCL compilation failed (as expected)
***  v1    0.1 Found expected string: ("Symbol not found: 's-1' (expected type BACKEND):")
*    top   0.1 RESETTING after ../../../bin/varnishtest/tests/r00916.vtc
**   s1    0.1 Waiting for server (3/-1)
**** s1    0.1 macro undef s1_addr
**** s1    0.1 macro undef s1_port
**** s1    0.1 macro undef s1_sock
**   v1    0.1 Wait
**** v1    0.1 CLI TX|backend.list
***  v1    0.1 CLI RX  101
**** v1    0.1 CLI RX|Unknown request in manager process (child not running).
**** v1    0.1 CLI RX|Type 'help' for more info.
**   v1    0.1 Stop
**** v1    0.1 CLI TX|stop
***  v1    0.1 CLI RX  300
**** v1    0.1 CLI RX|Child in state stopped
**** v1    0.1 CLI TX|status
***  v1    0.1 CLI RX  200
**** v1    0.1 CLI RX|Child in state stopped
**** v1    0.1 STDOUT poll 0x10
**   v1    0.1 R 62628 Status: 0000 (u 0.007000 s 0.023000)
*    diag  0.0 ............................................................
#    top  TEST ../../../bin/varnishtest/tests/r00916.vtc TIMED OUT (kill -9)
#    top  TEST ../../../bin/varnishtest/tests/r00916.vtc FAILED (60.004) signal=9

1 @ SunOS 5.11 i86pc 1.04 32_sun12.4 uplex

*    top   0.0 TEST ../../../bin/varnishtest/tests/r00916.vtc starting
[...]
*    top   0.0 TEST VCC reference bug
[...]
**** v1    0.1 CLI TX|\t    if (bereq.backend == s-1){
**** v1    0.1 CLI TX|\t\tset bereq.backend = s-1;
**** v1    0.1 CLI TX|\t    }
**** v1    0.1 CLI TX|\t}
**** v1    0.1 CLI TX|
**** v1    0.1 CLI TX|%XJEIFLH|)Xspa8P
***  v1    0.1 CLI RX  106
**** v1    0.1 CLI RX|Message from VCC-compiler:
**** v1    0.1 CLI RX|Security: Privilege proc_setid missing, will not change uid/gid
**** v1    0.1 CLI RX|Symbol not found: 's-1' (expected type BACKEND):
**** v1    0.1 CLI RX|('<vcl.inline>' Line 7 Pos 34)
**** v1    0.1 CLI RX|            if (bereq.backend == s-1){
**** v1    0.1 CLI RX|---------------------------------###--
**** v1    0.1 CLI RX|
**** v1    0.1 CLI RX|Running VCC-compiler failed, exited with 2
**** v1    0.1 CLI RX|VCL compilation failed
**   v1    0.1 VCL compilation failed (as expected)
***  v1    0.1 Found expected string: ("Symbol not found: 's-1' (expected type BACKEND):")
*    top   0.1 RESETTING after ../../../bin/varnishtest/tests/r00916.vtc
**   s1    0.1 Waiting for server (3/-1)
**** s1    0.1 macro undef s1_addr
**** s1    0.1 macro undef s1_port
**** s1    0.1 macro undef s1_sock
**   v1    0.1 Wait
**** v1    0.1 CLI TX|backend.list
***  v1    0.1 CLI RX  101
**** v1    0.1 CLI RX|Unknown request in manager process (child not running).
**** v1    0.1 CLI RX|Type 'help' for more info.
**   v1    0.1 Stop
**** v1    0.1 CLI TX|stop
***  v1    0.1 CLI RX  300
**** v1    0.1 CLI RX|Child in state stopped
**** v1    0.1 CLI TX|status
***  v1    0.1 CLI RX  200
**** v1    0.1 CLI RX|Child in state stopped
**** v1    0.1 STDOUT poll 0x10
**   v1    0.1 R 10880 Status: 0000 (u 0.004000 s 0.018000)
*    diag  0.0 ............................................................
#    top  TEST ../../../bin/varnishtest/tests/r00916.vtc TIMED OUT (kill -9)
#    top  TEST ../../../bin/varnishtest/tests/r00916.vtc FAILED (60.002) signal=9

1 @ SunOS 5.11 i86pc 1.04 32_gcc4.7 uplex

*    top   0.0 TEST ../../../bin/varnishtest/tests/r00916.vtc starting
[...]
*    top   0.0 TEST VCC reference bug
[...]
**** v1    0.1 CLI TX|\t    if (bereq.backend == s-1){
**** v1    0.1 CLI TX|\t\tset bereq.backend = s-1;
**** v1    0.1 CLI TX|\t    }
**** v1    0.1 CLI TX|\t}
**** v1    0.1 CLI TX|
**** v1    0.1 CLI TX|%XJEIFLH|)Xspa8P
***  v1    0.1 CLI RX  106
**** v1    0.1 CLI RX|Message from VCC-compiler:
**** v1    0.1 CLI RX|Security: Privilege proc_setid missing, will not change uid/gid
**** v1    0.1 CLI RX|Symbol not found: 's-1' (expected type BACKEND):
**** v1    0.1 CLI RX|('<vcl.inline>' Line 7 Pos 34)
**** v1    0.1 CLI RX|            if (bereq.backend == s-1){
**** v1    0.1 CLI RX|---------------------------------###--
**** v1    0.1 CLI RX|
**** v1    0.1 CLI RX|Running VCC-compiler failed, exited with 2
**** v1    0.1 CLI RX|VCL compilation failed
**   v1    0.1 VCL compilation failed (as expected)
***  v1    0.1 Found expected string: ("Symbol not found: 's-1' (expected type BACKEND):")
*    top   0.1 RESETTING after ../../../bin/varnishtest/tests/r00916.vtc
**   s1    0.1 Waiting for server (3/-1)
**** s1    0.1 macro undef s1_addr
**** s1    0.1 macro undef s1_port
**** s1    0.1 macro undef s1_sock
**   v1    0.1 Wait
**** v1    0.1 CLI TX|backend.list
***  v1    0.1 CLI RX  101
**** v1    0.1 CLI RX|Unknown request in manager process (child not running).
**** v1    0.1 CLI RX|Type 'help' for more info.
**   v1    0.1 Stop
**** v1    0.1 CLI TX|stop
***  v1    0.1 CLI RX  300
**** v1    0.1 CLI RX|Child in state stopped
**** v1    0.1 CLI TX|status
***  v1    0.1 CLI RX  200
**** v1    0.1 CLI RX|Child in state stopped
**** v1    0.1 STDOUT poll 0x10
**   v1    0.1 R 30992 Status: 0000 (u 0.004000 s 0.016000)
*    diag  0.0 ............................................................
#    top  TEST ../../../bin/varnishtest/tests/r00916.vtc TIMED OUT (kill -9)
#    top  TEST ../../../bin/varnishtest/tests/r00916.vtc FAILED (60.002) signal=9

1 @ SunOS 5.11 i86pc 1.04 32_sun12.4 uplex

*    top   0.0 TEST ../../../bin/varnishtest/tests/r00916.vtc starting
[...]
*    top   0.0 TEST VCC reference bug
[...]
**** v1    0.1 CLI TX|\t    if (bereq.backend == s-1){
**** v1    0.1 CLI TX|\t\tset bereq.backend = s-1;
**** v1    0.1 CLI TX|\t    }
**** v1    0.1 CLI TX|\t}
**** v1    0.1 CLI TX|
**** v1    0.1 CLI TX|%XJEIFLH|)Xspa8P
***  v1    0.1 CLI RX  106
**** v1    0.1 CLI RX|Message from VCC-compiler:
**** v1    0.1 CLI RX|Security: Privilege proc_setid missing, will not change uid/gid
**** v1    0.1 CLI RX|Symbol not found: 's-1' (expected type BACKEND):
**** v1    0.1 CLI RX|('<vcl.inline>' Line 7 Pos 34)
**** v1    0.1 CLI RX|            if (bereq.backend == s-1){
**** v1    0.1 CLI RX|---------------------------------###--
**** v1    0.1 CLI RX|
**** v1    0.1 CLI RX|Running VCC-compiler failed, exited with 2
**** v1    0.1 CLI RX|VCL compilation failed
**   v1    0.1 VCL compilation failed (as expected)
***  v1    0.1 Found expected string: ("Symbol not found: 's-1' (expected type BACKEND):")
*    top   0.1 RESETTING after ../../../bin/varnishtest/tests/r00916.vtc
**   s1    0.1 Waiting for server (3/-1)
**** s1    0.1 macro undef s1_addr
**** s1    0.1 macro undef s1_port
**** s1    0.1 macro undef s1_sock
**   v1    0.1 Wait
**** v1    0.1 CLI TX|backend.list
***  v1    0.1 CLI RX  101
**** v1    0.1 CLI RX|Unknown request in manager process (child not running).
**** v1    0.1 CLI RX|Type 'help' for more info.
**   v1    0.1 Stop
**** v1    0.1 CLI TX|stop
***  v1    0.1 CLI RX  300
**** v1    0.1 CLI RX|Child in state stopped
**** v1    0.1 CLI TX|status
***  v1    0.1 CLI RX  200
**** v1    0.1 CLI RX|Child in state stopped
**** v1    0.1 STDOUT poll 0x10
**   v1    0.1 R 46763 Status: 0000 (u 0.004000 s 0.016000)
*    diag  0.0 ............................................................
#    top  TEST ../../../bin/varnishtest/tests/r00916.vtc TIMED OUT (kill -9)
#    top  TEST ../../../bin/varnishtest/tests/r00916.vtc FAILED (60.003) signal=9

1 @ SunOS 5.11 i86pc 1.04 64_gcc4.7 uplex

*    top   0.0 TEST ../../../bin/varnishtest/tests/r00916.vtc starting
[...]
*    top   0.0 TEST VCC reference bug
[...]
**** v1    0.1 CLI TX|\t    if (bereq.backend == s-1){
**** v1    0.1 CLI TX|\t\tset bereq.backend = s-1;
**** v1    0.1 CLI TX|\t    }
**** v1    0.1 CLI TX|\t}
**** v1    0.1 CLI TX|
**** v1    0.1 CLI TX|%XJEIFLH|)Xspa8P
***  v1    0.1 CLI RX  106
**** v1    0.1 CLI RX|Message from VCC-compiler:
**** v1    0.1 CLI RX|Security: Privilege proc_setid missing, will not change uid/gid
**** v1    0.1 CLI RX|Symbol not found: 's-1' (expected type BACKEND):
**** v1    0.1 CLI RX|('<vcl.inline>' Line 7 Pos 34)
**** v1    0.1 CLI RX|            if (bereq.backend == s-1){
**** v1    0.1 CLI RX|---------------------------------###--
**** v1    0.1 CLI RX|
**** v1    0.1 CLI RX|Running VCC-compiler failed, exited with 2
**** v1    0.1 CLI RX|VCL compilation failed
**   v1    0.1 VCL compilation failed (as expected)
***  v1    0.1 Found expected string: ("Symbol not found: 's-1' (expected type BACKEND):")
*    top   0.1 RESETTING after ../../../bin/varnishtest/tests/r00916.vtc
**   s1    0.1 Waiting for server (3/-1)
**** s1    0.1 macro undef s1_addr
**** s1    0.1 macro undef s1_port
**** s1    0.1 macro undef s1_sock
**   v1    0.1 Wait
**** v1    0.1 CLI TX|backend.list
***  v1    0.1 CLI RX  101
**** v1    0.1 CLI RX|Unknown request in manager process (child not running).
**** v1    0.1 CLI RX|Type 'help' for more info.
**   v1    0.1 Stop
**** v1    0.1 CLI TX|stop
***  v1    0.1 CLI RX  300
**** v1    0.1 CLI RX|Child in state stopped
**** v1    0.1 CLI TX|status
***  v1    0.1 CLI RX  200
**** v1    0.1 CLI RX|Child in state stopped
**** v1    0.1 STDOUT poll 0x10
**   v1    0.2 R 46314 Status: 0000 (u 0.009000 s 0.027000)
*    diag  0.0 ............................................................
#    top  TEST ../../../bin/varnishtest/tests/r00916.vtc TIMED OUT (kill -9)
#    top  TEST ../../../bin/varnishtest/tests/r00916.vtc FAILED (60.004) signal=9

1 @ SunOS 5.11 i86pc 1.04 64_gcc4.7 uplex

*    top   0.0 TEST ../../../bin/varnishtest/tests/r00916.vtc starting
[...]
*    top   0.0 TEST VCC reference bug
[...]
**** v1    0.1 CLI TX|\t    if (bereq.backend == s-1){
**** v1    0.1 CLI TX|\t\tset bereq.backend = s-1;
**** v1    0.1 CLI TX|\t    }
**** v1    0.1 CLI TX|\t}
**** v1    0.1 CLI TX|
**** v1    0.1 CLI TX|%XJEIFLH|)Xspa8P
***  v1    0.1 CLI RX  106
**** v1    0.1 CLI RX|Message from VCC-compiler:
**** v1    0.1 CLI RX|Security: Privilege proc_setid missing, will not change uid/gid
**** v1    0.1 CLI RX|Symbol not found: 's-1' (expected type BACKEND):
**** v1    0.1 CLI RX|('<vcl.inline>' Line 7 Pos 34)
**** v1    0.1 CLI RX|            if (bereq.backend == s-1){
**** v1    0.1 CLI RX|---------------------------------###--
**** v1    0.1 CLI RX|
**** v1    0.1 CLI RX|Running VCC-compiler failed, exited with 2
**** v1    0.1 CLI RX|VCL compilation failed
**   v1    0.1 VCL compilation failed (as expected)
***  v1    0.1 Found expected string: ("Symbol not found: 's-1' (expected type BACKEND):")
*    top   0.1 RESETTING after ../../../bin/varnishtest/tests/r00916.vtc
**   s1    0.1 Waiting for server (3/-1)
**** s1    0.1 macro undef s1_addr
**** s1    0.1 macro undef s1_port
**** s1    0.1 macro undef s1_sock
**   v1    0.1 Wait
**** v1    0.1 CLI TX|backend.list
***  v1    0.1 CLI RX  101
**** v1    0.1 CLI RX|Unknown request in manager process (child not running).
**** v1    0.1 CLI RX|Type 'help' for more info.
**   v1    0.1 Stop
**** v1    0.1 CLI TX|stop
***  v1    0.1 CLI RX  300
**** v1    0.1 CLI RX|Child in state stopped
**** v1    0.1 CLI TX|status
***  v1    0.1 CLI RX  200
**** v1    0.1 CLI RX|Child in state stopped
**** v1    0.1 STDOUT poll 0x10
**   v1    0.1 R 13575 Status: 0000 (u 0.007000 s 0.021000)
*    diag  0.0 ............................................................
#    top  TEST ../../../bin/varnishtest/tests/r00916.vtc TIMED OUT (kill -9)
#    top  TEST ../../../bin/varnishtest/tests/r00916.vtc FAILED (60.004) signal=9

1 @ SunOS 5.11 i86pc 1.04 64_gcc4.7 uplex

*    top   0.0 TEST ../../../bin/varnishtest/tests/r00916.vtc starting
[...]
*    top   0.0 TEST VCC reference bug
[...]
**** v1    0.1 CLI TX|\t    if (bereq.backend == s-1){
**** v1    0.1 CLI TX|\t\tset bereq.backend = s-1;
**** v1    0.1 CLI TX|\t    }
**** v1    0.1 CLI TX|\t}
**** v1    0.1 CLI TX|
**** v1    0.1 CLI TX|%XJEIFLH|)Xspa8P
***  v1    0.1 CLI RX  106
**** v1    0.1 CLI RX|Message from VCC-compiler:
**** v1    0.1 CLI RX|Security: Privilege proc_setid missing, will not change uid/gid
**** v1    0.1 CLI RX|Symbol not found: 's-1' (expected type BACKEND):
**** v1    0.1 CLI RX|('<vcl.inline>' Line 7 Pos 34)
**** v1    0.1 CLI RX|            if (bereq.backend == s-1){
**** v1    0.1 CLI RX|---------------------------------###--
**** v1    0.1 CLI RX|
**** v1    0.1 CLI RX|Running VCC-compiler failed, exited with 2
**** v1    0.1 CLI RX|VCL compilation failed
**   v1    0.1 VCL compilation failed (as expected)
***  v1    0.1 Found expected string: ("Symbol not found: 's-1' (expected type BACKEND):")
*    top   0.1 RESETTING after ../../../bin/varnishtest/tests/r00916.vtc
**   s1    0.1 Waiting for server (3/-1)
**** s1    0.1 macro undef s1_addr
**** s1    0.1 macro undef s1_port
**** s1    0.1 macro undef s1_sock
**   v1    0.1 Wait
**** v1    0.1 CLI TX|backend.list
***  v1    0.1 CLI RX  101
**** v1    0.1 CLI RX|Unknown request in manager process (child not running).
**** v1    0.1 CLI RX|Type 'help' for more info.
**   v1    0.1 Stop
**** v1    0.1 CLI TX|stop
***  v1    0.1 CLI RX  300
**** v1    0.1 CLI RX|Child in state stopped
**** v1    0.1 CLI TX|status
***  v1    0.1 CLI RX  200
**** v1    0.1 CLI RX|Child in state stopped
**** v1    0.1 STDOUT poll 0x10
**   v1    0.1 R 28208 Status: 0000 (u 0.007000 s 0.022000)
*    diag  0.0 ............................................................
#    top  TEST ../../../bin/varnishtest/tests/r00916.vtc TIMED OUT (kill -9)
#    top  TEST ../../../bin/varnishtest/tests/r00916.vtc FAILED (60.004) signal=9

1 @ SunOS 5.11 i86pc 1.04 32_sun12.4 uplex

*    top   0.0 TEST ../../../bin/varnishtest/tests/r00916.vtc starting
[...]
*    top   0.0 TEST VCC reference bug
[...]
**** v1    0.1 CLI TX|\t    if (bereq.backend == s-1){
**** v1    0.1 CLI TX|\t\tset bereq.backend = s-1;
**** v1    0.1 CLI TX|\t    }
**** v1    0.1 CLI TX|\t}
**** v1    0.1 CLI TX|
**** v1    0.1 CLI TX|%XJEIFLH|)Xspa8P
***  v1    0.1 CLI RX  106
**** v1    0.1 CLI RX|Message from VCC-compiler:
**** v1    0.1 CLI RX|Security: Privilege proc_setid missing, will not change uid/gid
**** v1    0.1 CLI RX|Symbol not found: 's-1' (expected type BACKEND):
**** v1    0.1 CLI RX|('<vcl.inline>' Line 7 Pos 34)
**** v1    0.1 CLI RX|            if (bereq.backend == s-1){
**** v1    0.1 CLI RX|---------------------------------###--
**** v1    0.1 CLI RX|
**** v1    0.1 CLI RX|Running VCC-compiler failed, exited with 2
**** v1    0.1 CLI RX|VCL compilation failed
**   v1    0.1 VCL compilation failed (as expected)
***  v1    0.1 Found expected string: ("Symbol not found: 's-1' (expected type BACKEND):")
*    top   0.1 RESETTING after ../../../bin/varnishtest/tests/r00916.vtc
**   s1    0.1 Waiting for server (3/-1)
**** s1    0.1 macro undef s1_addr
**** s1    0.1 macro undef s1_port
**** s1    0.1 macro undef s1_sock
**   v1    0.1 Wait
**** v1    0.1 CLI TX|backend.list
***  v1    0.1 CLI RX  101
**** v1    0.1 CLI RX|Unknown request in manager process (child not running).
**** v1    0.1 CLI RX|Type 'help' for more info.
**   v1    0.1 Stop
**** v1    0.1 CLI TX|stop
***  v1    0.1 CLI RX  300
**** v1    0.1 CLI RX|Child in state stopped
**** v1    0.1 CLI TX|status
***  v1    0.1 CLI RX  200
**** v1    0.1 CLI RX|Child in state stopped
**** v1    0.1 STDOUT poll 0x10
**   v1    0.1 R 72593 Status: 0000 (u 0.004000 s 0.016000)
*    diag  0.0 ............................................................
#    top  TEST ../../../bin/varnishtest/tests/r00916.vtc TIMED OUT (kill -9)
#    top  TEST ../../../bin/varnishtest/tests/r00916.vtc FAILED (60.003) signal=9

1 @ Ubuntu LTS i686 1.04 fgs

*    top   0.0 TEST ../../../bin/varnishtest/tests/r00916.vtc starting
[...]
*    top   0.0 TEST VCC reference bug
[...]
**** v1    0.1 CLI TX|\tsub vcl_backend_response {
**** v1    0.1 CLI TX|\t    if (bereq.backend == s-1){
**** v1    0.1 CLI TX|\t\tset bereq.backend = s-1;
**** v1    0.1 CLI TX|\t    }
**** v1    0.1 CLI TX|\t}
**** v1    0.1 CLI TX|
**** v1    0.1 CLI TX|%XJEIFLH|)Xspa8P
***  v1    0.1 CLI RX  106
**** v1    0.1 CLI RX|Message from VCC-compiler:
**** v1    0.1 CLI RX|Symbol not found: 's-1' (expected type BACKEND):
**** v1    0.1 CLI RX|('<vcl.inline>' Line 7 Pos 34)
**** v1    0.1 CLI RX|            if (bereq.backend == s-1){
**** v1    0.1 CLI RX|---------------------------------###--
**** v1    0.1 CLI RX|
**** v1    0.1 CLI RX|Running VCC-compiler failed, exited with 2
**** v1    0.1 CLI RX|VCL compilation failed
**   v1    0.1 VCL compilation failed (as expected)
***  v1    0.1 Found expected string: ("Symbol not found: 's-1' (expected type BACKEND):")
*    top   0.1 RESETTING after ../../../bin/varnishtest/tests/r00916.vtc
**   s1    0.1 Waiting for server (4/-1)
**** s1    0.1 macro undef s1_addr
**** s1    0.1 macro undef s1_port
**** s1    0.1 macro undef s1_sock
**   v1    0.1 Wait
**** v1    0.1 CLI TX|backend.list
***  v1    0.1 CLI RX  101
**** v1    0.1 CLI RX|Unknown request in manager process (child not running).
**** v1    0.1 CLI RX|Type 'help' for more info.
**   v1    0.1 Stop
**** v1    0.1 CLI TX|stop
***  v1    0.2 CLI RX  300
**** v1    0.2 CLI RX|Child in state stopped
**** v1    0.2 CLI TX|status
***  v1    0.2 CLI RX  200
**** v1    0.2 CLI RX|Child in state stopped
**** v1    0.2 STDOUT poll 0x10
**   v1    0.2 R 13721 Status: 0000 (u 0.000000 s 0.004000)
*    diag  0.0 ............................................................
#    top  TEST ../../../bin/varnishtest/tests/r00916.vtc TIMED OUT (kill -9)
#    top  TEST ../../../bin/varnishtest/tests/r00916.vtc FAILED (60.001) signal=9

1 @ Ubuntu LTS i686 1.04 fgs

*    top   0.0 TEST ../../../bin/varnishtest/tests/r00916.vtc starting
[...]
*    top   0.0 TEST VCC reference bug
[...]
**** v1    0.1 CLI TX|\tsub vcl_backend_response {
**** v1    0.1 CLI TX|\t    if (bereq.backend == s-1){
**** v1    0.1 CLI TX|\t\tset bereq.backend = s-1;
**** v1    0.1 CLI TX|\t    }
**** v1    0.1 CLI TX|\t}
**** v1    0.1 CLI TX|
**** v1    0.1 CLI TX|%XJEIFLH|)Xspa8P
***  v1    0.1 CLI RX  106
**** v1    0.1 CLI RX|Message from VCC-compiler:
**** v1    0.1 CLI RX|Symbol not found: 's-1' (expected type BACKEND):
**** v1    0.1 CLI RX|('<vcl.inline>' Line 7 Pos 34)
**** v1    0.1 CLI RX|            if (bereq.backend == s-1){
**** v1    0.1 CLI RX|---------------------------------###--
**** v1    0.1 CLI RX|
**** v1    0.1 CLI RX|Running VCC-compiler failed, exited with 2
**** v1    0.1 CLI RX|VCL compilation failed
**   v1    0.1 VCL compilation failed (as expected)
***  v1    0.1 Found expected string: ("Symbol not found: 's-1' (expected type BACKEND):")
*    top   0.1 RESETTING after ../../../bin/varnishtest/tests/r00916.vtc
**   s1    0.1 Waiting for server (4/-1)
**** s1    0.1 macro undef s1_addr
**** s1    0.1 macro undef s1_port
**** s1    0.1 macro undef s1_sock
**   v1    0.1 Wait
**** v1    0.1 CLI TX|backend.list
***  v1    0.1 CLI RX  101
**** v1    0.1 CLI RX|Unknown request in manager process (child not running).
**** v1    0.1 CLI RX|Type 'help' for more info.
**   v1    0.1 Stop
**** v1    0.1 CLI TX|stop
***  v1    0.2 CLI RX  300
**** v1    0.2 CLI RX|Child in state stopped
**** v1    0.2 CLI TX|status
***  v1    0.2 CLI RX  200
**** v1    0.2 CLI RX|Child in state stopped
**** v1    0.2 STDOUT poll 0x10
**   v1    0.2 R 22535 Status: 0000 (u 0.000000 s 0.004000)
*    diag  0.0 ............................................................
#    top  TEST ../../../bin/varnishtest/tests/r00916.vtc TIMED OUT (kill -9)
#    top  TEST ../../../bin/varnishtest/tests/r00916.vtc FAILED (60.001) signal=9

1 @ SunOS 5.11 i86pc 1.04 32_sun12.4 uplex

*    top   0.0 TEST ../../../bin/varnishtest/tests/r00916.vtc starting
[...]
*    top   0.0 TEST VCC reference bug
[...]
**** v1    0.1 CLI TX|\t    if (bereq.backend == s-1){
**** v1    0.1 CLI TX|\t\tset bereq.backend = s-1;
**** v1    0.1 CLI TX|\t    }
**** v1    0.1 CLI TX|\t}
**** v1    0.1 CLI TX|
**** v1    0.1 CLI TX|%XJEIFLH|)Xspa8P
***  v1    0.1 CLI RX  106
**** v1    0.1 CLI RX|Message from VCC-compiler:
**** v1    0.1 CLI RX|Security: Privilege proc_setid missing, will not change uid/gid
**** v1    0.1 CLI RX|Symbol not found: 's-1' (expected type BACKEND):
**** v1    0.1 CLI RX|('<vcl.inline>' Line 7 Pos 34)
**** v1    0.1 CLI RX|            if (bereq.backend == s-1){
**** v1    0.1 CLI RX|---------------------------------###--
**** v1    0.1 CLI RX|
**** v1    0.1 CLI RX|Running VCC-compiler failed, exited with 2
**** v1    0.1 CLI RX|VCL compilation failed
**   v1    0.1 VCL compilation failed (as expected)
***  v1    0.1 Found expected string: ("Symbol not found: 's-1' (expected type BACKEND):")
*    top   0.1 RESETTING after ../../../bin/varnishtest/tests/r00916.vtc
**   s1    0.1 Waiting for server (3/-1)
**** s1    0.1 macro undef s1_addr
**** s1    0.1 macro undef s1_port
**** s1    0.1 macro undef s1_sock
**   v1    0.1 Wait
**** v1    0.1 CLI TX|backend.list
***  v1    0.1 CLI RX  101
**** v1    0.1 CLI RX|Unknown request in manager process (child not running).
**** v1    0.1 CLI RX|Type 'help' for more info.
**   v1    0.1 Stop
**** v1    0.1 CLI TX|stop
***  v1    0.1 CLI RX  300
**** v1    0.1 CLI RX|Child in state stopped
**** v1    0.1 CLI TX|status
***  v1    0.1 CLI RX  200
**** v1    0.1 CLI RX|Child in state stopped
**** v1    0.1 STDOUT poll 0x10
**   v1    0.1 R 97969 Status: 0000 (u 0.004000 s 0.017000)
*    diag  0.0 ............................................................
#    top  TEST ../../../bin/varnishtest/tests/r00916.vtc TIMED OUT (kill -9)
#    top  TEST ../../../bin/varnishtest/tests/r00916.vtc FAILED (60.002) signal=9

1 @ SunOS 5.11 i86pc 1.04 32_sun12.4 uplex

*    top   0.0 TEST ../../../bin/varnishtest/tests/r00916.vtc starting
[...]
*    top   0.0 TEST VCC reference bug
[...]
**** v1    0.1 CLI TX|\t    if (bereq.backend == s-1){
**** v1    0.1 CLI TX|\t\tset bereq.backend = s-1;
**** v1    0.1 CLI TX|\t    }
**** v1    0.1 CLI TX|\t}
**** v1    0.1 CLI TX|
**** v1    0.1 CLI TX|%XJEIFLH|)Xspa8P
***  v1    0.2 CLI RX  106
**** v1    0.2 CLI RX|Message from VCC-compiler:
**** v1    0.2 CLI RX|Security: Privilege proc_setid missing, will not change uid/gid
**** v1    0.2 CLI RX|Symbol not found: 's-1' (expected type BACKEND):
**** v1    0.2 CLI RX|('<vcl.inline>' Line 7 Pos 34)
**** v1    0.2 CLI RX|            if (bereq.backend == s-1){
**** v1    0.2 CLI RX|---------------------------------###--
**** v1    0.2 CLI RX|
**** v1    0.2 CLI RX|Running VCC-compiler failed, exited with 2
**** v1    0.2 CLI RX|VCL compilation failed
**   v1    0.2 VCL compilation failed (as expected)
***  v1    0.2 Found expected string: ("Symbol not found: 's-1' (expected type BACKEND):")
*    top   0.2 RESETTING after ../../../bin/varnishtest/tests/r00916.vtc
**   s1    0.2 Waiting for server (3/-1)
**** s1    0.2 macro undef s1_addr
**** s1    0.2 macro undef s1_port
**** s1    0.2 macro undef s1_sock
**   v1    0.2 Wait
**** v1    0.2 CLI TX|backend.list
***  v1    0.2 CLI RX  101
**** v1    0.2 CLI RX|Unknown request in manager process (child not running).
**** v1    0.2 CLI RX|Type 'help' for more info.
**   v1    0.2 Stop
**** v1    0.2 CLI TX|stop
***  v1    0.2 CLI RX  300
**** v1    0.2 CLI RX|Child in state stopped
**** v1    0.2 CLI TX|status
***  v1    0.2 CLI RX  200
**** v1    0.2 CLI RX|Child in state stopped
**** v1    0.2 STDOUT poll 0x10
**   v1    0.2 R 10257 Status: 0000 (u 0.007000 s 0.028000)
*    diag  0.0 ............................................................
#    top  TEST ../../../bin/varnishtest/tests/r00916.vtc TIMED OUT (kill -9)
#    top  TEST ../../../bin/varnishtest/tests/r00916.vtc FAILED (60.003) signal=9

1 @ SunOS 5.11 i86pc 1.04 64_gcc4.7 uplex

*    top   0.0 TEST ../../../bin/varnishtest/tests/r00916.vtc starting
[...]
*    top   0.0 TEST VCC reference bug
[...]
**** v1    0.1 CLI TX|\t    if (bereq.backend == s-1){
**** v1    0.1 CLI TX|\t\tset bereq.backend = s-1;
**** v1    0.1 CLI TX|\t    }
**** v1    0.1 CLI TX|\t}
**** v1    0.1 CLI TX|
**** v1    0.1 CLI TX|%XJEIFLH|)Xspa8P
***  v1    0.1 CLI RX  106
**** v1    0.1 CLI RX|Message from VCC-compiler:
**** v1    0.1 CLI RX|Security: Privilege proc_setid missing, will not change uid/gid
**** v1    0.1 CLI RX|Symbol not found: 's-1' (expected type BACKEND):
**** v1    0.1 CLI RX|('<vcl.inline>' Line 7 Pos 34)
**** v1    0.1 CLI RX|            if (bereq.backend == s-1){
**** v1    0.1 CLI RX|---------------------------------###--
**** v1    0.1 CLI RX|
**** v1    0.1 CLI RX|Running VCC-compiler failed, exited with 2
**** v1    0.1 CLI RX|VCL compilation failed
**   v1    0.1 VCL compilation failed (as expected)
***  v1    0.1 Found expected string: ("Symbol not found: 's-1' (expected type BACKEND):")
*    top   0.1 RESETTING after ../../../bin/varnishtest/tests/r00916.vtc
**   s1    0.1 Waiting for server (3/-1)
**** s1    0.1 macro undef s1_addr
**** s1    0.1 macro undef s1_port
**** s1    0.1 macro undef s1_sock
**   v1    0.1 Wait
**** v1    0.1 CLI TX|backend.list
***  v1    0.1 CLI RX  101
**** v1    0.1 CLI RX|Unknown request in manager process (child not running).
**** v1    0.1 CLI RX|Type 'help' for more info.
**   v1    0.1 Stop
**** v1    0.1 CLI TX|stop
***  v1    0.1 CLI RX  300
**** v1    0.1 CLI RX|Child in state stopped
**** v1    0.1 CLI TX|status
***  v1    0.1 CLI RX  200
**** v1    0.1 CLI RX|Child in state stopped
**** v1    0.1 STDOUT poll 0x10
**   v1    0.1 R 38710 Status: 0000 (u 0.007000 s 0.021000)
*    diag  0.0 ............................................................
#    top  TEST ../../../bin/varnishtest/tests/r00916.vtc TIMED OUT (kill -9)
#    top  TEST ../../../bin/varnishtest/tests/r00916.vtc FAILED (60.004) signal=9

1 @ Ubuntu LTS i686 1.04 fgs

*    top   0.0 TEST ../../../bin/varnishtest/tests/r00916.vtc starting
[...]
*    top   0.0 TEST VCC reference bug
[...]
**** v1    0.1 CLI TX|\tsub vcl_backend_response {
**** v1    0.1 CLI TX|\t    if (bereq.backend == s-1){
**** v1    0.1 CLI TX|\t\tset bereq.backend = s-1;
**** v1    0.1 CLI TX|\t    }
**** v1    0.1 CLI TX|\t}
**** v1    0.1 CLI TX|
**** v1    0.1 CLI TX|%XJEIFLH|)Xspa8P
***  v1    0.1 CLI RX  106
**** v1    0.1 CLI RX|Message from VCC-compiler:
**** v1    0.1 CLI RX|Symbol not found: 's-1' (expected type BACKEND):
**** v1    0.1 CLI RX|('<vcl.inline>' Line 7 Pos 34)
**** v1    0.1 CLI RX|            if (bereq.backend == s-1){
**** v1    0.1 CLI RX|---------------------------------###--
**** v1    0.1 CLI RX|
**** v1    0.1 CLI RX|Running VCC-compiler failed, exited with 2
**** v1    0.1 CLI RX|VCL compilation failed
**   v1    0.1 VCL compilation failed (as expected)
***  v1    0.1 Found expected string: ("Symbol not found: 's-1' (expected type BACKEND):")
*    top   0.1 RESETTING after ../../../bin/varnishtest/tests/r00916.vtc
**   s1    0.1 Waiting for server (4/-1)
**** s1    0.1 macro undef s1_addr
**** s1    0.1 macro undef s1_port
**** s1    0.1 macro undef s1_sock
**   v1    0.1 Wait
**** v1    0.1 CLI TX|backend.list
***  v1    0.1 CLI RX  101
**** v1    0.1 CLI RX|Unknown request in manager process (child not running).
**** v1    0.1 CLI RX|Type 'help' for more info.
**   v1    0.1 Stop
**** v1    0.1 CLI TX|stop
***  v1    0.2 CLI RX  300
**** v1    0.2 CLI RX|Child in state stopped
**** v1    0.2 CLI TX|status
***  v1    0.2 CLI RX  200
**** v1    0.2 CLI RX|Child in state stopped
**** v1    0.2 STDOUT poll 0x10
**   v1    0.2 R 2579 Status: 0000 (u 0.000000 s 0.008000)
*    diag  0.0 ............................................................
#    top  TEST ../../../bin/varnishtest/tests/r00916.vtc TIMED OUT (kill -9)
#    top  TEST ../../../bin/varnishtest/tests/r00916.vtc FAILED (60.001) signal=9

1 @ Linux 3.10.0 x86_64 1.02 mblissett

*    top   0.0 TEST ../../../bin/varnishtest/tests/r00916.vtc starting
[...]
*    top   0.0 TEST VCC reference bug
[...]
**** v1    0.1 CLI TX|\tsub vcl_backend_response {
**** v1    0.1 CLI TX|\t    if (bereq.backend == s-1){
**** v1    0.1 CLI TX|\t\tset bereq.backend = s-1;
**** v1    0.1 CLI TX|\t    }
**** v1    0.1 CLI TX|\t}
**** v1    0.1 CLI TX|
**** v1    0.1 CLI TX|%XJEIFLH|)Xspa8P
***  v1    0.1 CLI RX  106
**** v1    0.1 CLI RX|Message from VCC-compiler:
**** v1    0.1 CLI RX|Symbol not found: 's-1' (expected type BACKEND):
**** v1    0.1 CLI RX|('<vcl.inline>' Line 7 Pos 34)
**** v1    0.1 CLI RX|            if (bereq.backend == s-1){
**** v1    0.1 CLI RX|---------------------------------###--
**** v1    0.1 CLI RX|
**** v1    0.1 CLI RX|Running VCC-compiler failed, exited with 2
**** v1    0.1 CLI RX|VCL compilation failed
**   v1    0.1 VCL compilation failed (as expected)
***  v1    0.1 Found expected string: ("Symbol not found: 's-1' (expected type BACKEND):")
*    top   0.1 RESETTING after ../../../bin/varnishtest/tests/r00916.vtc
**   s1    0.1 Waiting for server (4/-1)
**** s1    0.1 macro undef s1_addr
**** s1    0.1 macro undef s1_port
**** s1    0.1 macro undef s1_sock
**   v1    0.1 Wait
**** v1    0.1 CLI TX|backend.list
***  v1    0.2 CLI RX  101
**** v1    0.2 CLI RX|Unknown request in manager process (child not running).
**** v1    0.2 CLI RX|Type 'help' for more info.
**   v1    0.2 Stop
**** v1    0.2 CLI TX|stop
***  v1    0.2 CLI RX  300
**** v1    0.2 CLI RX|Child in state stopped
**** v1    0.2 CLI TX|status
***  v1    0.2 CLI RX  200
**** v1    0.2 CLI RX|Child in state stopped
**** v1    0.2 STDOUT poll 0x10
**   v1    0.2 R 18495 Status: 0000 (u 0.000966 s 0.016225)
*    diag  0.0 ............................................................
#    top  TEST ../../../bin/varnishtest/tests/r00916.vtc TIMED OUT (kill -9)
#    top  TEST ../../../bin/varnishtest/tests/r00916.vtc FAILED (60.001) signal=9

1 @ SunOS 5.11 i86pc 1.04 32_sun12.4 uplex

*    top   0.0 TEST ../../../bin/varnishtest/tests/r00916.vtc starting
[...]
*    top   0.0 TEST VCC reference bug
[...]
**** v1    0.1 CLI TX|\t    if (bereq.backend == s-1){
**** v1    0.1 CLI TX|\t\tset bereq.backend = s-1;
**** v1    0.1 CLI TX|\t    }
**** v1    0.1 CLI TX|\t}
**** v1    0.1 CLI TX|
**** v1    0.1 CLI TX|%XJEIFLH|)Xspa8P
***  v1    0.1 CLI RX  106
**** v1    0.1 CLI RX|Message from VCC-compiler:
**** v1    0.1 CLI RX|Security: Privilege proc_setid missing, will not change uid/gid
**** v1    0.1 CLI RX|Symbol not found: 's-1' (expected type BACKEND):
**** v1    0.1 CLI RX|('<vcl.inline>' Line 7 Pos 34)
**** v1    0.1 CLI RX|            if (bereq.backend == s-1){
**** v1    0.1 CLI RX|---------------------------------###--
**** v1    0.1 CLI RX|
**** v1    0.1 CLI RX|Running VCC-compiler failed, exited with 2
**** v1    0.1 CLI RX|VCL compilation failed
**   v1    0.1 VCL compilation failed (as expected)
***  v1    0.1 Found expected string: ("Symbol not found: 's-1' (expected type BACKEND):")
*    top   0.1 RESETTING after ../../../bin/varnishtest/tests/r00916.vtc
**   s1    0.1 Waiting for server (3/-1)
**** s1    0.1 macro undef s1_addr
**** s1    0.1 macro undef s1_port
**** s1    0.1 macro undef s1_sock
**   v1    0.1 Wait
**** v1    0.1 CLI TX|backend.list
***  v1    0.1 CLI RX  101
**** v1    0.1 CLI RX|Unknown request in manager process (child not running).
**** v1    0.1 CLI RX|Type 'help' for more info.
**   v1    0.1 Stop
**** v1    0.1 CLI TX|stop
***  v1    0.1 CLI RX  300
**** v1    0.1 CLI RX|Child in state stopped
**** v1    0.1 CLI TX|status
***  v1    0.1 CLI RX  200
**** v1    0.1 CLI RX|Child in state stopped
**** v1    0.1 STDOUT poll 0x10
**   v1    0.1 R 96317 Status: 0000 (u 0.004000 s 0.017000)
*    diag  0.0 ............................................................
#    top  TEST ../../../bin/varnishtest/tests/r00916.vtc TIMED OUT (kill -9)
#    top  TEST ../../../bin/varnishtest/tests/r00916.vtc FAILED (60.002) signal=9

1 @ Linux 3.10.0 x86_64 1.02 mblissett

*    top   0.0 TEST ../../../bin/varnishtest/tests/r00916.vtc starting
[...]
*    top   0.0 TEST VCC reference bug
[...]
**** v1    0.1 CLI TX|\tsub vcl_backend_response {
**** v1    0.1 CLI TX|\t    if (bereq.backend == s-1){
**** v1    0.1 CLI TX|\t\tset bereq.backend = s-1;
**** v1    0.1 CLI TX|\t    }
**** v1    0.1 CLI TX|\t}
**** v1    0.1 CLI TX|
**** v1    0.1 CLI TX|%XJEIFLH|)Xspa8P
***  v1    0.1 CLI RX  106
**** v1    0.1 CLI RX|Message from VCC-compiler:
**** v1    0.1 CLI RX|Symbol not found: 's-1' (expected type BACKEND):
**** v1    0.1 CLI RX|('<vcl.inline>' Line 7 Pos 34)
**** v1    0.1 CLI RX|            if (bereq.backend == s-1){
**** v1    0.1 CLI RX|---------------------------------###--
**** v1    0.1 CLI RX|
**** v1    0.1 CLI RX|Running VCC-compiler failed, exited with 2
**** v1    0.1 CLI RX|VCL compilation failed
**   v1    0.1 VCL compilation failed (as expected)
***  v1    0.1 Found expected string: ("Symbol not found: 's-1' (expected type BACKEND):")
*    top   0.1 RESETTING after ../../../bin/varnishtest/tests/r00916.vtc
**   s1    0.1 Waiting for server (4/-1)
**** s1    0.1 macro undef s1_addr
**** s1    0.1 macro undef s1_port
**** s1    0.1 macro undef s1_sock
**   v1    0.1 Wait
**** v1    0.1 CLI TX|backend.list
***  v1    0.2 CLI RX  101
**** v1    0.2 CLI RX|Unknown request in manager process (child not running).
**** v1    0.2 CLI RX|Type 'help' for more info.
**   v1    0.2 Stop
**** v1    0.2 CLI TX|stop
***  v1    0.2 CLI RX  300
**** v1    0.2 CLI RX|Child in state stopped
**** v1    0.2 CLI TX|status
***  v1    0.2 CLI RX  200
**** v1    0.2 CLI RX|Child in state stopped
**** v1    0.2 STDOUT poll 0x10
**   v1    0.2 R 1896 Status: 0000 (u 0.002889 s 0.012730)
*    diag  0.0 ............................................................
#    top  TEST ../../../bin/varnishtest/tests/r00916.vtc TIMED OUT (kill -9)
#    top  TEST ../../../bin/varnishtest/tests/r00916.vtc FAILED (60.001) signal=9

1 @ Linux 3.10.0 x86_64 1.02 mblissett

*    top   0.0 TEST ../../../bin/varnishtest/tests/r00916.vtc starting
[...]
*    top   0.0 TEST VCC reference bug
[...]
**** v1    0.1 CLI TX|\tsub vcl_backend_response {
**** v1    0.1 CLI TX|\t    if (bereq.backend == s-1){
**** v1    0.1 CLI TX|\t\tset bereq.backend = s-1;
**** v1    0.1 CLI TX|\t    }
**** v1    0.1 CLI TX|\t}
**** v1    0.1 CLI TX|
**** v1    0.1 CLI TX|%XJEIFLH|)Xspa8P
***  v1    0.1 CLI RX  106
**** v1    0.1 CLI RX|Message from VCC-compiler:
**** v1    0.1 CLI RX|Symbol not found: 's-1' (expected type BACKEND):
**** v1    0.1 CLI RX|('<vcl.inline>' Line 7 Pos 34)
**** v1    0.1 CLI RX|            if (bereq.backend == s-1){
**** v1    0.1 CLI RX|---------------------------------###--
**** v1    0.1 CLI RX|
**** v1    0.1 CLI RX|Running VCC-compiler failed, exited with 2
**** v1    0.1 CLI RX|VCL compilation failed
**   v1    0.1 VCL compilation failed (as expected)
***  v1    0.1 Found expected string: ("Symbol not found: 's-1' (expected type BACKEND):")
*    top   0.1 RESETTING after ../../../bin/varnishtest/tests/r00916.vtc
**   s1    0.1 Waiting for server (4/-1)
**** s1    0.1 macro undef s1_addr
**** s1    0.1 macro undef s1_port
**** s1    0.1 macro undef s1_sock
**   v1    0.1 Wait
**** v1    0.1 CLI TX|backend.list
***  v1    0.2 CLI RX  101
**** v1    0.2 CLI RX|Unknown request in manager process (child not running).
**** v1    0.2 CLI RX|Type 'help' for more info.
**   v1    0.2 Stop
**** v1    0.2 CLI TX|stop
***  v1    0.2 CLI RX  300
**** v1    0.2 CLI RX|Child in state stopped
**** v1    0.2 CLI TX|status
***  v1    0.2 CLI RX  200
**** v1    0.2 CLI RX|Child in state stopped
**** v1    0.2 STDOUT poll 0x10
**   v1    0.2 R 28026 Status: 0000 (u 0.004235 s 0.015073)
*    diag  0.0 ............................................................
#    top  TEST ../../../bin/varnishtest/tests/r00916.vtc TIMED OUT (kill -9)
#    top  TEST ../../../bin/varnishtest/tests/r00916.vtc FAILED (60.002) signal=9

1 @ Linux 3.10.0 x86_64 1.02 mblissett

*    top   0.0 TEST ../../../bin/varnishtest/tests/r00916.vtc starting
[...]
*    top   0.0 TEST VCC reference bug
[...]
**** v1    0.1 CLI TX|\tsub vcl_backend_response {
**** v1    0.1 CLI TX|\t    if (bereq.backend == s-1){
**** v1    0.1 CLI TX|\t\tset bereq.backend = s-1;
**** v1    0.1 CLI TX|\t    }
**** v1    0.1 CLI TX|\t}
**** v1    0.1 CLI TX|
**** v1    0.1 CLI TX|%XJEIFLH|)Xspa8P
***  v1    0.1 CLI RX  106
**** v1    0.1 CLI RX|Message from VCC-compiler:
**** v1    0.1 CLI RX|Symbol not found: 's-1' (expected type BACKEND):
**** v1    0.1 CLI RX|('<vcl.inline>' Line 7 Pos 34)
**** v1    0.1 CLI RX|            if (bereq.backend == s-1){
**** v1    0.1 CLI RX|---------------------------------###--
**** v1    0.1 CLI RX|
**** v1    0.1 CLI RX|Running VCC-compiler failed, exited with 2
**** v1    0.1 CLI RX|VCL compilation failed
**   v1    0.1 VCL compilation failed (as expected)
***  v1    0.1 Found expected string: ("Symbol not found: 's-1' (expected type BACKEND):")
*    top   0.1 RESETTING after ../../../bin/varnishtest/tests/r00916.vtc
**   s1    0.1 Waiting for server (4/-1)
**** s1    0.1 macro undef s1_addr
**** s1    0.1 macro undef s1_port
**** s1    0.1 macro undef s1_sock
**   v1    0.1 Wait
**** v1    0.1 CLI TX|backend.list
***  v1    0.2 CLI RX  101
**** v1    0.2 CLI RX|Unknown request in manager process (child not running).
**** v1    0.2 CLI RX|Type 'help' for more info.
**   v1    0.2 Stop
**** v1    0.2 CLI TX|stop
***  v1    0.2 CLI RX  300
**** v1    0.2 CLI RX|Child in state stopped
**** v1    0.2 CLI TX|status
***  v1    0.2 CLI RX  200
**** v1    0.2 CLI RX|Child in state stopped
**** v1    0.2 STDOUT poll 0x10
**   v1    0.2 R 21685 Status: 0000 (u 0.000000 s 0.012158)
*    diag  0.0 ............................................................
#    top  TEST ../../../bin/varnishtest/tests/r00916.vtc TIMED OUT (kill -9)
#    top  TEST ../../../bin/varnishtest/tests/r00916.vtc FAILED (60.001) signal=9

1 @ Ubuntu LTS i686 1.04 fgs

*    top   0.0 TEST ../../../bin/varnishtest/tests/r00916.vtc starting
[...]
*    top   0.0 TEST VCC reference bug
[...]
**** v1    0.1 CLI TX|\tsub vcl_backend_response {
**** v1    0.1 CLI TX|\t    if (bereq.backend == s-1){
**** v1    0.1 CLI TX|\t\tset bereq.backend = s-1;
**** v1    0.1 CLI TX|\t    }
**** v1    0.1 CLI TX|\t}
**** v1    0.1 CLI TX|
**** v1    0.1 CLI TX|%XJEIFLH|)Xspa8P
***  v1    0.1 CLI RX  106
**** v1    0.1 CLI RX|Message from VCC-compiler:
**** v1    0.1 CLI RX|Symbol not found: 's-1' (expected type BACKEND):
**** v1    0.1 CLI RX|('<vcl.inline>' Line 7 Pos 34)
**** v1    0.1 CLI RX|            if (bereq.backend == s-1){
**** v1    0.1 CLI RX|---------------------------------###--
**** v1    0.1 CLI RX|
**** v1    0.1 CLI RX|Running VCC-compiler failed, exited with 2
**** v1    0.1 CLI RX|VCL compilation failed
**   v1    0.1 VCL compilation failed (as expected)
***  v1    0.1 Found expected string: ("Symbol not found: 's-1' (expected type BACKEND):")
*    top   0.1 RESETTING after ../../../bin/varnishtest/tests/r00916.vtc
**   s1    0.1 Waiting for server (4/-1)
**** s1    0.1 macro undef s1_addr
**** s1    0.1 macro undef s1_port
**** s1    0.1 macro undef s1_sock
**   v1    0.1 Wait
**** v1    0.1 CLI TX|backend.list
***  v1    0.1 CLI RX  101
**** v1    0.1 CLI RX|Unknown request in manager process (child not running).
**** v1    0.1 CLI RX|Type 'help' for more info.
**   v1    0.1 Stop
**** v1    0.1 CLI TX|stop
***  v1    0.2 CLI RX  300
**** v1    0.2 CLI RX|Child in state stopped
**** v1    0.2 CLI TX|status
***  v1    0.2 CLI RX  200
**** v1    0.2 CLI RX|Child in state stopped
**** v1    0.2 STDOUT poll 0x10
**   v1    0.2 R 32029 Status: 0000 (u 0.000000 s 0.004000)
*    diag  0.0 ............................................................
#    top  TEST ../../../bin/varnishtest/tests/r00916.vtc TIMED OUT (kill -9)
#    top  TEST ../../../bin/varnishtest/tests/r00916.vtc FAILED (60.000) signal=9

1 @ SunOS 5.11 i86pc 1.04 64_gcc4.7 uplex

*    top   0.0 TEST ../../../bin/varnishtest/tests/r00916.vtc starting
[...]
*    top   0.0 TEST VCC reference bug
[...]
**** v1    0.1 CLI TX|\t    if (bereq.backend == s-1){
**** v1    0.1 CLI TX|\t\tset bereq.backend = s-1;
**** v1    0.1 CLI TX|\t    }
**** v1    0.1 CLI TX|\t}
**** v1    0.1 CLI TX|
**** v1    0.1 CLI TX|%XJEIFLH|)Xspa8P
***  v1    0.1 CLI RX  106
**** v1    0.1 CLI RX|Message from VCC-compiler:
**** v1    0.1 CLI RX|Security: Privilege proc_setid missing, will not change uid/gid
**** v1    0.1 CLI RX|Symbol not found: 's-1' (expected type BACKEND):
**** v1    0.1 CLI RX|('<vcl.inline>' Line 7 Pos 34)
**** v1    0.1 CLI RX|            if (bereq.backend == s-1){
**** v1    0.1 CLI RX|---------------------------------###--
**** v1    0.1 CLI RX|
**** v1    0.1 CLI RX|Running VCC-compiler failed, exited with 2
**** v1    0.1 CLI RX|VCL compilation failed
**   v1    0.1 VCL compilation failed (as expected)
***  v1    0.1 Found expected string: ("Symbol not found: 's-1' (expected type BACKEND):")
*    top   0.1 RESETTING after ../../../bin/varnishtest/tests/r00916.vtc
**   s1    0.1 Waiting for server (3/-1)
**** s1    0.1 macro undef s1_addr
**** s1    0.1 macro undef s1_port
**** s1    0.1 macro undef s1_sock
**   v1    0.1 Wait
**** v1    0.1 CLI TX|backend.list
***  v1    0.1 CLI RX  101
**** v1    0.1 CLI RX|Unknown request in manager process (child not running).
**** v1    0.1 CLI RX|Type 'help' for more info.
**   v1    0.1 Stop
**** v1    0.1 CLI TX|stop
***  v1    0.1 CLI RX  300
**** v1    0.1 CLI RX|Child in state stopped
**** v1    0.1 CLI TX|status
***  v1    0.1 CLI RX  200
**** v1    0.1 CLI RX|Child in state stopped
**** v1    0.1 STDOUT poll 0x10
**   v1    0.1 R 73272 Status: 0000 (u 0.007000 s 0.022000)
*    diag  0.0 ............................................................
#    top  TEST ../../../bin/varnishtest/tests/r00916.vtc TIMED OUT (kill -9)
#    top  TEST ../../../bin/varnishtest/tests/r00916.vtc FAILED (60.004) signal=9

1 @ Ubuntu LTS i686 1.04 fgs

*    top   0.0 TEST ../../../bin/varnishtest/tests/r00916.vtc starting
[...]
*    top   0.0 TEST VCC reference bug
[...]
**** v1    0.1 CLI TX|\tsub vcl_backend_response {
**** v1    0.1 CLI TX|\t    if (bereq.backend == s-1){
**** v1    0.1 CLI TX|\t\tset bereq.backend = s-1;
**** v1    0.1 CLI TX|\t    }
**** v1    0.1 CLI TX|\t}
**** v1    0.1 CLI TX|
**** v1    0.1 CLI TX|%XJEIFLH|)Xspa8P
***  v1    0.1 CLI RX  106
**** v1    0.1 CLI RX|Message from VCC-compiler:
**** v1    0.1 CLI RX|Symbol not found: 's-1' (expected type BACKEND):
**** v1    0.1 CLI RX|('<vcl.inline>' Line 7 Pos 34)
**** v1    0.1 CLI RX|            if (bereq.backend == s-1){
**** v1    0.1 CLI RX|---------------------------------###--
**** v1    0.1 CLI RX|
**** v1    0.1 CLI RX|Running VCC-compiler failed, exited with 2
**** v1    0.1 CLI RX|VCL compilation failed
**   v1    0.1 VCL compilation failed (as expected)
***  v1    0.1 Found expected string: ("Symbol not found: 's-1' (expected type BACKEND):")
*    top   0.1 RESETTING after ../../../bin/varnishtest/tests/r00916.vtc
**   s1    0.1 Waiting for server (4/-1)
**** s1    0.1 macro undef s1_addr
**** s1    0.1 macro undef s1_port
**** s1    0.1 macro undef s1_sock
**   v1    0.1 Wait
**** v1    0.1 CLI TX|backend.list
***  v1    0.1 CLI RX  101
**** v1    0.1 CLI RX|Unknown request in manager process (child not running).
**** v1    0.1 CLI RX|Type 'help' for more info.
**   v1    0.1 Stop
**** v1    0.1 CLI TX|stop
***  v1    0.2 CLI RX  300
**** v1    0.2 CLI RX|Child in state stopped
**** v1    0.2 CLI TX|status
***  v1    0.2 CLI RX  200
**** v1    0.2 CLI RX|Child in state stopped
**** v1    0.2 STDOUT poll 0x10
**   v1    0.2 R 7719 Status: 0000 (u 0.000000 s 0.004000)
*    diag  0.0 ............................................................
#    top  TEST ../../../bin/varnishtest/tests/r00916.vtc TIMED OUT (kill -9)
#    top  TEST ../../../bin/varnishtest/tests/r00916.vtc FAILED (60.001) signal=9

1 @ SunOS 5.11 i86pc 1.04 64_gcc4.7 uplex

*    top   0.0 TEST ../../../bin/varnishtest/tests/r00916.vtc starting
[...]
*    top   0.0 TEST VCC reference bug
[...]
**** v1    0.1 CLI TX|\t    if (bereq.backend == s-1){
**** v1    0.1 CLI TX|\t\tset bereq.backend = s-1;
**** v1    0.1 CLI TX|\t    }
**** v1    0.1 CLI TX|\t}
**** v1    0.1 CLI TX|
**** v1    0.1 CLI TX|%XJEIFLH|)Xspa8P
***  v1    0.1 CLI RX  106
**** v1    0.1 CLI RX|Message from VCC-compiler:
**** v1    0.1 CLI RX|Security: Privilege proc_setid missing, will not change uid/gid
**** v1    0.1 CLI RX|Symbol not found: 's-1' (expected type BACKEND):
**** v1    0.1 CLI RX|('<vcl.inline>' Line 7 Pos 34)
**** v1    0.1 CLI RX|            if (bereq.backend == s-1){
**** v1    0.1 CLI RX|---------------------------------###--
**** v1    0.1 CLI RX|
**** v1    0.1 CLI RX|Running VCC-compiler failed, exited with 2
**** v1    0.1 CLI RX|VCL compilation failed
**   v1    0.1 VCL compilation failed (as expected)
***  v1    0.1 Found expected string: ("Symbol not found: 's-1' (expected type BACKEND):")
*    top   0.1 RESETTING after ../../../bin/varnishtest/tests/r00916.vtc
**   s1    0.1 Waiting for server (3/-1)
**** s1    0.1 macro undef s1_addr
**** s1    0.1 macro undef s1_port
**** s1    0.1 macro undef s1_sock
**   v1    0.1 Wait
**** v1    0.1 CLI TX|backend.list
***  v1    0.1 CLI RX  101
**** v1    0.1 CLI RX|Unknown request in manager process (child not running).
**** v1    0.1 CLI RX|Type 'help' for more info.
**   v1    0.1 Stop
**** v1    0.1 CLI TX|stop
***  v1    0.1 CLI RX  300
**** v1    0.1 CLI RX|Child in state stopped
**** v1    0.1 CLI TX|status
***  v1    0.1 CLI RX  200
**** v1    0.1 CLI RX|Child in state stopped
**** v1    0.1 STDOUT poll 0x10
**   v1    0.1 R 94796 Status: 0000 (u 0.007000 s 0.022000)
*    diag  0.0 ............................................................
#    top  TEST ../../../bin/varnishtest/tests/r00916.vtc TIMED OUT (kill -9)
#    top  TEST ../../../bin/varnishtest/tests/r00916.vtc FAILED (60.004) signal=9