r01145

7251861

1 @ SunOS i86pc 5.11 1.04 32_sun12.4 uplex

*    top   0.0 TEST ../../../bin/varnishtest/tests/r01145.vtc starting
[...]
*    top   0.0 TEST Test fileread for std VMOD
[...]
**** v1    0.2 CLI RX|Type 'quit' to close CLI session.
**** v1    0.2 CLI RX|Type 'start' to launch worker process.
**** v1    0.2 CLI TX|vcl.inline vcl1 << %XJEIFLH|)Xspa8P
**** v1    0.2 CLI TX|vcl 4.1;
**** v1    0.2 CLI TX|backend s1 { .host = "127.0.0.1"; .port = "35949"; }
**** v1    0.2 CLI TX|
**** v1    0.2 CLI TX|
**** v1    0.2 CLI TX|\timport std;
**** v1    0.2 CLI TX|
**** v1    0.2 CLI TX|\tsub vcl_deliver {
**** v1    0.2 CLI TX|\t    set resp.http.foo = std.fileread("/tmp/vtest.32_sun12.4/_vtest_tmp/vtc.36916.6411f0c7" + req.url);
**** v1    0.2 CLI TX|\t}
**** v1    0.2 CLI TX|
**** v1    0.2 CLI TX|%XJEIFLH|)Xspa8P
***  v1    0.2 CLI RX  106
**** v1    0.2 CLI RX|Message from VCC-compiler:
**** v1    0.2 CLI RX|Security: Privilege proc_setid missing, will not change uid/gid
**** v1    0.2 CLI RX|Could not load VMOD std
**** v1    0.2 CLI RX|\tFile name: /tmp/vtest.32_sun12.4/varnish-cache/varnish-trunk/_build/lib/libvmod_std/.libs/libvmod_std.so
**** v1    0.2 CLI RX|\tdlerror: ld.so.1: varnishd: fatal: relocation error: file /tmp/vtest.32_sun12.4/varnish-cache/varnish-trunk/_build/lib/libvmod_std/.libs/libvmod_std.so: symbol vmod_issyntax: referenced symbol not found
**** v1    0.2 CLI RX|('<vcl.inline>' Line 5 Pos 16)
**** v1    0.2 CLI RX|        import std;
**** v1    0.2 CLI RX|---------------###-
**** v1    0.2 CLI RX|
**** v1    0.2 CLI RX|Running VCC-compiler failed, exited with 2
**** v1    0.2 CLI RX|VCL compilation failed
---- v1    0.2 FAIL VCL does not compile
*    top   0.2 RESETTING after ../../../bin/varnishtest/tests/r01145.vtc
**   s1    0.2 Waiting for server (3/-1)
**   v1    0.2 Wait
**** v1    0.2 CLI TX|panic.clear
***  v1    0.2 CLI RX  300
**** v1    0.2 CLI RX|No panic to clear
***  v1    0.2 debug|Info: manager stopping child
***  v1    0.2 debug|Info: manager dies
**** v1    0.2 STDOUT poll 0x10
**   v1    0.2 R 36934 Status: 0000 (u 0.007000 s 0.025000)
***  v1    0.3 vsl|No VSL chunk found (child not started ?)
*    top   0.3 TEST ../../../bin/varnishtest/tests/r01145.vtc FAILED
#    top  TEST ../../../bin/varnishtest/tests/r01145.vtc FAILED (0.254) exit=2

1 @ SunOS i86pc 5.11 1.04 64_sun12.4 uplex

*    top   0.0 TEST ../../../bin/varnishtest/tests/r01145.vtc starting
[...]
*    top   0.0 TEST Test fileread for std VMOD
[...]
**** v1    0.2 CLI RX|Type 'quit' to close CLI session.
**** v1    0.2 CLI RX|Type 'start' to launch worker process.
**** v1    0.2 CLI TX|vcl.inline vcl1 << %XJEIFLH|)Xspa8P
**** v1    0.2 CLI TX|vcl 4.1;
**** v1    0.2 CLI TX|backend s1 { .host = "127.0.0.1"; .port = "61839"; }
**** v1    0.2 CLI TX|
**** v1    0.2 CLI TX|
**** v1    0.2 CLI TX|\timport std;
**** v1    0.2 CLI TX|
**** v1    0.2 CLI TX|\tsub vcl_deliver {
**** v1    0.2 CLI TX|\t    set resp.http.foo = std.fileread("/tmp/vtest.64_sun12.4/_vtest_tmp/vtc.43724.0f137915" + req.url);
**** v1    0.2 CLI TX|\t}
**** v1    0.2 CLI TX|
**** v1    0.2 CLI TX|%XJEIFLH|)Xspa8P
***  v1    0.2 CLI RX  106
**** v1    0.2 CLI RX|Message from VCC-compiler:
**** v1    0.2 CLI RX|Security: Privilege proc_setid missing, will not change uid/gid
**** v1    0.2 CLI RX|Could not load VMOD std
**** v1    0.2 CLI RX|\tFile name: /tmp/vtest.64_sun12.4/varnish-cache/varnish-trunk/_build/lib/libvmod_std/.libs/libvmod_std.so
**** v1    0.2 CLI RX|\tdlerror: ld.so.1: varnishd: fatal: relocation error: file /tmp/vtest.64_sun12.4/varnish-cache/varnish-trunk/_build/lib/libvmod_std/.libs/libvmod_std.so: symbol vmod_issyntax: referenced symbol not found
**** v1    0.2 CLI RX|('<vcl.inline>' Line 5 Pos 16)
**** v1    0.2 CLI RX|        import std;
**** v1    0.2 CLI RX|---------------###-
**** v1    0.2 CLI RX|
**** v1    0.2 CLI RX|Running VCC-compiler failed, exited with 2
**** v1    0.2 CLI RX|VCL compilation failed
---- v1    0.2 FAIL VCL does not compile
*    top   0.2 RESETTING after ../../../bin/varnishtest/tests/r01145.vtc
**   s1    0.2 Waiting for server (3/-1)
**   v1    0.2 Wait
**** v1    0.2 CLI TX|panic.clear
***  v1    0.2 CLI RX  300
**** v1    0.2 CLI RX|No panic to clear
***  v1    0.2 debug|Info: manager stopping child
***  v1    0.2 debug|Info: manager dies
**** v1    0.2 STDOUT poll 0x10
**   v1    0.2 R 43774 Status: 0000 (u 0.009000 s 0.029000)
***  v1    0.3 vsl|No VSL chunk found (child not started ?)
*    top   0.3 TEST ../../../bin/varnishtest/tests/r01145.vtc FAILED
#    top  TEST ../../../bin/varnishtest/tests/r01145.vtc FAILED (0.266) exit=2

1 @ SunOS i86pc 5.11 1.04 64_sun12.4 uplex

*    top   0.0 TEST ../../../bin/varnishtest/tests/r01145.vtc starting
[...]
*    top   0.0 TEST Test fileread for std VMOD
[...]
**** v1    0.2 CLI RX|Type 'start' to launch worker process.
**** v1    0.2 CLI TX|vcl.inline vcl1 << %XJEIFLH|)Xspa8P
**** v1    0.2 CLI TX|vcl 4.1;
**** v1    0.2 CLI TX|backend s1 { .host = "127.0.0.1"; .port = "48716"; }
**** v1    0.2 CLI TX|
**** v1    0.2 CLI TX|
**** v1    0.2 CLI TX|\timport std;
**** v1    0.2 CLI TX|
**** v1    0.2 CLI TX|\tsub vcl_deliver {
**** v1    0.2 CLI TX|\t    set resp.http.foo = std.fileread("/tmp/vtest.64_sun12.4/_vtest_tmp/vtc.9323.10fc6180" + req.url);
**** v1    0.2 CLI TX|\t}
**** v1    0.2 CLI TX|
**** v1    0.2 CLI TX|%XJEIFLH|)Xspa8P
***  v1    0.2 CLI RX  106
**** v1    0.2 CLI RX|Message from VCC-compiler:
**** v1    0.2 CLI RX|Security: Privilege proc_setid missing, will not change uid/gid
**** v1    0.2 CLI RX|Could not load VMOD std
**** v1    0.2 CLI RX|\tFile name: /tmp/vtest.64_sun12.4/varnish-cache/varnish-trunk/_build/lib/libvmod_std/.libs/libvmod_std.so
**** v1    0.2 CLI RX|\tdlerror: ld.so.1: varnishd: fatal: relocation error: file /tmp/vtest.64_sun12.4/varnish-cache/varnish-trunk/_build/lib/libvmod_std/.libs/libvmod_std.so: symbol vmod_issyntax: referenced symbol not found
**** v1    0.2 CLI RX|('<vcl.inline>' Line 5 Pos 16)
**** v1    0.2 CLI RX|        import std;
**** v1    0.2 CLI RX|---------------###-
**** v1    0.2 CLI RX|
**** v1    0.2 CLI RX|Running VCC-compiler failed, exited with 2
**** v1    0.2 CLI RX|VCL compilation failed
---- v1    0.2 FAIL VCL does not compile
*    top   0.2 RESETTING after ../../../bin/varnishtest/tests/r01145.vtc
**   s1    0.2 Waiting for server (3/-1)
**   v1    0.2 Wait
**** v1    0.2 CLI TX|panic.clear
***  v1    0.2 CLI RX  300
**** v1    0.2 CLI RX|No panic to clear
***  v1    0.2 debug|Info: manager stopping child
***  v1    0.2 debug|Info: manager dies
***  v1    0.2 debug|
**** v1    0.2 STDOUT poll 0x10
**   v1    0.2 R 9359 Status: 0000 (u 0.009000 s 0.030000)
***  v1    0.3 vsl|No VSL chunk found (child not started ?)
*    top   0.3 TEST ../../../bin/varnishtest/tests/r01145.vtc FAILED
#    top  TEST ../../../bin/varnishtest/tests/r01145.vtc FAILED (0.266) exit=2

1 @ SunOS i86pc 5.11 1.04 64_sun12.4 uplex

*    top   0.0 TEST ../../../bin/varnishtest/tests/r01145.vtc starting
[...]
*    top   0.0 TEST Test fileread for std VMOD
[...]
**** v1    0.2 CLI RX|Type 'quit' to close CLI session.
**** v1    0.2 CLI RX|Type 'start' to launch worker process.
**** v1    0.2 CLI TX|vcl.inline vcl1 << %XJEIFLH|)Xspa8P
**** v1    0.2 CLI TX|vcl 4.1;
**** v1    0.2 CLI TX|backend s1 { .host = "127.0.0.1"; .port = "35687"; }
**** v1    0.2 CLI TX|
**** v1    0.2 CLI TX|
**** v1    0.2 CLI TX|\timport std;
**** v1    0.2 CLI TX|
**** v1    0.2 CLI TX|\tsub vcl_deliver {
**** v1    0.2 CLI TX|\t    set resp.http.foo = std.fileread("/tmp/vtest.64_sun12.4/_vtest_tmp/vtc.31159.415fc869" + req.url);
**** v1    0.2 CLI TX|\t}
**** v1    0.2 CLI TX|
**** v1    0.2 CLI TX|%XJEIFLH|)Xspa8P
***  v1    0.2 CLI RX  106
**** v1    0.2 CLI RX|Message from VCC-compiler:
**** v1    0.2 CLI RX|Security: Privilege proc_setid missing, will not change uid/gid
**** v1    0.2 CLI RX|Could not load VMOD std
**** v1    0.2 CLI RX|\tFile name: /tmp/vtest.64_sun12.4/varnish-cache/varnish-trunk/_build/lib/libvmod_std/.libs/libvmod_std.so
**** v1    0.2 CLI RX|\tdlerror: ld.so.1: varnishd: fatal: relocation error: file /tmp/vtest.64_sun12.4/varnish-cache/varnish-trunk/_build/lib/libvmod_std/.libs/libvmod_std.so: symbol vmod_issyntax: referenced symbol not found
**** v1    0.2 CLI RX|('<vcl.inline>' Line 5 Pos 16)
**** v1    0.2 CLI RX|        import std;
**** v1    0.2 CLI RX|---------------###-
**** v1    0.2 CLI RX|
**** v1    0.2 CLI RX|Running VCC-compiler failed, exited with 2
**** v1    0.2 CLI RX|VCL compilation failed
---- v1    0.2 FAIL VCL does not compile
*    top   0.2 RESETTING after ../../../bin/varnishtest/tests/r01145.vtc
**   s1    0.2 Waiting for server (3/-1)
**   v1    0.2 Wait
**** v1    0.2 CLI TX|panic.clear
***  v1    0.2 CLI RX  300
**** v1    0.2 CLI RX|No panic to clear
***  v1    0.2 debug|Info: manager stopping child
***  v1    0.2 debug|Info: manager dies
**** v1    0.2 STDOUT poll 0x10
**   v1    0.2 R 31197 Status: 0000 (u 0.008000 s 0.028000)
***  v1    0.3 vsl|No VSL chunk found (child not started ?)
*    top   0.3 TEST ../../../bin/varnishtest/tests/r01145.vtc FAILED
#    top  TEST ../../../bin/varnishtest/tests/r01145.vtc FAILED (0.257) exit=2

1 @ SunOS i86pc 5.11 1.04 64_sun12.4 uplex

*    top   0.0 TEST ../../../bin/varnishtest/tests/r01145.vtc starting
[...]
*    top   0.0 TEST Test fileread for std VMOD
[...]
**** v1    0.2 CLI RX|Type 'start' to launch worker process.
**** v1    0.2 CLI TX|vcl.inline vcl1 << %XJEIFLH|)Xspa8P
**** v1    0.2 CLI TX|vcl 4.1;
**** v1    0.2 CLI TX|backend s1 { .host = "127.0.0.1"; .port = "32869"; }
**** v1    0.2 CLI TX|
**** v1    0.2 CLI TX|
**** v1    0.2 CLI TX|\timport std;
**** v1    0.2 CLI TX|
**** v1    0.2 CLI TX|\tsub vcl_deliver {
**** v1    0.2 CLI TX|\t    set resp.http.foo = std.fileread("/tmp/vtest.64_sun12.4/_vtest_tmp/vtc.51697.4bed65fe" + req.url);
**** v1    0.2 CLI TX|\t}
**** v1    0.2 CLI TX|
**** v1    0.2 CLI TX|%XJEIFLH|)Xspa8P
***  v1    0.2 CLI RX  106
**** v1    0.2 CLI RX|Message from VCC-compiler:
**** v1    0.2 CLI RX|Security: Privilege proc_setid missing, will not change uid/gid
**** v1    0.2 CLI RX|Could not load VMOD std
**** v1    0.2 CLI RX|\tFile name: /tmp/vtest.64_sun12.4/varnish-cache/varnish-trunk/_build/lib/libvmod_std/.libs/libvmod_std.so
**** v1    0.2 CLI RX|\tdlerror: ld.so.1: varnishd: fatal: relocation error: file /tmp/vtest.64_sun12.4/varnish-cache/varnish-trunk/_build/lib/libvmod_std/.libs/libvmod_std.so: symbol vmod_issyntax: referenced symbol not found
**** v1    0.2 CLI RX|('<vcl.inline>' Line 5 Pos 16)
**** v1    0.2 CLI RX|        import std;
**** v1    0.2 CLI RX|---------------###-
**** v1    0.2 CLI RX|
**** v1    0.2 CLI RX|Running VCC-compiler failed, exited with 2
**** v1    0.2 CLI RX|VCL compilation failed
---- v1    0.2 FAIL VCL does not compile
*    top   0.2 RESETTING after ../../../bin/varnishtest/tests/r01145.vtc
**   s1    0.2 Waiting for server (3/-1)
**   v1    0.2 Wait
**** v1    0.2 CLI TX|panic.clear
***  v1    0.2 CLI RX  300
**** v1    0.2 CLI RX|No panic to clear
***  v1    0.2 debug|Info: manager stopping child
***  v1    0.2 debug|Info: manager dies
***  v1    0.2 debug|
**** v1    0.2 STDOUT poll 0x10
**   v1    0.2 R 51765 Status: 0000 (u 0.012000 s 0.039000)
***  v1    0.3 vsl|No VSL chunk found (child not started ?)
*    top   0.3 TEST ../../../bin/varnishtest/tests/r01145.vtc FAILED
#    top  TEST ../../../bin/varnishtest/tests/r01145.vtc FAILED (0.278) exit=2

1 @ SunOS i86pc 5.11 1.04 32_sun12.4 uplex

*    top   0.0 TEST ../../../bin/varnishtest/tests/r01145.vtc starting
[...]
*    top   0.0 TEST Test fileread for std VMOD
[...]
**** v1    0.1 CLI RX|Type 'quit' to close CLI session.
**** v1    0.1 CLI RX|Type 'start' to launch worker process.
**** v1    0.1 CLI TX|vcl.inline vcl1 << %XJEIFLH|)Xspa8P
**** v1    0.1 CLI TX|vcl 4.1;
**** v1    0.1 CLI TX|backend s1 { .host = "127.0.0.1"; .port = "45771"; }
**** v1    0.1 CLI TX|
**** v1    0.1 CLI TX|
**** v1    0.1 CLI TX|\timport std;
**** v1    0.1 CLI TX|
**** v1    0.1 CLI TX|\tsub vcl_deliver {
**** v1    0.1 CLI TX|\t    set resp.http.foo = std.fileread("/tmp/vtest.32_sun12.4/_vtest_tmp/vtc.55526.70fb9c57" + req.url);
**** v1    0.1 CLI TX|\t}
**** v1    0.1 CLI TX|
**** v1    0.1 CLI TX|%XJEIFLH|)Xspa8P
***  v1    0.2 CLI RX  106
**** v1    0.2 CLI RX|Message from VCC-compiler:
**** v1    0.2 CLI RX|Security: Privilege proc_setid missing, will not change uid/gid
**** v1    0.2 CLI RX|Could not load VMOD std
**** v1    0.2 CLI RX|\tFile name: /tmp/vtest.32_sun12.4/varnish-cache/varnish-trunk/_build/lib/libvmod_std/.libs/libvmod_std.so
**** v1    0.2 CLI RX|\tdlerror: ld.so.1: varnishd: fatal: relocation error: file /tmp/vtest.32_sun12.4/varnish-cache/varnish-trunk/_build/lib/libvmod_std/.libs/libvmod_std.so: symbol vmod_issyntax: referenced symbol not found
**** v1    0.2 CLI RX|('<vcl.inline>' Line 5 Pos 16)
**** v1    0.2 CLI RX|        import std;
**** v1    0.2 CLI RX|---------------###-
**** v1    0.2 CLI RX|
**** v1    0.2 CLI RX|Running VCC-compiler failed, exited with 2
**** v1    0.2 CLI RX|VCL compilation failed
---- v1    0.2 FAIL VCL does not compile
*    top   0.2 RESETTING after ../../../bin/varnishtest/tests/r01145.vtc
**   s1    0.2 Waiting for server (3/-1)
**   v1    0.2 Wait
**** v1    0.2 CLI TX|panic.clear
***  v1    0.2 CLI RX  300
**** v1    0.2 CLI RX|No panic to clear
***  v1    0.2 debug|Info: manager stopping child
***  v1    0.2 debug|Info: manager dies
**** v1    0.2 STDOUT poll 0x10
**   v1    0.2 R 55546 Status: 0000 (u 0.009000 s 0.026000)
***  v1    0.2 vsl|No VSL chunk found (child not started ?)
*    top   0.2 TEST ../../../bin/varnishtest/tests/r01145.vtc FAILED
#    top  TEST ../../../bin/varnishtest/tests/r01145.vtc FAILED (0.251) exit=2

1 @ SunOS i86pc 5.11 1.04 32_sun12.4 uplex

*    top   0.0 TEST ../../../bin/varnishtest/tests/r01145.vtc starting
[...]
*    top   0.0 TEST Test fileread for std VMOD
[...]
**** v1    0.2 CLI RX|Type 'quit' to close CLI session.
**** v1    0.2 CLI RX|Type 'start' to launch worker process.
**** v1    0.2 CLI TX|vcl.inline vcl1 << %XJEIFLH|)Xspa8P
**** v1    0.2 CLI TX|vcl 4.1;
**** v1    0.2 CLI TX|backend s1 { .host = "127.0.0.1"; .port = "64810"; }
**** v1    0.2 CLI TX|
**** v1    0.2 CLI TX|
**** v1    0.2 CLI TX|\timport std;
**** v1    0.2 CLI TX|
**** v1    0.2 CLI TX|\tsub vcl_deliver {
**** v1    0.2 CLI TX|\t    set resp.http.foo = std.fileread("/tmp/vtest.32_sun12.4/_vtest_tmp/vtc.46180.459c15f6" + req.url);
**** v1    0.2 CLI TX|\t}
**** v1    0.2 CLI TX|
**** v1    0.2 CLI TX|%XJEIFLH|)Xspa8P
***  v1    0.2 CLI RX  106
**** v1    0.2 CLI RX|Message from VCC-compiler:
**** v1    0.2 CLI RX|Security: Privilege proc_setid missing, will not change uid/gid
**** v1    0.2 CLI RX|Could not load VMOD std
**** v1    0.2 CLI RX|\tFile name: /tmp/vtest.32_sun12.4/varnish-cache/varnish-trunk/_build/lib/libvmod_std/.libs/libvmod_std.so
**** v1    0.2 CLI RX|\tdlerror: ld.so.1: varnishd: fatal: relocation error: file /tmp/vtest.32_sun12.4/varnish-cache/varnish-trunk/_build/lib/libvmod_std/.libs/libvmod_std.so: symbol vmod_issyntax: referenced symbol not found
**** v1    0.2 CLI RX|('<vcl.inline>' Line 5 Pos 16)
**** v1    0.2 CLI RX|        import std;
**** v1    0.2 CLI RX|---------------###-
**** v1    0.2 CLI RX|
**** v1    0.2 CLI RX|Running VCC-compiler failed, exited with 2
**** v1    0.2 CLI RX|VCL compilation failed
---- v1    0.2 FAIL VCL does not compile
*    top   0.2 RESETTING after ../../../bin/varnishtest/tests/r01145.vtc
**   s1    0.2 Waiting for server (3/-1)
**   v1    0.2 Wait
**** v1    0.2 CLI TX|panic.clear
***  v1    0.2 CLI RX  300
**** v1    0.2 CLI RX|No panic to clear
***  v1    0.2 debug|Info: manager stopping child
***  v1    0.2 debug|Info: manager dies
**** v1    0.2 STDOUT poll 0x10
**   v1    0.2 R 46203 Status: 0000 (u 0.009000 s 0.027000)
***  v1    0.3 vsl|No VSL chunk found (child not started ?)
*    top   0.3 TEST ../../../bin/varnishtest/tests/r01145.vtc FAILED
#    top  TEST ../../../bin/varnishtest/tests/r01145.vtc FAILED (0.255) exit=2

1 @ SunOS i86pc 5.11 1.04 32_sun12.4 uplex

*    top   0.0 TEST ../../../bin/varnishtest/tests/r01145.vtc starting
[...]
*    top   0.0 TEST Test fileread for std VMOD
[...]
**** v1    0.2 CLI RX|Type 'quit' to close CLI session.
**** v1    0.2 CLI RX|Type 'start' to launch worker process.
**** v1    0.2 CLI TX|vcl.inline vcl1 << %XJEIFLH|)Xspa8P
**** v1    0.2 CLI TX|vcl 4.1;
**** v1    0.2 CLI TX|backend s1 { .host = "127.0.0.1"; .port = "35241"; }
**** v1    0.2 CLI TX|
**** v1    0.2 CLI TX|
**** v1    0.2 CLI TX|\timport std;
**** v1    0.2 CLI TX|
**** v1    0.2 CLI TX|\tsub vcl_deliver {
**** v1    0.2 CLI TX|\t    set resp.http.foo = std.fileread("/tmp/vtest.32_sun12.4/_vtest_tmp/vtc.12548.06b13fa8" + req.url);
**** v1    0.2 CLI TX|\t}
**** v1    0.2 CLI TX|
**** v1    0.2 CLI TX|%XJEIFLH|)Xspa8P
***  v1    0.2 CLI RX  106
**** v1    0.2 CLI RX|Message from VCC-compiler:
**** v1    0.2 CLI RX|Security: Privilege proc_setid missing, will not change uid/gid
**** v1    0.2 CLI RX|Could not load VMOD std
**** v1    0.2 CLI RX|\tFile name: /tmp/vtest.32_sun12.4/varnish-cache/varnish-trunk/_build/lib/libvmod_std/.libs/libvmod_std.so
**** v1    0.2 CLI RX|\tdlerror: ld.so.1: varnishd: fatal: relocation error: file /tmp/vtest.32_sun12.4/varnish-cache/varnish-trunk/_build/lib/libvmod_std/.libs/libvmod_std.so: symbol vmod_issyntax: referenced symbol not found
**** v1    0.2 CLI RX|('<vcl.inline>' Line 5 Pos 16)
**** v1    0.2 CLI RX|        import std;
**** v1    0.2 CLI RX|---------------###-
**** v1    0.2 CLI RX|
**** v1    0.2 CLI RX|Running VCC-compiler failed, exited with 2
**** v1    0.2 CLI RX|VCL compilation failed
---- v1    0.2 FAIL VCL does not compile
*    top   0.2 RESETTING after ../../../bin/varnishtest/tests/r01145.vtc
**   s1    0.2 Waiting for server (3/-1)
**   v1    0.2 Wait
**** v1    0.2 CLI TX|panic.clear
***  v1    0.2 CLI RX  300
**** v1    0.2 CLI RX|No panic to clear
***  v1    0.2 debug|Info: manager stopping child
***  v1    0.2 debug|Info: manager dies
**** v1    0.2 STDOUT poll 0x10
**   v1    0.2 R 12624 Status: 0000 (u 0.014000 s 0.045000)
***  v1    0.3 vsl|No VSL chunk found (child not started ?)
*    top   0.3 TEST ../../../bin/varnishtest/tests/r01145.vtc FAILED
#    top  TEST ../../../bin/varnishtest/tests/r01145.vtc FAILED (0.286) exit=2