r01212

8bbbdfa

1 @ Linux 3.10.0 x86_64 1.02 mblissett

*    top   0.0 TEST ../../../bin/varnishtest/tests/r01212.vtc starting
[...]
*    top   0.0 TEST #1212 - Vmod with HEADER argument given a STRING asserts the VCL compiler
[...]
**** v1    0.1 CLI TX|\timport std;
**** v1    0.1 CLI TX|\tbackend b { .host = "127.0.0.1"; }
**** v1    0.1 CLI TX|\tsub vcl_recv {
**** v1    0.1 CLI TX|\t\tstd.collect("foo");
**** v1    0.1 CLI TX|\t}
**** v1    0.1 CLI TX|
**** v1    0.1 CLI TX|%XJEIFLH|)Xspa8P
***  v1    0.1 CLI RX  106
**** v1    0.1 CLI RX|Message from VCC-compiler:
**** v1    0.1 CLI RX|Wrong argument type.  Expected HEADER.  Got STRING.
**** v1    0.1 CLI RX|('<vcl.inline>' Line 6 Pos 29) -- ('<vcl.inline>' Line 6 Pos 33)
**** v1    0.1 CLI RX|                std.collect("foo");
**** v1    0.1 CLI RX|----------------------------#####--
**** v1    0.1 CLI RX|
**** v1    0.1 CLI RX|('<vcl.inline>' Line 6 Pos 17) -- ('<vcl.inline>' Line 6 Pos 33)
**** v1    0.1 CLI RX|                std.collect("foo");
**** v1    0.1 CLI RX|----------------#################--
**** v1    0.1 CLI RX|
**** v1    0.1 CLI RX|Running VCC-compiler failed, exited with 2
**** v1    0.1 CLI RX|VCL compilation failed
**   v1    0.1 VCL compilation failed (as expected)
***  v1    0.1 Found expected string: ("Wrong argument type.  Expected HEADER.  Got STRING.")
*    top   0.1 RESETTING after ../../../bin/varnishtest/tests/r01212.vtc
**   v1    0.1 Wait
**** v1    0.1 CLI TX|backend.list
***  v1    0.2 CLI RX  101
**** v1    0.2 CLI RX|Unknown request in manager process (child not running).
**** v1    0.2 CLI RX|Type 'help' for more info.
**   v1    0.2 Stop
**** v1    0.2 CLI TX|stop
***  v1    0.2 CLI RX  300
**** v1    0.2 CLI RX|Child in state stopped
**** v1    0.2 CLI TX|status
***  v1    0.2 CLI RX  200
**** v1    0.2 CLI RX|Child in state stopped
**** v1    0.2 STDOUT poll 0x10
**   v1    0.2 R 15064 Status: 0000 (u 0.004625 s 0.013635)
*    diag  0.0 ............................................................
#    top  TEST ../../../bin/varnishtest/tests/r01212.vtc TIMED OUT (kill -9)
#    top  TEST ../../../bin/varnishtest/tests/r01212.vtc FAILED (60.001) signal=9

1 @ Linux 3.10.0 x86_64 1.02 mblissett

*    top   0.0 TEST ../../../bin/varnishtest/tests/r01212.vtc starting
[...]
*    top   0.0 TEST #1212 - Vmod with HEADER argument given a STRING asserts the VCL compiler
[...]
**** v1    0.1 CLI TX|\timport std;
**** v1    0.1 CLI TX|\tbackend b { .host = "127.0.0.1"; }
**** v1    0.1 CLI TX|\tsub vcl_recv {
**** v1    0.1 CLI TX|\t\tstd.collect("foo");
**** v1    0.1 CLI TX|\t}
**** v1    0.1 CLI TX|
**** v1    0.1 CLI TX|%XJEIFLH|)Xspa8P
***  v1    0.1 CLI RX  106
**** v1    0.1 CLI RX|Message from VCC-compiler:
**** v1    0.1 CLI RX|Wrong argument type.  Expected HEADER.  Got STRING.
**** v1    0.1 CLI RX|('<vcl.inline>' Line 6 Pos 29) -- ('<vcl.inline>' Line 6 Pos 33)
**** v1    0.1 CLI RX|                std.collect("foo");
**** v1    0.1 CLI RX|----------------------------#####--
**** v1    0.1 CLI RX|
**** v1    0.1 CLI RX|('<vcl.inline>' Line 6 Pos 17) -- ('<vcl.inline>' Line 6 Pos 33)
**** v1    0.1 CLI RX|                std.collect("foo");
**** v1    0.1 CLI RX|----------------#################--
**** v1    0.1 CLI RX|
**** v1    0.1 CLI RX|Running VCC-compiler failed, exited with 2
**** v1    0.1 CLI RX|VCL compilation failed
**   v1    0.1 VCL compilation failed (as expected)
***  v1    0.1 Found expected string: ("Wrong argument type.  Expected HEADER.  Got STRING.")
*    top   0.1 RESETTING after ../../../bin/varnishtest/tests/r01212.vtc
**   v1    0.1 Wait
**** v1    0.1 CLI TX|backend.list
***  v1    0.2 CLI RX  101
**** v1    0.2 CLI RX|Unknown request in manager process (child not running).
**** v1    0.2 CLI RX|Type 'help' for more info.
**   v1    0.2 Stop
**** v1    0.2 CLI TX|stop
***  v1    0.2 CLI RX  300
**** v1    0.2 CLI RX|Child in state stopped
**** v1    0.2 CLI TX|status
***  v1    0.2 CLI RX  200
**** v1    0.2 CLI RX|Child in state stopped
**** v1    0.2 STDOUT poll 0x10
**   v1    0.2 R 8549 Status: 0000 (u 0.002008 s 0.018252)
*    diag  0.0 ............................................................
#    top  TEST ../../../bin/varnishtest/tests/r01212.vtc TIMED OUT (kill -9)
#    top  TEST ../../../bin/varnishtest/tests/r01212.vtc FAILED (60.001) signal=9

1 @ SunOS 5.11 i86pc 1.04 32_sun12.4 uplex

*    top   0.0 TEST ../../../bin/varnishtest/tests/r01212.vtc starting
[...]
*    top   0.0 TEST #1212 - Vmod with HEADER argument given a STRING asserts the VCL compiler
[...]
**** v1    0.1 CLI TX|\tbackend b { .host = "127.0.0.1"; }
**** v1    0.1 CLI TX|\tsub vcl_recv {
**** v1    0.1 CLI TX|\t\tstd.collect("foo");
**** v1    0.1 CLI TX|\t}
**** v1    0.1 CLI TX|
**** v1    0.1 CLI TX|%XJEIFLH|)Xspa8P
***  v1    0.1 CLI RX  106
**** v1    0.1 CLI RX|Message from VCC-compiler:
**** v1    0.1 CLI RX|Security: Privilege proc_setid missing, will not change uid/gid
**** v1    0.1 CLI RX|Wrong argument type.  Expected HEADER.  Got STRING.
**** v1    0.1 CLI RX|('<vcl.inline>' Line 6 Pos 29) -- ('<vcl.inline>' Line 6 Pos 33)
**** v1    0.1 CLI RX|                std.collect("foo");
**** v1    0.1 CLI RX|----------------------------#####--
**** v1    0.1 CLI RX|
**** v1    0.1 CLI RX|('<vcl.inline>' Line 6 Pos 17) -- ('<vcl.inline>' Line 6 Pos 33)
**** v1    0.1 CLI RX|                std.collect("foo");
**** v1    0.1 CLI RX|----------------#################--
**** v1    0.1 CLI RX|
**** v1    0.1 CLI RX|Running VCC-compiler failed, exited with 2
**** v1    0.1 CLI RX|VCL compilation failed
**   v1    0.1 VCL compilation failed (as expected)
***  v1    0.1 Found expected string: ("Wrong argument type.  Expected HEADER.  Got STRING.")
*    top   0.1 RESETTING after ../../../bin/varnishtest/tests/r01212.vtc
**   v1    0.1 Wait
**** v1    0.1 CLI TX|backend.list
***  v1    0.1 CLI RX  101
**** v1    0.1 CLI RX|Unknown request in manager process (child not running).
**** v1    0.1 CLI RX|Type 'help' for more info.
**   v1    0.1 Stop
**** v1    0.1 CLI TX|stop
***  v1    0.1 CLI RX  300
**** v1    0.1 CLI RX|Child in state stopped
**** v1    0.1 CLI TX|status
***  v1    0.1 CLI RX  200
**** v1    0.1 CLI RX|Child in state stopped
**** v1    0.1 STDOUT poll 0x10
**   v1    0.1 R 7405 Status: 0000 (u 0.005000 s 0.016000)
*    diag  0.0 ............................................................
#    top  TEST ../../../bin/varnishtest/tests/r01212.vtc TIMED OUT (kill -9)
#    top  TEST ../../../bin/varnishtest/tests/r01212.vtc FAILED (60.002) signal=9

1 @ Ubuntu LTS i686 1.04 fgs

*    top   0.0 TEST ../../../bin/varnishtest/tests/r01212.vtc starting
[...]
*    top   0.0 TEST #1212 - Vmod with HEADER argument given a STRING asserts the VCL compiler
[...]
**** v1    0.1 CLI TX|\timport std;
**** v1    0.1 CLI TX|\tbackend b { .host = "127.0.0.1"; }
**** v1    0.1 CLI TX|\tsub vcl_recv {
**** v1    0.1 CLI TX|\t\tstd.collect("foo");
**** v1    0.1 CLI TX|\t}
**** v1    0.1 CLI TX|
**** v1    0.1 CLI TX|%XJEIFLH|)Xspa8P
***  v1    0.1 CLI RX  106
**** v1    0.1 CLI RX|Message from VCC-compiler:
**** v1    0.1 CLI RX|Wrong argument type.  Expected HEADER.  Got STRING.
**** v1    0.1 CLI RX|('<vcl.inline>' Line 6 Pos 29) -- ('<vcl.inline>' Line 6 Pos 33)
**** v1    0.1 CLI RX|                std.collect("foo");
**** v1    0.1 CLI RX|----------------------------#####--
**** v1    0.1 CLI RX|
**** v1    0.1 CLI RX|('<vcl.inline>' Line 6 Pos 17) -- ('<vcl.inline>' Line 6 Pos 33)
**** v1    0.1 CLI RX|                std.collect("foo");
**** v1    0.1 CLI RX|----------------#################--
**** v1    0.1 CLI RX|
**** v1    0.1 CLI RX|Running VCC-compiler failed, exited with 2
**** v1    0.1 CLI RX|VCL compilation failed
**   v1    0.1 VCL compilation failed (as expected)
***  v1    0.1 Found expected string: ("Wrong argument type.  Expected HEADER.  Got STRING.")
*    top   0.1 RESETTING after ../../../bin/varnishtest/tests/r01212.vtc
**   v1    0.1 Wait
**** v1    0.1 CLI TX|backend.list
***  v1    0.2 CLI RX  101
**** v1    0.2 CLI RX|Unknown request in manager process (child not running).
**** v1    0.2 CLI RX|Type 'help' for more info.
**   v1    0.2 Stop
**** v1    0.2 CLI TX|stop
***  v1    0.2 CLI RX  300
**** v1    0.2 CLI RX|Child in state stopped
**** v1    0.2 CLI TX|status
***  v1    0.2 CLI RX  200
**** v1    0.2 CLI RX|Child in state stopped
**** v1    0.2 STDOUT poll 0x10
**   v1    0.2 R 17222 Status: 0000 (u 0.008000 s 0.004000)
*    diag  0.0 ............................................................
#    top  TEST ../../../bin/varnishtest/tests/r01212.vtc TIMED OUT (kill -9)
#    top  TEST ../../../bin/varnishtest/tests/r01212.vtc FAILED (60.001) signal=9

1 @ Ubuntu LTS i686 1.04 fgs

*    top   0.0 TEST ../../../bin/varnishtest/tests/r01212.vtc starting
[...]
*    top   0.0 TEST #1212 - Vmod with HEADER argument given a STRING asserts the VCL compiler
[...]
**** v1    0.1 CLI TX|\timport std;
**** v1    0.1 CLI TX|\tbackend b { .host = "127.0.0.1"; }
**** v1    0.1 CLI TX|\tsub vcl_recv {
**** v1    0.1 CLI TX|\t\tstd.collect("foo");
**** v1    0.1 CLI TX|\t}
**** v1    0.1 CLI TX|
**** v1    0.1 CLI TX|%XJEIFLH|)Xspa8P
***  v1    0.1 CLI RX  106
**** v1    0.1 CLI RX|Message from VCC-compiler:
**** v1    0.1 CLI RX|Wrong argument type.  Expected HEADER.  Got STRING.
**** v1    0.1 CLI RX|('<vcl.inline>' Line 6 Pos 29) -- ('<vcl.inline>' Line 6 Pos 33)
**** v1    0.1 CLI RX|                std.collect("foo");
**** v1    0.1 CLI RX|----------------------------#####--
**** v1    0.1 CLI RX|
**** v1    0.1 CLI RX|('<vcl.inline>' Line 6 Pos 17) -- ('<vcl.inline>' Line 6 Pos 33)
**** v1    0.1 CLI RX|                std.collect("foo");
**** v1    0.1 CLI RX|----------------#################--
**** v1    0.1 CLI RX|
**** v1    0.1 CLI RX|Running VCC-compiler failed, exited with 2
**** v1    0.1 CLI RX|VCL compilation failed
**   v1    0.1 VCL compilation failed (as expected)
***  v1    0.1 Found expected string: ("Wrong argument type.  Expected HEADER.  Got STRING.")
*    top   0.1 RESETTING after ../../../bin/varnishtest/tests/r01212.vtc
**   v1    0.1 Wait
**** v1    0.1 CLI TX|backend.list
***  v1    0.1 CLI RX  101
**** v1    0.1 CLI RX|Unknown request in manager process (child not running).
**** v1    0.1 CLI RX|Type 'help' for more info.
**   v1    0.1 Stop
**** v1    0.1 CLI TX|stop
***  v1    0.2 CLI RX  300
**** v1    0.2 CLI RX|Child in state stopped
**** v1    0.2 CLI TX|status
***  v1    0.2 CLI RX  200
**** v1    0.2 CLI RX|Child in state stopped
**** v1    0.2 STDOUT poll 0x10
**   v1    0.2 R 6080 Status: 0000 (u 0.000000 s 0.004000)
*    diag  0.0 ............................................................
#    top  TEST ../../../bin/varnishtest/tests/r01212.vtc TIMED OUT (kill -9)
#    top  TEST ../../../bin/varnishtest/tests/r01212.vtc FAILED (60.001) signal=9

1 @ SunOS 5.11 i86pc 1.04 32_sun12.4 uplex

*    top   0.0 TEST ../../../bin/varnishtest/tests/r01212.vtc starting
[...]
*    top   0.0 TEST #1212 - Vmod with HEADER argument given a STRING asserts the VCL compiler
[...]
**** v1    0.1 CLI TX|\tbackend b { .host = "127.0.0.1"; }
**** v1    0.1 CLI TX|\tsub vcl_recv {
**** v1    0.1 CLI TX|\t\tstd.collect("foo");
**** v1    0.1 CLI TX|\t}
**** v1    0.1 CLI TX|
**** v1    0.1 CLI TX|%XJEIFLH|)Xspa8P
***  v1    0.1 CLI RX  106
**** v1    0.1 CLI RX|Message from VCC-compiler:
**** v1    0.1 CLI RX|Security: Privilege proc_setid missing, will not change uid/gid
**** v1    0.1 CLI RX|Wrong argument type.  Expected HEADER.  Got STRING.
**** v1    0.1 CLI RX|('<vcl.inline>' Line 6 Pos 29) -- ('<vcl.inline>' Line 6 Pos 33)
**** v1    0.1 CLI RX|                std.collect("foo");
**** v1    0.1 CLI RX|----------------------------#####--
**** v1    0.1 CLI RX|
**** v1    0.1 CLI RX|('<vcl.inline>' Line 6 Pos 17) -- ('<vcl.inline>' Line 6 Pos 33)
**** v1    0.1 CLI RX|                std.collect("foo");
**** v1    0.1 CLI RX|----------------#################--
**** v1    0.1 CLI RX|
**** v1    0.1 CLI RX|Running VCC-compiler failed, exited with 2
**** v1    0.1 CLI RX|VCL compilation failed
**   v1    0.1 VCL compilation failed (as expected)
***  v1    0.1 Found expected string: ("Wrong argument type.  Expected HEADER.  Got STRING.")
*    top   0.1 RESETTING after ../../../bin/varnishtest/tests/r01212.vtc
**   v1    0.1 Wait
**** v1    0.1 CLI TX|backend.list
***  v1    0.1 CLI RX  101
**** v1    0.1 CLI RX|Unknown request in manager process (child not running).
**** v1    0.1 CLI RX|Type 'help' for more info.
**   v1    0.1 Stop
**** v1    0.1 CLI TX|stop
***  v1    0.1 CLI RX  300
**** v1    0.1 CLI RX|Child in state stopped
**** v1    0.1 CLI TX|status
***  v1    0.1 CLI RX  200
**** v1    0.1 CLI RX|Child in state stopped
**** v1    0.1 STDOUT poll 0x10
**   v1    0.1 R 2289 Status: 0000 (u 0.005000 s 0.021000)
*    diag  0.0 ............................................................
#    top  TEST ../../../bin/varnishtest/tests/r01212.vtc TIMED OUT (kill -9)
#    top  TEST ../../../bin/varnishtest/tests/r01212.vtc FAILED (60.002) signal=9

1 @ Linux 3.10.0 x86_64 1.02 mblissett

*    top   0.0 TEST ../../../bin/varnishtest/tests/r01212.vtc starting
[...]
*    top   0.0 TEST #1212 - Vmod with HEADER argument given a STRING asserts the VCL compiler
[...]
**** v1    0.1 CLI TX|\timport std;
**** v1    0.1 CLI TX|\tbackend b { .host = "127.0.0.1"; }
**** v1    0.1 CLI TX|\tsub vcl_recv {
**** v1    0.1 CLI TX|\t\tstd.collect("foo");
**** v1    0.1 CLI TX|\t}
**** v1    0.1 CLI TX|
**** v1    0.1 CLI TX|%XJEIFLH|)Xspa8P
***  v1    0.1 CLI RX  106
**** v1    0.1 CLI RX|Message from VCC-compiler:
**** v1    0.1 CLI RX|Wrong argument type.  Expected HEADER.  Got STRING.
**** v1    0.1 CLI RX|('<vcl.inline>' Line 6 Pos 29) -- ('<vcl.inline>' Line 6 Pos 33)
**** v1    0.1 CLI RX|                std.collect("foo");
**** v1    0.1 CLI RX|----------------------------#####--
**** v1    0.1 CLI RX|
**** v1    0.1 CLI RX|('<vcl.inline>' Line 6 Pos 17) -- ('<vcl.inline>' Line 6 Pos 33)
**** v1    0.1 CLI RX|                std.collect("foo");
**** v1    0.1 CLI RX|----------------#################--
**** v1    0.1 CLI RX|
**** v1    0.1 CLI RX|Running VCC-compiler failed, exited with 2
**** v1    0.1 CLI RX|VCL compilation failed
**   v1    0.1 VCL compilation failed (as expected)
***  v1    0.1 Found expected string: ("Wrong argument type.  Expected HEADER.  Got STRING.")
*    top   0.1 RESETTING after ../../../bin/varnishtest/tests/r01212.vtc
**   v1    0.1 Wait
**** v1    0.1 CLI TX|backend.list
***  v1    0.2 CLI RX  101
**** v1    0.2 CLI RX|Unknown request in manager process (child not running).
**** v1    0.2 CLI RX|Type 'help' for more info.
**   v1    0.2 Stop
**** v1    0.2 CLI TX|stop
***  v1    0.2 CLI RX  300
**** v1    0.2 CLI RX|Child in state stopped
**** v1    0.2 CLI TX|status
***  v1    0.2 CLI RX  200
**** v1    0.2 CLI RX|Child in state stopped
**** v1    0.2 STDOUT poll 0x10
**   v1    0.2 R 2253 Status: 0000 (u 0.004957 s 0.018974)
*    diag  0.0 ............................................................
#    top  TEST ../../../bin/varnishtest/tests/r01212.vtc TIMED OUT (kill -9)
#    top  TEST ../../../bin/varnishtest/tests/r01212.vtc FAILED (60.002) signal=9

1 @ SunOS 5.11 i86pc 1.04 32_sun12.4 uplex

*    top   0.0 TEST ../../../bin/varnishtest/tests/r01212.vtc starting
[...]
*    top   0.0 TEST #1212 - Vmod with HEADER argument given a STRING asserts the VCL compiler
[...]
**** v1    0.1 CLI TX|\tbackend b { .host = "127.0.0.1"; }
**** v1    0.1 CLI TX|\tsub vcl_recv {
**** v1    0.1 CLI TX|\t\tstd.collect("foo");
**** v1    0.1 CLI TX|\t}
**** v1    0.1 CLI TX|
**** v1    0.1 CLI TX|%XJEIFLH|)Xspa8P
***  v1    0.1 CLI RX  106
**** v1    0.1 CLI RX|Message from VCC-compiler:
**** v1    0.1 CLI RX|Security: Privilege proc_setid missing, will not change uid/gid
**** v1    0.1 CLI RX|Wrong argument type.  Expected HEADER.  Got STRING.
**** v1    0.1 CLI RX|('<vcl.inline>' Line 6 Pos 29) -- ('<vcl.inline>' Line 6 Pos 33)
**** v1    0.1 CLI RX|                std.collect("foo");
**** v1    0.1 CLI RX|----------------------------#####--
**** v1    0.1 CLI RX|
**** v1    0.1 CLI RX|('<vcl.inline>' Line 6 Pos 17) -- ('<vcl.inline>' Line 6 Pos 33)
**** v1    0.1 CLI RX|                std.collect("foo");
**** v1    0.1 CLI RX|----------------#################--
**** v1    0.1 CLI RX|
**** v1    0.1 CLI RX|Running VCC-compiler failed, exited with 2
**** v1    0.1 CLI RX|VCL compilation failed
**   v1    0.1 VCL compilation failed (as expected)
***  v1    0.1 Found expected string: ("Wrong argument type.  Expected HEADER.  Got STRING.")
*    top   0.1 RESETTING after ../../../bin/varnishtest/tests/r01212.vtc
**   v1    0.1 Wait
**** v1    0.1 CLI TX|backend.list
***  v1    0.1 CLI RX  101
**** v1    0.1 CLI RX|Unknown request in manager process (child not running).
**** v1    0.1 CLI RX|Type 'help' for more info.
**   v1    0.1 Stop
**** v1    0.1 CLI TX|stop
***  v1    0.1 CLI RX  300
**** v1    0.1 CLI RX|Child in state stopped
**** v1    0.1 CLI TX|status
***  v1    0.1 CLI RX  200
**** v1    0.1 CLI RX|Child in state stopped
**** v1    0.1 STDOUT poll 0x10
**   v1    0.1 R 4629 Status: 0000 (u 0.005000 s 0.018000)
*    diag  0.0 ............................................................
#    top  TEST ../../../bin/varnishtest/tests/r01212.vtc TIMED OUT (kill -9)
#    top  TEST ../../../bin/varnishtest/tests/r01212.vtc FAILED (60.002) signal=9

1 @ SunOS 5.11 i86pc 1.04 32_sun12.4 uplex

*    top   0.0 TEST ../../../bin/varnishtest/tests/r01212.vtc starting
[...]
*    top   0.0 TEST #1212 - Vmod with HEADER argument given a STRING asserts the VCL compiler
[...]
**** v1    0.1 CLI TX|\tbackend b { .host = "127.0.0.1"; }
**** v1    0.1 CLI TX|\tsub vcl_recv {
**** v1    0.1 CLI TX|\t\tstd.collect("foo");
**** v1    0.1 CLI TX|\t}
**** v1    0.1 CLI TX|
**** v1    0.1 CLI TX|%XJEIFLH|)Xspa8P
***  v1    0.1 CLI RX  106
**** v1    0.1 CLI RX|Message from VCC-compiler:
**** v1    0.1 CLI RX|Security: Privilege proc_setid missing, will not change uid/gid
**** v1    0.1 CLI RX|Wrong argument type.  Expected HEADER.  Got STRING.
**** v1    0.1 CLI RX|('<vcl.inline>' Line 6 Pos 29) -- ('<vcl.inline>' Line 6 Pos 33)
**** v1    0.1 CLI RX|                std.collect("foo");
**** v1    0.1 CLI RX|----------------------------#####--
**** v1    0.1 CLI RX|
**** v1    0.1 CLI RX|('<vcl.inline>' Line 6 Pos 17) -- ('<vcl.inline>' Line 6 Pos 33)
**** v1    0.1 CLI RX|                std.collect("foo");
**** v1    0.1 CLI RX|----------------#################--
**** v1    0.1 CLI RX|
**** v1    0.1 CLI RX|Running VCC-compiler failed, exited with 2
**** v1    0.1 CLI RX|VCL compilation failed
**   v1    0.1 VCL compilation failed (as expected)
***  v1    0.1 Found expected string: ("Wrong argument type.  Expected HEADER.  Got STRING.")
*    top   0.1 RESETTING after ../../../bin/varnishtest/tests/r01212.vtc
**   v1    0.1 Wait
**** v1    0.1 CLI TX|backend.list
***  v1    0.1 CLI RX  101
**** v1    0.1 CLI RX|Unknown request in manager process (child not running).
**** v1    0.1 CLI RX|Type 'help' for more info.
**   v1    0.1 Stop
**** v1    0.1 CLI TX|stop
***  v1    0.1 CLI RX  300
**** v1    0.1 CLI RX|Child in state stopped
**** v1    0.1 CLI TX|status
***  v1    0.1 CLI RX  200
**** v1    0.1 CLI RX|Child in state stopped
**** v1    0.1 STDOUT poll 0x10
**   v1    0.1 R 57926 Status: 0000 (u 0.005000 s 0.018000)
*    diag  0.0 ............................................................
#    top  TEST ../../../bin/varnishtest/tests/r01212.vtc TIMED OUT (kill -9)
#    top  TEST ../../../bin/varnishtest/tests/r01212.vtc FAILED (60.002) signal=9

1 @ Linux 3.10.0 x86_64 1.02 mblissett

*    top   0.0 TEST ../../../bin/varnishtest/tests/r01212.vtc starting
[...]
*    top   0.0 TEST #1212 - Vmod with HEADER argument given a STRING asserts the VCL compiler
[...]
**** v1    0.1 CLI TX|\timport std;
**** v1    0.1 CLI TX|\tbackend b { .host = "127.0.0.1"; }
**** v1    0.1 CLI TX|\tsub vcl_recv {
**** v1    0.1 CLI TX|\t\tstd.collect("foo");
**** v1    0.1 CLI TX|\t}
**** v1    0.1 CLI TX|
**** v1    0.1 CLI TX|%XJEIFLH|)Xspa8P
***  v1    0.1 CLI RX  106
**** v1    0.1 CLI RX|Message from VCC-compiler:
**** v1    0.1 CLI RX|Wrong argument type.  Expected HEADER.  Got STRING.
**** v1    0.1 CLI RX|('<vcl.inline>' Line 6 Pos 29) -- ('<vcl.inline>' Line 6 Pos 33)
**** v1    0.1 CLI RX|                std.collect("foo");
**** v1    0.1 CLI RX|----------------------------#####--
**** v1    0.1 CLI RX|
**** v1    0.1 CLI RX|('<vcl.inline>' Line 6 Pos 17) -- ('<vcl.inline>' Line 6 Pos 33)
**** v1    0.1 CLI RX|                std.collect("foo");
**** v1    0.1 CLI RX|----------------#################--
**** v1    0.1 CLI RX|
**** v1    0.1 CLI RX|Running VCC-compiler failed, exited with 2
**** v1    0.1 CLI RX|VCL compilation failed
**   v1    0.1 VCL compilation failed (as expected)
***  v1    0.1 Found expected string: ("Wrong argument type.  Expected HEADER.  Got STRING.")
*    top   0.1 RESETTING after ../../../bin/varnishtest/tests/r01212.vtc
**   v1    0.1 Wait
**** v1    0.1 CLI TX|backend.list
***  v1    0.2 CLI RX  101
**** v1    0.2 CLI RX|Unknown request in manager process (child not running).
**** v1    0.2 CLI RX|Type 'help' for more info.
**   v1    0.2 Stop
**** v1    0.2 CLI TX|stop
***  v1    0.2 CLI RX  300
**** v1    0.2 CLI RX|Child in state stopped
**** v1    0.2 CLI TX|status
***  v1    0.2 CLI RX  200
**** v1    0.2 CLI RX|Child in state stopped
**** v1    0.2 STDOUT poll 0x10
**   v1    0.2 R 11924 Status: 0000 (u 0.002148 s 0.016804)
*    diag  0.0 ............................................................
#    top  TEST ../../../bin/varnishtest/tests/r01212.vtc TIMED OUT (kill -9)
#    top  TEST ../../../bin/varnishtest/tests/r01212.vtc FAILED (60.002) signal=9

1 @ Linux 3.10.0 x86_64 1.02 mblissett

*    top   0.0 TEST ../../../bin/varnishtest/tests/r01212.vtc starting
[...]
*    top   0.0 TEST #1212 - Vmod with HEADER argument given a STRING asserts the VCL compiler
[...]
**** v1    0.1 CLI TX|\timport std;
**** v1    0.1 CLI TX|\tbackend b { .host = "127.0.0.1"; }
**** v1    0.1 CLI TX|\tsub vcl_recv {
**** v1    0.1 CLI TX|\t\tstd.collect("foo");
**** v1    0.1 CLI TX|\t}
**** v1    0.1 CLI TX|
**** v1    0.1 CLI TX|%XJEIFLH|)Xspa8P
***  v1    0.1 CLI RX  106
**** v1    0.1 CLI RX|Message from VCC-compiler:
**** v1    0.1 CLI RX|Wrong argument type.  Expected HEADER.  Got STRING.
**** v1    0.1 CLI RX|('<vcl.inline>' Line 6 Pos 29) -- ('<vcl.inline>' Line 6 Pos 33)
**** v1    0.1 CLI RX|                std.collect("foo");
**** v1    0.1 CLI RX|----------------------------#####--
**** v1    0.1 CLI RX|
**** v1    0.1 CLI RX|('<vcl.inline>' Line 6 Pos 17) -- ('<vcl.inline>' Line 6 Pos 33)
**** v1    0.1 CLI RX|                std.collect("foo");
**** v1    0.1 CLI RX|----------------#################--
**** v1    0.1 CLI RX|
**** v1    0.1 CLI RX|Running VCC-compiler failed, exited with 2
**** v1    0.1 CLI RX|VCL compilation failed
**   v1    0.1 VCL compilation failed (as expected)
***  v1    0.1 Found expected string: ("Wrong argument type.  Expected HEADER.  Got STRING.")
*    top   0.1 RESETTING after ../../../bin/varnishtest/tests/r01212.vtc
**   v1    0.1 Wait
**** v1    0.1 CLI TX|backend.list
***  v1    0.2 CLI RX  101
**** v1    0.2 CLI RX|Unknown request in manager process (child not running).
**** v1    0.2 CLI RX|Type 'help' for more info.
**   v1    0.2 Stop
**** v1    0.2 CLI TX|stop
***  v1    0.2 CLI RX  300
**** v1    0.2 CLI RX|Child in state stopped
**** v1    0.2 CLI TX|status
***  v1    0.2 CLI RX  200
**** v1    0.2 CLI RX|Child in state stopped
**** v1    0.2 STDOUT poll 0x10
**   v1    0.2 R 25155 Status: 0000 (u 0.005143 s 0.014638)
*    diag  0.0 ............................................................
#    top  TEST ../../../bin/varnishtest/tests/r01212.vtc TIMED OUT (kill -9)
#    top  TEST ../../../bin/varnishtest/tests/r01212.vtc FAILED (60.001) signal=9

1 @ Linux 3.10.0 x86_64 1.02 mblissett

*    top   0.0 TEST ../../../bin/varnishtest/tests/r01212.vtc starting
[...]
*    top   0.0 TEST #1212 - Vmod with HEADER argument given a STRING asserts the VCL compiler
[...]
**** v1    0.1 CLI TX|\timport std;
**** v1    0.1 CLI TX|\tbackend b { .host = "127.0.0.1"; }
**** v1    0.1 CLI TX|\tsub vcl_recv {
**** v1    0.1 CLI TX|\t\tstd.collect("foo");
**** v1    0.1 CLI TX|\t}
**** v1    0.1 CLI TX|
**** v1    0.1 CLI TX|%XJEIFLH|)Xspa8P
***  v1    0.1 CLI RX  106
**** v1    0.1 CLI RX|Message from VCC-compiler:
**** v1    0.1 CLI RX|Wrong argument type.  Expected HEADER.  Got STRING.
**** v1    0.1 CLI RX|('<vcl.inline>' Line 6 Pos 29) -- ('<vcl.inline>' Line 6 Pos 33)
**** v1    0.1 CLI RX|                std.collect("foo");
**** v1    0.1 CLI RX|----------------------------#####--
**** v1    0.1 CLI RX|
**** v1    0.1 CLI RX|('<vcl.inline>' Line 6 Pos 17) -- ('<vcl.inline>' Line 6 Pos 33)
**** v1    0.1 CLI RX|                std.collect("foo");
**** v1    0.1 CLI RX|----------------#################--
**** v1    0.1 CLI RX|
**** v1    0.1 CLI RX|Running VCC-compiler failed, exited with 2
**** v1    0.1 CLI RX|VCL compilation failed
**   v1    0.1 VCL compilation failed (as expected)
***  v1    0.1 Found expected string: ("Wrong argument type.  Expected HEADER.  Got STRING.")
*    top   0.1 RESETTING after ../../../bin/varnishtest/tests/r01212.vtc
**   v1    0.1 Wait
**** v1    0.1 CLI TX|backend.list
***  v1    0.2 CLI RX  101
**** v1    0.2 CLI RX|Unknown request in manager process (child not running).
**** v1    0.2 CLI RX|Type 'help' for more info.
**   v1    0.2 Stop
**** v1    0.2 CLI TX|stop
***  v1    0.2 CLI RX  300
**** v1    0.2 CLI RX|Child in state stopped
**** v1    0.2 CLI TX|status
***  v1    0.2 CLI RX  200
**** v1    0.2 CLI RX|Child in state stopped
**** v1    0.2 STDOUT poll 0x10
**   v1    0.2 R 18834 Status: 0000 (u 0.006318 s 0.016236)
*    diag  0.0 ............................................................
#    top  TEST ../../../bin/varnishtest/tests/r01212.vtc TIMED OUT (kill -9)
#    top  TEST ../../../bin/varnishtest/tests/r01212.vtc FAILED (60.001) signal=9

1 @ SunOS 5.11 i86pc 1.04 32_sun12.4 uplex

*    top   0.0 TEST ../../../bin/varnishtest/tests/r01212.vtc starting
[...]
*    top   0.0 TEST #1212 - Vmod with HEADER argument given a STRING asserts the VCL compiler
[...]
**** v1    0.1 CLI TX|\tbackend b { .host = "127.0.0.1"; }
**** v1    0.1 CLI TX|\tsub vcl_recv {
**** v1    0.1 CLI TX|\t\tstd.collect("foo");
**** v1    0.1 CLI TX|\t}
**** v1    0.1 CLI TX|
**** v1    0.1 CLI TX|%XJEIFLH|)Xspa8P
***  v1    0.1 CLI RX  106
**** v1    0.1 CLI RX|Message from VCC-compiler:
**** v1    0.1 CLI RX|Security: Privilege proc_setid missing, will not change uid/gid
**** v1    0.1 CLI RX|Wrong argument type.  Expected HEADER.  Got STRING.
**** v1    0.1 CLI RX|('<vcl.inline>' Line 6 Pos 29) -- ('<vcl.inline>' Line 6 Pos 33)
**** v1    0.1 CLI RX|                std.collect("foo");
**** v1    0.1 CLI RX|----------------------------#####--
**** v1    0.1 CLI RX|
**** v1    0.1 CLI RX|('<vcl.inline>' Line 6 Pos 17) -- ('<vcl.inline>' Line 6 Pos 33)
**** v1    0.1 CLI RX|                std.collect("foo");
**** v1    0.1 CLI RX|----------------#################--
**** v1    0.1 CLI RX|
**** v1    0.1 CLI RX|Running VCC-compiler failed, exited with 2
**** v1    0.1 CLI RX|VCL compilation failed
**   v1    0.1 VCL compilation failed (as expected)
***  v1    0.1 Found expected string: ("Wrong argument type.  Expected HEADER.  Got STRING.")
*    top   0.1 RESETTING after ../../../bin/varnishtest/tests/r01212.vtc
**   v1    0.1 Wait
**** v1    0.1 CLI TX|backend.list
***  v1    0.1 CLI RX  101
**** v1    0.1 CLI RX|Unknown request in manager process (child not running).
**** v1    0.1 CLI RX|Type 'help' for more info.
**   v1    0.1 Stop
**** v1    0.1 CLI TX|stop
***  v1    0.1 CLI RX  300
**** v1    0.1 CLI RX|Child in state stopped
**** v1    0.1 CLI TX|status
***  v1    0.1 CLI RX  200
**** v1    0.1 CLI RX|Child in state stopped
**** v1    0.1 STDOUT poll 0x10
**   v1    0.1 R 88256 Status: 0000 (u 0.005000 s 0.017000)
*    diag  0.0 ............................................................
#    top  TEST ../../../bin/varnishtest/tests/r01212.vtc TIMED OUT (kill -9)
#    top  TEST ../../../bin/varnishtest/tests/r01212.vtc FAILED (60.002) signal=9

1 @ Ubuntu LTS i686 1.04 fgs

*    top   0.0 TEST ../../../bin/varnishtest/tests/r01212.vtc starting
[...]
*    top   0.0 TEST #1212 - Vmod with HEADER argument given a STRING asserts the VCL compiler
[...]
**** v1    0.1 CLI TX|\timport std;
**** v1    0.1 CLI TX|\tbackend b { .host = "127.0.0.1"; }
**** v1    0.1 CLI TX|\tsub vcl_recv {
**** v1    0.1 CLI TX|\t\tstd.collect("foo");
**** v1    0.1 CLI TX|\t}
**** v1    0.1 CLI TX|
**** v1    0.1 CLI TX|%XJEIFLH|)Xspa8P
***  v1    0.1 CLI RX  106
**** v1    0.1 CLI RX|Message from VCC-compiler:
**** v1    0.1 CLI RX|Wrong argument type.  Expected HEADER.  Got STRING.
**** v1    0.1 CLI RX|('<vcl.inline>' Line 6 Pos 29) -- ('<vcl.inline>' Line 6 Pos 33)
**** v1    0.1 CLI RX|                std.collect("foo");
**** v1    0.1 CLI RX|----------------------------#####--
**** v1    0.1 CLI RX|
**** v1    0.1 CLI RX|('<vcl.inline>' Line 6 Pos 17) -- ('<vcl.inline>' Line 6 Pos 33)
**** v1    0.1 CLI RX|                std.collect("foo");
**** v1    0.1 CLI RX|----------------#################--
**** v1    0.1 CLI RX|
**** v1    0.1 CLI RX|Running VCC-compiler failed, exited with 2
**** v1    0.1 CLI RX|VCL compilation failed
**   v1    0.1 VCL compilation failed (as expected)
***  v1    0.1 Found expected string: ("Wrong argument type.  Expected HEADER.  Got STRING.")
*    top   0.1 RESETTING after ../../../bin/varnishtest/tests/r01212.vtc
**   v1    0.1 Wait
**** v1    0.1 CLI TX|backend.list
***  v1    0.1 CLI RX  101
**** v1    0.1 CLI RX|Unknown request in manager process (child not running).
**** v1    0.1 CLI RX|Type 'help' for more info.
**   v1    0.1 Stop
**** v1    0.1 CLI TX|stop
***  v1    0.2 CLI RX  300
**** v1    0.2 CLI RX|Child in state stopped
**** v1    0.2 CLI TX|status
***  v1    0.2 CLI RX  200
**** v1    0.2 CLI RX|Child in state stopped
**** v1    0.2 STDOUT poll 0x10
**   v1    0.2 R 14211 Status: 0000 (u 0.000000 s 0.004000)
*    diag  0.0 ............................................................
#    top  TEST ../../../bin/varnishtest/tests/r01212.vtc TIMED OUT (kill -9)
#    top  TEST ../../../bin/varnishtest/tests/r01212.vtc FAILED (60.002) signal=9

1 @ SunOS 5.11 i86pc 1.04 64_sun12.4 uplex

*    top   0.0 TEST ../../../bin/varnishtest/tests/r01212.vtc starting
[...]
*    top   0.0 TEST #1212 - Vmod with HEADER argument given a STRING asserts the VCL compiler
[...]
**** v1    0.1 CLI TX|\tbackend b { .host = "127.0.0.1"; }
**** v1    0.1 CLI TX|\tsub vcl_recv {
**** v1    0.1 CLI TX|\t\tstd.collect("foo");
**** v1    0.1 CLI TX|\t}
**** v1    0.1 CLI TX|
**** v1    0.1 CLI TX|%XJEIFLH|)Xspa8P
***  v1    0.1 CLI RX  106
**** v1    0.1 CLI RX|Message from VCC-compiler:
**** v1    0.1 CLI RX|Security: Privilege proc_setid missing, will not change uid/gid
**** v1    0.1 CLI RX|Wrong argument type.  Expected HEADER.  Got STRING.
**** v1    0.1 CLI RX|('<vcl.inline>' Line 6 Pos 29) -- ('<vcl.inline>' Line 6 Pos 33)
**** v1    0.1 CLI RX|                std.collect("foo");
**** v1    0.1 CLI RX|----------------------------#####--
**** v1    0.1 CLI RX|
**** v1    0.1 CLI RX|('<vcl.inline>' Line 6 Pos 17) -- ('<vcl.inline>' Line 6 Pos 33)
**** v1    0.1 CLI RX|                std.collect("foo");
**** v1    0.1 CLI RX|----------------#################--
**** v1    0.1 CLI RX|
**** v1    0.1 CLI RX|Running VCC-compiler failed, exited with 2
**** v1    0.1 CLI RX|VCL compilation failed
**   v1    0.1 VCL compilation failed (as expected)
***  v1    0.1 Found expected string: ("Wrong argument type.  Expected HEADER.  Got STRING.")
*    top   0.1 RESETTING after ../../../bin/varnishtest/tests/r01212.vtc
**   v1    0.1 Wait
**** v1    0.1 CLI TX|backend.list
***  v1    0.1 CLI RX  101
**** v1    0.1 CLI RX|Unknown request in manager process (child not running).
**** v1    0.1 CLI RX|Type 'help' for more info.
**   v1    0.1 Stop
**** v1    0.1 CLI TX|stop
***  v1    0.1 CLI RX  300
**** v1    0.1 CLI RX|Child in state stopped
**** v1    0.1 CLI TX|status
***  v1    0.1 CLI RX  200
**** v1    0.1 CLI RX|Child in state stopped
**** v1    0.1 STDOUT poll 0x10
**   v1    0.1 R 49266 Status: 0000 (u 0.007000 s 0.023000)
*    diag  0.0 ............................................................
#    top  TEST ../../../bin/varnishtest/tests/r01212.vtc TIMED OUT (kill -9)
#    top  TEST ../../../bin/varnishtest/tests/r01212.vtc FAILED (60.003) signal=9

1 @ Linux 3.10.0 x86_64 1.02 mblissett

*    top   0.0 TEST ../../../bin/varnishtest/tests/r01212.vtc starting
[...]
*    top   0.0 TEST #1212 - Vmod with HEADER argument given a STRING asserts the VCL compiler
[...]
**** v1    0.1 CLI TX|\timport std;
**** v1    0.1 CLI TX|\tbackend b { .host = "127.0.0.1"; }
**** v1    0.1 CLI TX|\tsub vcl_recv {
**** v1    0.1 CLI TX|\t\tstd.collect("foo");
**** v1    0.1 CLI TX|\t}
**** v1    0.1 CLI TX|
**** v1    0.1 CLI TX|%XJEIFLH|)Xspa8P
***  v1    0.1 CLI RX  106
**** v1    0.1 CLI RX|Message from VCC-compiler:
**** v1    0.1 CLI RX|Wrong argument type.  Expected HEADER.  Got STRING.
**** v1    0.1 CLI RX|('<vcl.inline>' Line 6 Pos 29) -- ('<vcl.inline>' Line 6 Pos 33)
**** v1    0.1 CLI RX|                std.collect("foo");
**** v1    0.1 CLI RX|----------------------------#####--
**** v1    0.1 CLI RX|
**** v1    0.1 CLI RX|('<vcl.inline>' Line 6 Pos 17) -- ('<vcl.inline>' Line 6 Pos 33)
**** v1    0.1 CLI RX|                std.collect("foo");
**** v1    0.1 CLI RX|----------------#################--
**** v1    0.1 CLI RX|
**** v1    0.1 CLI RX|Running VCC-compiler failed, exited with 2
**** v1    0.1 CLI RX|VCL compilation failed
**   v1    0.1 VCL compilation failed (as expected)
***  v1    0.1 Found expected string: ("Wrong argument type.  Expected HEADER.  Got STRING.")
*    top   0.1 RESETTING after ../../../bin/varnishtest/tests/r01212.vtc
**   v1    0.1 Wait
**** v1    0.1 CLI TX|backend.list
***  v1    0.2 CLI RX  101
**** v1    0.2 CLI RX|Unknown request in manager process (child not running).
**** v1    0.2 CLI RX|Type 'help' for more info.
**   v1    0.2 Stop
**** v1    0.2 CLI TX|stop
***  v1    0.2 CLI RX  300
**** v1    0.2 CLI RX|Child in state stopped
**** v1    0.2 CLI TX|status
***  v1    0.2 CLI RX  200
**** v1    0.2 CLI RX|Child in state stopped
**** v1    0.2 STDOUT poll 0x10
**   v1    0.2 R 28321 Status: 0000 (u 0.003886 s 0.015547)
*    diag  0.0 ............................................................
#    top  TEST ../../../bin/varnishtest/tests/r01212.vtc TIMED OUT (kill -9)
#    top  TEST ../../../bin/varnishtest/tests/r01212.vtc FAILED (60.001) signal=9

1 @ Ubuntu LTS i686 1.04 fgs

*    top   0.0 TEST ../../../bin/varnishtest/tests/r01212.vtc starting
[...]
*    top   0.0 TEST #1212 - Vmod with HEADER argument given a STRING asserts the VCL compiler
[...]
**** v1    0.1 CLI TX|\timport std;
**** v1    0.1 CLI TX|\tbackend b { .host = "127.0.0.1"; }
**** v1    0.1 CLI TX|\tsub vcl_recv {
**** v1    0.1 CLI TX|\t\tstd.collect("foo");
**** v1    0.1 CLI TX|\t}
**** v1    0.1 CLI TX|
**** v1    0.1 CLI TX|%XJEIFLH|)Xspa8P
***  v1    0.1 CLI RX  106
**** v1    0.1 CLI RX|Message from VCC-compiler:
**** v1    0.1 CLI RX|Wrong argument type.  Expected HEADER.  Got STRING.
**** v1    0.1 CLI RX|('<vcl.inline>' Line 6 Pos 29) -- ('<vcl.inline>' Line 6 Pos 33)
**** v1    0.1 CLI RX|                std.collect("foo");
**** v1    0.1 CLI RX|----------------------------#####--
**** v1    0.1 CLI RX|
**** v1    0.1 CLI RX|('<vcl.inline>' Line 6 Pos 17) -- ('<vcl.inline>' Line 6 Pos 33)
**** v1    0.1 CLI RX|                std.collect("foo");
**** v1    0.1 CLI RX|----------------#################--
**** v1    0.1 CLI RX|
**** v1    0.1 CLI RX|Running VCC-compiler failed, exited with 2
**** v1    0.1 CLI RX|VCL compilation failed
**   v1    0.1 VCL compilation failed (as expected)
***  v1    0.1 Found expected string: ("Wrong argument type.  Expected HEADER.  Got STRING.")
*    top   0.1 RESETTING after ../../../bin/varnishtest/tests/r01212.vtc
**   v1    0.1 Wait
**** v1    0.1 CLI TX|backend.list
***  v1    0.1 CLI RX  101
**** v1    0.1 CLI RX|Unknown request in manager process (child not running).
**** v1    0.1 CLI RX|Type 'help' for more info.
**   v1    0.1 Stop
**** v1    0.1 CLI TX|stop
***  v1    0.2 CLI RX  300
**** v1    0.2 CLI RX|Child in state stopped
**** v1    0.2 CLI TX|status
***  v1    0.2 CLI RX  200
**** v1    0.2 CLI RX|Child in state stopped
**** v1    0.2 STDOUT poll 0x10
**   v1    0.2 R 32375 Status: 0000 (u 0.000000 s 0.004000)
*    diag  0.0 ............................................................
#    top  TEST ../../../bin/varnishtest/tests/r01212.vtc TIMED OUT (kill -9)
#    top  TEST ../../../bin/varnishtest/tests/r01212.vtc FAILED (60.001) signal=9

1 @ Ubuntu LTS i686 1.04 fgs

*    top   0.0 TEST ../../../bin/varnishtest/tests/r01212.vtc starting
[...]
*    top   0.0 TEST #1212 - Vmod with HEADER argument given a STRING asserts the VCL compiler
[...]
**** v1    0.1 CLI TX|\timport std;
**** v1    0.1 CLI TX|\tbackend b { .host = "127.0.0.1"; }
**** v1    0.1 CLI TX|\tsub vcl_recv {
**** v1    0.1 CLI TX|\t\tstd.collect("foo");
**** v1    0.1 CLI TX|\t}
**** v1    0.1 CLI TX|
**** v1    0.1 CLI TX|%XJEIFLH|)Xspa8P
***  v1    0.1 CLI RX  106
**** v1    0.1 CLI RX|Message from VCC-compiler:
**** v1    0.1 CLI RX|Wrong argument type.  Expected HEADER.  Got STRING.
**** v1    0.1 CLI RX|('<vcl.inline>' Line 6 Pos 29) -- ('<vcl.inline>' Line 6 Pos 33)
**** v1    0.1 CLI RX|                std.collect("foo");
**** v1    0.1 CLI RX|----------------------------#####--
**** v1    0.1 CLI RX|
**** v1    0.1 CLI RX|('<vcl.inline>' Line 6 Pos 17) -- ('<vcl.inline>' Line 6 Pos 33)
**** v1    0.1 CLI RX|                std.collect("foo");
**** v1    0.1 CLI RX|----------------#################--
**** v1    0.1 CLI RX|
**** v1    0.1 CLI RX|Running VCC-compiler failed, exited with 2
**** v1    0.1 CLI RX|VCL compilation failed
**   v1    0.1 VCL compilation failed (as expected)
***  v1    0.1 Found expected string: ("Wrong argument type.  Expected HEADER.  Got STRING.")
*    top   0.1 RESETTING after ../../../bin/varnishtest/tests/r01212.vtc
**   v1    0.1 Wait
**** v1    0.1 CLI TX|backend.list
***  v1    0.1 CLI RX  101
**** v1    0.1 CLI RX|Unknown request in manager process (child not running).
**** v1    0.1 CLI RX|Type 'help' for more info.
**   v1    0.1 Stop
**** v1    0.1 CLI TX|stop
***  v1    0.2 CLI RX  300
**** v1    0.2 CLI RX|Child in state stopped
**** v1    0.2 CLI TX|status
***  v1    0.2 CLI RX  200
**** v1    0.2 CLI RX|Child in state stopped
**** v1    0.2 STDOUT poll 0x10
**   v1    0.2 R 29169 Status: 0000 (u 0.004000 s 0.000000)
*    diag  0.0 ............................................................
#    top  TEST ../../../bin/varnishtest/tests/r01212.vtc TIMED OUT (kill -9)
#    top  TEST ../../../bin/varnishtest/tests/r01212.vtc FAILED (60.001) signal=9

1 @ Linux 3.10.0 x86_64 1.02 mblissett

*    top   0.0 TEST ../../../bin/varnishtest/tests/r01212.vtc starting
[...]
*    top   0.0 TEST #1212 - Vmod with HEADER argument given a STRING asserts the VCL compiler
[...]
**** v1    0.1 CLI TX|\timport std;
**** v1    0.1 CLI TX|\tbackend b { .host = "127.0.0.1"; }
**** v1    0.1 CLI TX|\tsub vcl_recv {
**** v1    0.1 CLI TX|\t\tstd.collect("foo");
**** v1    0.1 CLI TX|\t}
**** v1    0.1 CLI TX|
**** v1    0.1 CLI TX|%XJEIFLH|)Xspa8P
***  v1    0.1 CLI RX  106
**** v1    0.1 CLI RX|Message from VCC-compiler:
**** v1    0.1 CLI RX|Wrong argument type.  Expected HEADER.  Got STRING.
**** v1    0.1 CLI RX|('<vcl.inline>' Line 6 Pos 29) -- ('<vcl.inline>' Line 6 Pos 33)
**** v1    0.1 CLI RX|                std.collect("foo");
**** v1    0.1 CLI RX|----------------------------#####--
**** v1    0.1 CLI RX|
**** v1    0.1 CLI RX|('<vcl.inline>' Line 6 Pos 17) -- ('<vcl.inline>' Line 6 Pos 33)
**** v1    0.1 CLI RX|                std.collect("foo");
**** v1    0.1 CLI RX|----------------#################--
**** v1    0.1 CLI RX|
**** v1    0.1 CLI RX|Running VCC-compiler failed, exited with 2
**** v1    0.1 CLI RX|VCL compilation failed
**   v1    0.1 VCL compilation failed (as expected)
***  v1    0.1 Found expected string: ("Wrong argument type.  Expected HEADER.  Got STRING.")
*    top   0.1 RESETTING after ../../../bin/varnishtest/tests/r01212.vtc
**   v1    0.1 Wait
**** v1    0.1 CLI TX|backend.list
***  v1    0.2 CLI RX  101
**** v1    0.2 CLI RX|Unknown request in manager process (child not running).
**** v1    0.2 CLI RX|Type 'help' for more info.
**   v1    0.2 Stop
**** v1    0.2 CLI TX|stop
***  v1    0.2 CLI RX  300
**** v1    0.2 CLI RX|Child in state stopped
**** v1    0.2 CLI TX|status
***  v1    0.2 CLI RX  200
**** v1    0.2 CLI RX|Child in state stopped
**** v1    0.2 STDOUT poll 0x10
**   v1    0.2 R 18159 Status: 0000 (u 0.005305 s 0.017008)
*    diag  0.0 ............................................................
#    top  TEST ../../../bin/varnishtest/tests/r01212.vtc TIMED OUT (kill -9)
#    top  TEST ../../../bin/varnishtest/tests/r01212.vtc FAILED (60.001) signal=9

1 @ Ubuntu LTS i686 1.04 fgs

*    top   0.0 TEST ../../../bin/varnishtest/tests/r01212.vtc starting
[...]
*    top   0.0 TEST #1212 - Vmod with HEADER argument given a STRING asserts the VCL compiler
[...]
**** v1    0.1 CLI TX|\timport std;
**** v1    0.1 CLI TX|\tbackend b { .host = "127.0.0.1"; }
**** v1    0.1 CLI TX|\tsub vcl_recv {
**** v1    0.1 CLI TX|\t\tstd.collect("foo");
**** v1    0.1 CLI TX|\t}
**** v1    0.1 CLI TX|
**** v1    0.1 CLI TX|%XJEIFLH|)Xspa8P
***  v1    0.1 CLI RX  106
**** v1    0.1 CLI RX|Message from VCC-compiler:
**** v1    0.1 CLI RX|Wrong argument type.  Expected HEADER.  Got STRING.
**** v1    0.1 CLI RX|('<vcl.inline>' Line 6 Pos 29) -- ('<vcl.inline>' Line 6 Pos 33)
**** v1    0.1 CLI RX|                std.collect("foo");
**** v1    0.1 CLI RX|----------------------------#####--
**** v1    0.1 CLI RX|
**** v1    0.1 CLI RX|('<vcl.inline>' Line 6 Pos 17) -- ('<vcl.inline>' Line 6 Pos 33)
**** v1    0.1 CLI RX|                std.collect("foo");
**** v1    0.1 CLI RX|----------------#################--
**** v1    0.1 CLI RX|
**** v1    0.1 CLI RX|Running VCC-compiler failed, exited with 2
**** v1    0.1 CLI RX|VCL compilation failed
**   v1    0.1 VCL compilation failed (as expected)
***  v1    0.1 Found expected string: ("Wrong argument type.  Expected HEADER.  Got STRING.")
*    top   0.1 RESETTING after ../../../bin/varnishtest/tests/r01212.vtc
**   v1    0.1 Wait
**** v1    0.1 CLI TX|backend.list
***  v1    0.1 CLI RX  101
**** v1    0.1 CLI RX|Unknown request in manager process (child not running).
**** v1    0.1 CLI RX|Type 'help' for more info.
**   v1    0.1 Stop
**** v1    0.1 CLI TX|stop
***  v1    0.2 CLI RX  300
**** v1    0.2 CLI RX|Child in state stopped
**** v1    0.2 CLI TX|status
***  v1    0.2 CLI RX  200
**** v1    0.2 CLI RX|Child in state stopped
**** v1    0.2 STDOUT poll 0x10
**   v1    0.2 R 23078 Status: 0000 (u 0.000000 s 0.004000)
*    diag  0.0 ............................................................
#    top  TEST ../../../bin/varnishtest/tests/r01212.vtc TIMED OUT (kill -9)
#    top  TEST ../../../bin/varnishtest/tests/r01212.vtc FAILED (60.001) signal=9

1 @ SunOS 5.11 i86pc 1.04 32_sun12.4 uplex

*    top   0.0 TEST ../../../bin/varnishtest/tests/r01212.vtc starting
[...]
*    top   0.0 TEST #1212 - Vmod with HEADER argument given a STRING asserts the VCL compiler
[...]
**** v1    0.1 CLI TX|\tbackend b { .host = "127.0.0.1"; }
**** v1    0.1 CLI TX|\tsub vcl_recv {
**** v1    0.1 CLI TX|\t\tstd.collect("foo");
**** v1    0.1 CLI TX|\t}
**** v1    0.1 CLI TX|
**** v1    0.1 CLI TX|%XJEIFLH|)Xspa8P
***  v1    0.1 CLI RX  106
**** v1    0.1 CLI RX|Message from VCC-compiler:
**** v1    0.1 CLI RX|Security: Privilege proc_setid missing, will not change uid/gid
**** v1    0.1 CLI RX|Wrong argument type.  Expected HEADER.  Got STRING.
**** v1    0.1 CLI RX|('<vcl.inline>' Line 6 Pos 29) -- ('<vcl.inline>' Line 6 Pos 33)
**** v1    0.1 CLI RX|                std.collect("foo");
**** v1    0.1 CLI RX|----------------------------#####--
**** v1    0.1 CLI RX|
**** v1    0.1 CLI RX|('<vcl.inline>' Line 6 Pos 17) -- ('<vcl.inline>' Line 6 Pos 33)
**** v1    0.1 CLI RX|                std.collect("foo");
**** v1    0.1 CLI RX|----------------#################--
**** v1    0.1 CLI RX|
**** v1    0.1 CLI RX|Running VCC-compiler failed, exited with 2
**** v1    0.1 CLI RX|VCL compilation failed
**   v1    0.1 VCL compilation failed (as expected)
***  v1    0.1 Found expected string: ("Wrong argument type.  Expected HEADER.  Got STRING.")
*    top   0.1 RESETTING after ../../../bin/varnishtest/tests/r01212.vtc
**   v1    0.1 Wait
**** v1    0.1 CLI TX|backend.list
***  v1    0.1 CLI RX  101
**** v1    0.1 CLI RX|Unknown request in manager process (child not running).
**** v1    0.1 CLI RX|Type 'help' for more info.
**   v1    0.1 Stop
**** v1    0.1 CLI TX|stop
***  v1    0.1 CLI RX  300
**** v1    0.1 CLI RX|Child in state stopped
**** v1    0.1 CLI TX|status
***  v1    0.1 CLI RX  200
**** v1    0.1 CLI RX|Child in state stopped
**** v1    0.1 STDOUT poll 0x10
**   v1    0.1 R 19964 Status: 0000 (u 0.005000 s 0.018000)
*    diag  0.0 ............................................................
#    top  TEST ../../../bin/varnishtest/tests/r01212.vtc TIMED OUT (kill -9)
#    top  TEST ../../../bin/varnishtest/tests/r01212.vtc FAILED (60.002) signal=9

1 @ Ubuntu LTS i686 1.04 fgs

*    top   0.0 TEST ../../../bin/varnishtest/tests/r01212.vtc starting
[...]
*    top   0.0 TEST #1212 - Vmod with HEADER argument given a STRING asserts the VCL compiler
[...]
**** v1    0.1 CLI TX|\timport std;
**** v1    0.1 CLI TX|\tbackend b { .host = "127.0.0.1"; }
**** v1    0.1 CLI TX|\tsub vcl_recv {
**** v1    0.1 CLI TX|\t\tstd.collect("foo");
**** v1    0.1 CLI TX|\t}
**** v1    0.1 CLI TX|
**** v1    0.1 CLI TX|%XJEIFLH|)Xspa8P
***  v1    0.1 CLI RX  106
**** v1    0.1 CLI RX|Message from VCC-compiler:
**** v1    0.1 CLI RX|Wrong argument type.  Expected HEADER.  Got STRING.
**** v1    0.1 CLI RX|('<vcl.inline>' Line 6 Pos 29) -- ('<vcl.inline>' Line 6 Pos 33)
**** v1    0.1 CLI RX|                std.collect("foo");
**** v1    0.1 CLI RX|----------------------------#####--
**** v1    0.1 CLI RX|
**** v1    0.1 CLI RX|('<vcl.inline>' Line 6 Pos 17) -- ('<vcl.inline>' Line 6 Pos 33)
**** v1    0.1 CLI RX|                std.collect("foo");
**** v1    0.1 CLI RX|----------------#################--
**** v1    0.1 CLI RX|
**** v1    0.1 CLI RX|Running VCC-compiler failed, exited with 2
**** v1    0.1 CLI RX|VCL compilation failed
**   v1    0.1 VCL compilation failed (as expected)
***  v1    0.1 Found expected string: ("Wrong argument type.  Expected HEADER.  Got STRING.")
*    top   0.1 RESETTING after ../../../bin/varnishtest/tests/r01212.vtc
**   v1    0.1 Wait
**** v1    0.1 CLI TX|backend.list
***  v1    0.1 CLI RX  101
**** v1    0.1 CLI RX|Unknown request in manager process (child not running).
**** v1    0.1 CLI RX|Type 'help' for more info.
**   v1    0.1 Stop
**** v1    0.1 CLI TX|stop
***  v1    0.2 CLI RX  300
**** v1    0.2 CLI RX|Child in state stopped
**** v1    0.2 CLI TX|status
***  v1    0.2 CLI RX  200
**** v1    0.2 CLI RX|Child in state stopped
**** v1    0.2 STDOUT poll 0x10
**   v1    0.2 R 3093 Status: 0000 (u 0.004000 s 0.000000)
*    diag  0.0 ............................................................
#    top  TEST ../../../bin/varnishtest/tests/r01212.vtc TIMED OUT (kill -9)
#    top  TEST ../../../bin/varnishtest/tests/r01212.vtc FAILED (60.001) signal=9

1 @ SunOS 5.11 i86pc 1.04 32_sun12.4 uplex

*    top   0.0 TEST ../../../bin/varnishtest/tests/r01212.vtc starting
[...]
*    top   0.0 TEST #1212 - Vmod with HEADER argument given a STRING asserts the VCL compiler
[...]
**** v1    0.1 CLI TX|\tbackend b { .host = "127.0.0.1"; }
**** v1    0.1 CLI TX|\tsub vcl_recv {
**** v1    0.1 CLI TX|\t\tstd.collect("foo");
**** v1    0.1 CLI TX|\t}
**** v1    0.1 CLI TX|
**** v1    0.1 CLI TX|%XJEIFLH|)Xspa8P
***  v1    0.1 CLI RX  106
**** v1    0.1 CLI RX|Message from VCC-compiler:
**** v1    0.1 CLI RX|Security: Privilege proc_setid missing, will not change uid/gid
**** v1    0.1 CLI RX|Wrong argument type.  Expected HEADER.  Got STRING.
**** v1    0.1 CLI RX|('<vcl.inline>' Line 6 Pos 29) -- ('<vcl.inline>' Line 6 Pos 33)
**** v1    0.1 CLI RX|                std.collect("foo");
**** v1    0.1 CLI RX|----------------------------#####--
**** v1    0.1 CLI RX|
**** v1    0.1 CLI RX|('<vcl.inline>' Line 6 Pos 17) -- ('<vcl.inline>' Line 6 Pos 33)
**** v1    0.1 CLI RX|                std.collect("foo");
**** v1    0.1 CLI RX|----------------#################--
**** v1    0.1 CLI RX|
**** v1    0.1 CLI RX|Running VCC-compiler failed, exited with 2
**** v1    0.1 CLI RX|VCL compilation failed
**   v1    0.1 VCL compilation failed (as expected)
***  v1    0.1 Found expected string: ("Wrong argument type.  Expected HEADER.  Got STRING.")
*    top   0.1 RESETTING after ../../../bin/varnishtest/tests/r01212.vtc
**   v1    0.1 Wait
**** v1    0.1 CLI TX|backend.list
***  v1    0.1 CLI RX  101
**** v1    0.1 CLI RX|Unknown request in manager process (child not running).
**** v1    0.1 CLI RX|Type 'help' for more info.
**   v1    0.1 Stop
**** v1    0.1 CLI TX|stop
***  v1    0.1 CLI RX  300
**** v1    0.1 CLI RX|Child in state stopped
**** v1    0.1 CLI TX|status
***  v1    0.1 CLI RX  200
**** v1    0.1 CLI RX|Child in state stopped
**** v1    0.1 STDOUT poll 0x10
**   v1    0.1 R 81001 Status: 0000 (u 0.005000 s 0.018000)
*    diag  0.0 ............................................................
#    top  TEST ../../../bin/varnishtest/tests/r01212.vtc TIMED OUT (kill -9)
#    top  TEST ../../../bin/varnishtest/tests/r01212.vtc FAILED (60.002) signal=9

1 @ Linux 3.10.0 x86_64 1.02 mblissett

*    top   0.0 TEST ../../../bin/varnishtest/tests/r01212.vtc starting
[...]
*    top   0.0 TEST #1212 - Vmod with HEADER argument given a STRING asserts the VCL compiler
[...]
**** v1    0.1 CLI TX|\timport std;
**** v1    0.1 CLI TX|\tbackend b { .host = "127.0.0.1"; }
**** v1    0.1 CLI TX|\tsub vcl_recv {
**** v1    0.1 CLI TX|\t\tstd.collect("foo");
**** v1    0.1 CLI TX|\t}
**** v1    0.1 CLI TX|
**** v1    0.1 CLI TX|%XJEIFLH|)Xspa8P
***  v1    0.1 CLI RX  106
**** v1    0.1 CLI RX|Message from VCC-compiler:
**** v1    0.1 CLI RX|Wrong argument type.  Expected HEADER.  Got STRING.
**** v1    0.1 CLI RX|('<vcl.inline>' Line 6 Pos 29) -- ('<vcl.inline>' Line 6 Pos 33)
**** v1    0.1 CLI RX|                std.collect("foo");
**** v1    0.1 CLI RX|----------------------------#####--
**** v1    0.1 CLI RX|
**** v1    0.1 CLI RX|('<vcl.inline>' Line 6 Pos 17) -- ('<vcl.inline>' Line 6 Pos 33)
**** v1    0.1 CLI RX|                std.collect("foo");
**** v1    0.1 CLI RX|----------------#################--
**** v1    0.1 CLI RX|
**** v1    0.1 CLI RX|Running VCC-compiler failed, exited with 2
**** v1    0.1 CLI RX|VCL compilation failed
**   v1    0.1 VCL compilation failed (as expected)
***  v1    0.1 Found expected string: ("Wrong argument type.  Expected HEADER.  Got STRING.")
*    top   0.1 RESETTING after ../../../bin/varnishtest/tests/r01212.vtc
**   v1    0.1 Wait
**** v1    0.1 CLI TX|backend.list
***  v1    0.2 CLI RX  101
**** v1    0.2 CLI RX|Unknown request in manager process (child not running).
**** v1    0.2 CLI RX|Type 'help' for more info.
**   v1    0.2 Stop
**** v1    0.2 CLI TX|stop
***  v1    0.2 CLI RX  300
**** v1    0.2 CLI RX|Child in state stopped
**** v1    0.2 CLI TX|status
***  v1    0.2 CLI RX  200
**** v1    0.2 CLI RX|Child in state stopped
**** v1    0.2 STDOUT poll 0x10
**   v1    0.2 R 15670 Status: 0000 (u 0.002048 s 0.013252)
*    diag  0.0 ............................................................
#    top  TEST ../../../bin/varnishtest/tests/r01212.vtc TIMED OUT (kill -9)
#    top  TEST ../../../bin/varnishtest/tests/r01212.vtc FAILED (60.001) signal=9

1 @ Linux 3.10.0 x86_64 1.02 mblissett

*    top   0.0 TEST ../../../bin/varnishtest/tests/r01212.vtc starting
[...]
*    top   0.0 TEST #1212 - Vmod with HEADER argument given a STRING asserts the VCL compiler
[...]
**** v1    0.1 CLI TX|\timport std;
**** v1    0.1 CLI TX|\tbackend b { .host = "127.0.0.1"; }
**** v1    0.1 CLI TX|\tsub vcl_recv {
**** v1    0.1 CLI TX|\t\tstd.collect("foo");
**** v1    0.1 CLI TX|\t}
**** v1    0.1 CLI TX|
**** v1    0.1 CLI TX|%XJEIFLH|)Xspa8P
***  v1    0.1 CLI RX  106
**** v1    0.1 CLI RX|Message from VCC-compiler:
**** v1    0.1 CLI RX|Wrong argument type.  Expected HEADER.  Got STRING.
**** v1    0.1 CLI RX|('<vcl.inline>' Line 6 Pos 29) -- ('<vcl.inline>' Line 6 Pos 33)
**** v1    0.1 CLI RX|                std.collect("foo");
**** v1    0.1 CLI RX|----------------------------#####--
**** v1    0.1 CLI RX|
**** v1    0.1 CLI RX|('<vcl.inline>' Line 6 Pos 17) -- ('<vcl.inline>' Line 6 Pos 33)
**** v1    0.1 CLI RX|                std.collect("foo");
**** v1    0.1 CLI RX|----------------#################--
**** v1    0.1 CLI RX|
**** v1    0.1 CLI RX|Running VCC-compiler failed, exited with 2
**** v1    0.1 CLI RX|VCL compilation failed
**   v1    0.1 VCL compilation failed (as expected)
***  v1    0.1 Found expected string: ("Wrong argument type.  Expected HEADER.  Got STRING.")
*    top   0.1 RESETTING after ../../../bin/varnishtest/tests/r01212.vtc
**   v1    0.1 Wait
**** v1    0.1 CLI TX|backend.list
***  v1    0.2 CLI RX  101
**** v1    0.2 CLI RX|Unknown request in manager process (child not running).
**** v1    0.2 CLI RX|Type 'help' for more info.
**   v1    0.2 Stop
**** v1    0.2 CLI TX|stop
***  v1    0.2 CLI RX  300
**** v1    0.2 CLI RX|Child in state stopped
**** v1    0.2 CLI TX|status
***  v1    0.2 CLI RX  200
**** v1    0.2 CLI RX|Child in state stopped
**** v1    0.2 STDOUT poll 0x10
**   v1    0.2 R 31484 Status: 0000 (u 0.004887 s 0.017461)
*    diag  0.0 ............................................................
#    top  TEST ../../../bin/varnishtest/tests/r01212.vtc TIMED OUT (kill -9)
#    top  TEST ../../../bin/varnishtest/tests/r01212.vtc FAILED (60.001) signal=9

1 @ SunOS 5.11 i86pc 1.04 32_sun12.4 uplex

*    top   0.0 TEST ../../../bin/varnishtest/tests/r01212.vtc starting
[...]
*    top   0.0 TEST #1212 - Vmod with HEADER argument given a STRING asserts the VCL compiler
[...]
**** v1    0.1 CLI TX|\tbackend b { .host = "127.0.0.1"; }
**** v1    0.1 CLI TX|\tsub vcl_recv {
**** v1    0.1 CLI TX|\t\tstd.collect("foo");
**** v1    0.1 CLI TX|\t}
**** v1    0.1 CLI TX|
**** v1    0.1 CLI TX|%XJEIFLH|)Xspa8P
***  v1    0.1 CLI RX  106
**** v1    0.1 CLI RX|Message from VCC-compiler:
**** v1    0.1 CLI RX|Security: Privilege proc_setid missing, will not change uid/gid
**** v1    0.1 CLI RX|Wrong argument type.  Expected HEADER.  Got STRING.
**** v1    0.1 CLI RX|('<vcl.inline>' Line 6 Pos 29) -- ('<vcl.inline>' Line 6 Pos 33)
**** v1    0.1 CLI RX|                std.collect("foo");
**** v1    0.1 CLI RX|----------------------------#####--
**** v1    0.1 CLI RX|
**** v1    0.1 CLI RX|('<vcl.inline>' Line 6 Pos 17) -- ('<vcl.inline>' Line 6 Pos 33)
**** v1    0.1 CLI RX|                std.collect("foo");
**** v1    0.1 CLI RX|----------------#################--
**** v1    0.1 CLI RX|
**** v1    0.1 CLI RX|Running VCC-compiler failed, exited with 2
**** v1    0.1 CLI RX|VCL compilation failed
**   v1    0.1 VCL compilation failed (as expected)
***  v1    0.1 Found expected string: ("Wrong argument type.  Expected HEADER.  Got STRING.")
*    top   0.1 RESETTING after ../../../bin/varnishtest/tests/r01212.vtc
**   v1    0.1 Wait
**** v1    0.1 CLI TX|backend.list
***  v1    0.1 CLI RX  101
**** v1    0.1 CLI RX|Unknown request in manager process (child not running).
**** v1    0.1 CLI RX|Type 'help' for more info.
**   v1    0.1 Stop
**** v1    0.1 CLI TX|stop
***  v1    0.1 CLI RX  300
**** v1    0.1 CLI RX|Child in state stopped
**** v1    0.1 CLI TX|status
***  v1    0.1 CLI RX  200
**** v1    0.1 CLI RX|Child in state stopped
**** v1    0.1 STDOUT poll 0x10
**   v1    0.1 R 23013 Status: 0000 (u 0.005000 s 0.019000)
*    diag  0.0 ............................................................
#    top  TEST ../../../bin/varnishtest/tests/r01212.vtc TIMED OUT (kill -9)
#    top  TEST ../../../bin/varnishtest/tests/r01212.vtc FAILED (60.002) signal=9

1 @ Linux 3.10.0 x86_64 1.02 mblissett

*    top   0.0 TEST ../../../bin/varnishtest/tests/r01212.vtc starting
[...]
*    top   0.0 TEST #1212 - Vmod with HEADER argument given a STRING asserts the VCL compiler
[...]
**** v1    0.1 CLI TX|\timport std;
**** v1    0.1 CLI TX|\tbackend b { .host = "127.0.0.1"; }
**** v1    0.1 CLI TX|\tsub vcl_recv {
**** v1    0.1 CLI TX|\t\tstd.collect("foo");
**** v1    0.1 CLI TX|\t}
**** v1    0.1 CLI TX|
**** v1    0.1 CLI TX|%XJEIFLH|)Xspa8P
***  v1    0.1 CLI RX  106
**** v1    0.1 CLI RX|Message from VCC-compiler:
**** v1    0.1 CLI RX|Wrong argument type.  Expected HEADER.  Got STRING.
**** v1    0.1 CLI RX|('<vcl.inline>' Line 6 Pos 29) -- ('<vcl.inline>' Line 6 Pos 33)
**** v1    0.1 CLI RX|                std.collect("foo");
**** v1    0.1 CLI RX|----------------------------#####--
**** v1    0.1 CLI RX|
**** v1    0.1 CLI RX|('<vcl.inline>' Line 6 Pos 17) -- ('<vcl.inline>' Line 6 Pos 33)
**** v1    0.1 CLI RX|                std.collect("foo");
**** v1    0.1 CLI RX|----------------#################--
**** v1    0.1 CLI RX|
**** v1    0.1 CLI RX|Running VCC-compiler failed, exited with 2
**** v1    0.1 CLI RX|VCL compilation failed
**   v1    0.1 VCL compilation failed (as expected)
***  v1    0.1 Found expected string: ("Wrong argument type.  Expected HEADER.  Got STRING.")
*    top   0.1 RESETTING after ../../../bin/varnishtest/tests/r01212.vtc
**   v1    0.1 Wait
**** v1    0.1 CLI TX|backend.list
***  v1    0.2 CLI RX  101
**** v1    0.2 CLI RX|Unknown request in manager process (child not running).
**** v1    0.2 CLI RX|Type 'help' for more info.
**   v1    0.2 Stop
**** v1    0.2 CLI TX|stop
***  v1    0.2 CLI RX  300
**** v1    0.2 CLI RX|Child in state stopped
**** v1    0.2 CLI TX|status
***  v1    0.2 CLI RX  200
**** v1    0.2 CLI RX|Child in state stopped
**** v1    0.2 STDOUT poll 0x10
**   v1    0.2 R 5367 Status: 0000 (u 0.002835 s 0.011431)
*    diag  0.0 ............................................................
#    top  TEST ../../../bin/varnishtest/tests/r01212.vtc TIMED OUT (kill -9)
#    top  TEST ../../../bin/varnishtest/tests/r01212.vtc FAILED (60.000) signal=9

1 @ Ubuntu LTS i686 1.04 fgs

*    top   0.0 TEST ../../../bin/varnishtest/tests/r01212.vtc starting
[...]
*    top   0.0 TEST #1212 - Vmod with HEADER argument given a STRING asserts the VCL compiler
[...]
**** v1    0.1 CLI TX|\timport std;
**** v1    0.1 CLI TX|\tbackend b { .host = "127.0.0.1"; }
**** v1    0.1 CLI TX|\tsub vcl_recv {
**** v1    0.1 CLI TX|\t\tstd.collect("foo");
**** v1    0.1 CLI TX|\t}
**** v1    0.1 CLI TX|
**** v1    0.1 CLI TX|%XJEIFLH|)Xspa8P
***  v1    0.1 CLI RX  106
**** v1    0.1 CLI RX|Message from VCC-compiler:
**** v1    0.1 CLI RX|Wrong argument type.  Expected HEADER.  Got STRING.
**** v1    0.1 CLI RX|('<vcl.inline>' Line 6 Pos 29) -- ('<vcl.inline>' Line 6 Pos 33)
**** v1    0.1 CLI RX|                std.collect("foo");
**** v1    0.1 CLI RX|----------------------------#####--
**** v1    0.1 CLI RX|
**** v1    0.1 CLI RX|('<vcl.inline>' Line 6 Pos 17) -- ('<vcl.inline>' Line 6 Pos 33)
**** v1    0.1 CLI RX|                std.collect("foo");
**** v1    0.1 CLI RX|----------------#################--
**** v1    0.1 CLI RX|
**** v1    0.1 CLI RX|Running VCC-compiler failed, exited with 2
**** v1    0.1 CLI RX|VCL compilation failed
**   v1    0.1 VCL compilation failed (as expected)
***  v1    0.1 Found expected string: ("Wrong argument type.  Expected HEADER.  Got STRING.")
*    top   0.1 RESETTING after ../../../bin/varnishtest/tests/r01212.vtc
**   v1    0.1 Wait
**** v1    0.1 CLI TX|backend.list
***  v1    0.1 CLI RX  101
**** v1    0.1 CLI RX|Unknown request in manager process (child not running).
**** v1    0.1 CLI RX|Type 'help' for more info.
**   v1    0.1 Stop
**** v1    0.1 CLI TX|stop
***  v1    0.2 CLI RX  300
**** v1    0.2 CLI RX|Child in state stopped
**** v1    0.2 CLI TX|status
***  v1    0.2 CLI RX  200
**** v1    0.2 CLI RX|Child in state stopped
**** v1    0.2 STDOUT poll 0x10
**   v1    0.2 R 11226 Status: 0000 (u 0.000000 s 0.004000)
*    diag  0.0 ............................................................
#    top  TEST ../../../bin/varnishtest/tests/r01212.vtc TIMED OUT (kill -9)
#    top  TEST ../../../bin/varnishtest/tests/r01212.vtc FAILED (60.001) signal=9

1 @ Ubuntu LTS i686 1.04 fgs

*    top   0.0 TEST ../../../bin/varnishtest/tests/r01212.vtc starting
[...]
*    top   0.0 TEST #1212 - Vmod with HEADER argument given a STRING asserts the VCL compiler
[...]
**** v1    0.1 CLI TX|\timport std;
**** v1    0.1 CLI TX|\tbackend b { .host = "127.0.0.1"; }
**** v1    0.1 CLI TX|\tsub vcl_recv {
**** v1    0.1 CLI TX|\t\tstd.collect("foo");
**** v1    0.1 CLI TX|\t}
**** v1    0.1 CLI TX|
**** v1    0.1 CLI TX|%XJEIFLH|)Xspa8P
***  v1    0.1 CLI RX  106
**** v1    0.1 CLI RX|Message from VCC-compiler:
**** v1    0.1 CLI RX|Wrong argument type.  Expected HEADER.  Got STRING.
**** v1    0.1 CLI RX|('<vcl.inline>' Line 6 Pos 29) -- ('<vcl.inline>' Line 6 Pos 33)
**** v1    0.1 CLI RX|                std.collect("foo");
**** v1    0.1 CLI RX|----------------------------#####--
**** v1    0.1 CLI RX|
**** v1    0.1 CLI RX|('<vcl.inline>' Line 6 Pos 17) -- ('<vcl.inline>' Line 6 Pos 33)
**** v1    0.1 CLI RX|                std.collect("foo");
**** v1    0.1 CLI RX|----------------#################--
**** v1    0.1 CLI RX|
**** v1    0.1 CLI RX|Running VCC-compiler failed, exited with 2
**** v1    0.1 CLI RX|VCL compilation failed
**   v1    0.1 VCL compilation failed (as expected)
***  v1    0.1 Found expected string: ("Wrong argument type.  Expected HEADER.  Got STRING.")
*    top   0.1 RESETTING after ../../../bin/varnishtest/tests/r01212.vtc
**   v1    0.1 Wait
**** v1    0.1 CLI TX|backend.list
***  v1    0.1 CLI RX  101
**** v1    0.1 CLI RX|Unknown request in manager process (child not running).
**** v1    0.1 CLI RX|Type 'help' for more info.
**   v1    0.1 Stop
**** v1    0.1 CLI TX|stop
***  v1    0.2 CLI RX  300
**** v1    0.2 CLI RX|Child in state stopped
**** v1    0.2 CLI TX|status
***  v1    0.2 CLI RX  200
**** v1    0.2 CLI RX|Child in state stopped
**** v1    0.2 STDOUT poll 0x10
**   v1    0.2 R 26036 Status: 0000 (u 0.000000 s 0.004000)
*    diag  0.0 ............................................................
#    top  TEST ../../../bin/varnishtest/tests/r01212.vtc TIMED OUT (kill -9)
#    top  TEST ../../../bin/varnishtest/tests/r01212.vtc FAILED (60.001) signal=9

1 @ SunOS 5.11 i86pc 1.04 64_sun12.4 uplex

*    top   0.0 TEST ../../../bin/varnishtest/tests/r01212.vtc starting
[...]
*    top   0.0 TEST #1212 - Vmod with HEADER argument given a STRING asserts the VCL compiler
[...]
**** v1    0.1 CLI TX|\tbackend b { .host = "127.0.0.1"; }
**** v1    0.1 CLI TX|\tsub vcl_recv {
**** v1    0.1 CLI TX|\t\tstd.collect("foo");
**** v1    0.1 CLI TX|\t}
**** v1    0.1 CLI TX|
**** v1    0.1 CLI TX|%XJEIFLH|)Xspa8P
***  v1    0.1 CLI RX  106
**** v1    0.1 CLI RX|Message from VCC-compiler:
**** v1    0.1 CLI RX|Security: Privilege proc_setid missing, will not change uid/gid
**** v1    0.1 CLI RX|Wrong argument type.  Expected HEADER.  Got STRING.
**** v1    0.1 CLI RX|('<vcl.inline>' Line 6 Pos 29) -- ('<vcl.inline>' Line 6 Pos 33)
**** v1    0.1 CLI RX|                std.collect("foo");
**** v1    0.1 CLI RX|----------------------------#####--
**** v1    0.1 CLI RX|
**** v1    0.1 CLI RX|('<vcl.inline>' Line 6 Pos 17) -- ('<vcl.inline>' Line 6 Pos 33)
**** v1    0.1 CLI RX|                std.collect("foo");
**** v1    0.1 CLI RX|----------------#################--
**** v1    0.1 CLI RX|
**** v1    0.1 CLI RX|Running VCC-compiler failed, exited with 2
**** v1    0.1 CLI RX|VCL compilation failed
**   v1    0.1 VCL compilation failed (as expected)
***  v1    0.1 Found expected string: ("Wrong argument type.  Expected HEADER.  Got STRING.")
*    top   0.1 RESETTING after ../../../bin/varnishtest/tests/r01212.vtc
**   v1    0.1 Wait
**** v1    0.1 CLI TX|backend.list
***  v1    0.1 CLI RX  101
**** v1    0.1 CLI RX|Unknown request in manager process (child not running).
**** v1    0.1 CLI RX|Type 'help' for more info.
**   v1    0.1 Stop
**** v1    0.1 CLI TX|stop
***  v1    0.1 CLI RX  300
**** v1    0.1 CLI RX|Child in state stopped
**** v1    0.1 CLI TX|status
***  v1    0.1 CLI RX  200
**** v1    0.1 CLI RX|Child in state stopped
**** v1    0.1 STDOUT poll 0x10
**   v1    0.1 R 51633 Status: 0000 (u 0.007000 s 0.024000)
*    diag  0.0 ............................................................
#    top  TEST ../../../bin/varnishtest/tests/r01212.vtc TIMED OUT (kill -9)
#    top  TEST ../../../bin/varnishtest/tests/r01212.vtc FAILED (60.004) signal=9

1 @ Ubuntu LTS i686 1.04 fgs

*    top   0.0 TEST ../../../bin/varnishtest/tests/r01212.vtc starting
[...]
*    top   0.0 TEST #1212 - Vmod with HEADER argument given a STRING asserts the VCL compiler
[...]
**** v1    0.1 CLI TX|\timport std;
**** v1    0.1 CLI TX|\tbackend b { .host = "127.0.0.1"; }
**** v1    0.1 CLI TX|\tsub vcl_recv {
**** v1    0.1 CLI TX|\t\tstd.collect("foo");
**** v1    0.1 CLI TX|\t}
**** v1    0.1 CLI TX|
**** v1    0.1 CLI TX|%XJEIFLH|)Xspa8P
***  v1    0.1 CLI RX  106
**** v1    0.1 CLI RX|Message from VCC-compiler:
**** v1    0.1 CLI RX|Wrong argument type.  Expected HEADER.  Got STRING.
**** v1    0.1 CLI RX|('<vcl.inline>' Line 6 Pos 29) -- ('<vcl.inline>' Line 6 Pos 33)
**** v1    0.1 CLI RX|                std.collect("foo");
**** v1    0.1 CLI RX|----------------------------#####--
**** v1    0.1 CLI RX|
**** v1    0.1 CLI RX|('<vcl.inline>' Line 6 Pos 17) -- ('<vcl.inline>' Line 6 Pos 33)
**** v1    0.1 CLI RX|                std.collect("foo");
**** v1    0.1 CLI RX|----------------#################--
**** v1    0.1 CLI RX|
**** v1    0.1 CLI RX|Running VCC-compiler failed, exited with 2
**** v1    0.1 CLI RX|VCL compilation failed
**   v1    0.1 VCL compilation failed (as expected)
***  v1    0.1 Found expected string: ("Wrong argument type.  Expected HEADER.  Got STRING.")
*    top   0.1 RESETTING after ../../../bin/varnishtest/tests/r01212.vtc
**   v1    0.1 Wait
**** v1    0.1 CLI TX|backend.list
***  v1    0.1 CLI RX  101
**** v1    0.1 CLI RX|Unknown request in manager process (child not running).
**** v1    0.1 CLI RX|Type 'help' for more info.
**   v1    0.1 Stop
**** v1    0.1 CLI TX|stop
***  v1    0.2 CLI RX  300
**** v1    0.2 CLI RX|Child in state stopped
**** v1    0.2 CLI TX|status
***  v1    0.2 CLI RX  200
**** v1    0.2 CLI RX|Child in state stopped
**** v1    0.2 STDOUT poll 0x10
**   v1    0.2 R 12285 Status: 0000 (u 0.000000 s 0.008000)
*    diag  0.0 ............................................................
#    top  TEST ../../../bin/varnishtest/tests/r01212.vtc TIMED OUT (kill -9)
#    top  TEST ../../../bin/varnishtest/tests/r01212.vtc FAILED (60.001) signal=9

1 @ Ubuntu LTS i686 1.04 fgs

*    top   0.0 TEST ../../../bin/varnishtest/tests/r01212.vtc starting
[...]
*    top   0.0 TEST #1212 - Vmod with HEADER argument given a STRING asserts the VCL compiler
[...]
**** v1    0.1 CLI TX|\timport std;
**** v1    0.1 CLI TX|\tbackend b { .host = "127.0.0.1"; }
**** v1    0.1 CLI TX|\tsub vcl_recv {
**** v1    0.1 CLI TX|\t\tstd.collect("foo");
**** v1    0.1 CLI TX|\t}
**** v1    0.1 CLI TX|
**** v1    0.1 CLI TX|%XJEIFLH|)Xspa8P
***  v1    0.1 CLI RX  106
**** v1    0.1 CLI RX|Message from VCC-compiler:
**** v1    0.1 CLI RX|Wrong argument type.  Expected HEADER.  Got STRING.
**** v1    0.1 CLI RX|('<vcl.inline>' Line 6 Pos 29) -- ('<vcl.inline>' Line 6 Pos 33)
**** v1    0.1 CLI RX|                std.collect("foo");
**** v1    0.1 CLI RX|----------------------------#####--
**** v1    0.1 CLI RX|
**** v1    0.1 CLI RX|('<vcl.inline>' Line 6 Pos 17) -- ('<vcl.inline>' Line 6 Pos 33)
**** v1    0.1 CLI RX|                std.collect("foo");
**** v1    0.1 CLI RX|----------------#################--
**** v1    0.1 CLI RX|
**** v1    0.1 CLI RX|Running VCC-compiler failed, exited with 2
**** v1    0.1 CLI RX|VCL compilation failed
**   v1    0.1 VCL compilation failed (as expected)
***  v1    0.1 Found expected string: ("Wrong argument type.  Expected HEADER.  Got STRING.")
*    top   0.1 RESETTING after ../../../bin/varnishtest/tests/r01212.vtc
**   v1    0.1 Wait
**** v1    0.1 CLI TX|backend.list
***  v1    0.1 CLI RX  101
**** v1    0.1 CLI RX|Unknown request in manager process (child not running).
**** v1    0.1 CLI RX|Type 'help' for more info.
**   v1    0.1 Stop
**** v1    0.1 CLI TX|stop
***  v1    0.2 CLI RX  300
**** v1    0.2 CLI RX|Child in state stopped
**** v1    0.2 CLI TX|status
***  v1    0.2 CLI RX  200
**** v1    0.2 CLI RX|Child in state stopped
**** v1    0.2 STDOUT poll 0x10
**   v1    0.2 R 20138 Status: 0000 (u 0.004000 s 0.000000)
*    diag  0.0 ............................................................
#    top  TEST ../../../bin/varnishtest/tests/r01212.vtc TIMED OUT (kill -9)
#    top  TEST ../../../bin/varnishtest/tests/r01212.vtc FAILED (60.001) signal=9

1 @ Ubuntu LTS i686 1.04 fgs

*    top   0.0 TEST ../../../bin/varnishtest/tests/r01212.vtc starting
[...]
*    top   0.0 TEST #1212 - Vmod with HEADER argument given a STRING asserts the VCL compiler
[...]
**** v1    0.1 CLI TX|\timport std;
**** v1    0.1 CLI TX|\tbackend b { .host = "127.0.0.1"; }
**** v1    0.1 CLI TX|\tsub vcl_recv {
**** v1    0.1 CLI TX|\t\tstd.collect("foo");
**** v1    0.1 CLI TX|\t}
**** v1    0.1 CLI TX|
**** v1    0.1 CLI TX|%XJEIFLH|)Xspa8P
***  v1    0.1 CLI RX  106
**** v1    0.1 CLI RX|Message from VCC-compiler:
**** v1    0.1 CLI RX|Wrong argument type.  Expected HEADER.  Got STRING.
**** v1    0.1 CLI RX|('<vcl.inline>' Line 6 Pos 29) -- ('<vcl.inline>' Line 6 Pos 33)
**** v1    0.1 CLI RX|                std.collect("foo");
**** v1    0.1 CLI RX|----------------------------#####--
**** v1    0.1 CLI RX|
**** v1    0.1 CLI RX|('<vcl.inline>' Line 6 Pos 17) -- ('<vcl.inline>' Line 6 Pos 33)
**** v1    0.1 CLI RX|                std.collect("foo");
**** v1    0.1 CLI RX|----------------#################--
**** v1    0.1 CLI RX|
**** v1    0.1 CLI RX|Running VCC-compiler failed, exited with 2
**** v1    0.1 CLI RX|VCL compilation failed
**   v1    0.1 VCL compilation failed (as expected)
***  v1    0.1 Found expected string: ("Wrong argument type.  Expected HEADER.  Got STRING.")
*    top   0.1 RESETTING after ../../../bin/varnishtest/tests/r01212.vtc
**   v1    0.1 Wait
**** v1    0.1 CLI TX|backend.list
***  v1    0.1 CLI RX  101
**** v1    0.1 CLI RX|Unknown request in manager process (child not running).
**** v1    0.1 CLI RX|Type 'help' for more info.
**   v1    0.1 Stop
**** v1    0.1 CLI TX|stop
***  v1    0.2 CLI RX  300
**** v1    0.2 CLI RX|Child in state stopped
**** v1    0.2 CLI TX|status
***  v1    0.2 CLI RX  200
**** v1    0.2 CLI RX|Child in state stopped
**** v1    0.2 STDOUT poll 0x10
**   v1    0.2 R 9074 Status: 0000 (u 0.000000 s 0.004000)
*    diag  0.0 ............................................................
#    top  TEST ../../../bin/varnishtest/tests/r01212.vtc TIMED OUT (kill -9)
#    top  TEST ../../../bin/varnishtest/tests/r01212.vtc FAILED (60.001) signal=9

1 @ Linux 3.10.0 x86_64 1.02 mblissett

*    top   0.0 TEST ../../../bin/varnishtest/tests/r01212.vtc starting
[...]
*    top   0.0 TEST #1212 - Vmod with HEADER argument given a STRING asserts the VCL compiler
[...]
**** v1    0.1 CLI TX|\timport std;
**** v1    0.1 CLI TX|\tbackend b { .host = "127.0.0.1"; }
**** v1    0.1 CLI TX|\tsub vcl_recv {
**** v1    0.1 CLI TX|\t\tstd.collect("foo");
**** v1    0.1 CLI TX|\t}
**** v1    0.1 CLI TX|
**** v1    0.1 CLI TX|%XJEIFLH|)Xspa8P
***  v1    0.1 CLI RX  106
**** v1    0.1 CLI RX|Message from VCC-compiler:
**** v1    0.1 CLI RX|Wrong argument type.  Expected HEADER.  Got STRING.
**** v1    0.1 CLI RX|('<vcl.inline>' Line 6 Pos 29) -- ('<vcl.inline>' Line 6 Pos 33)
**** v1    0.1 CLI RX|                std.collect("foo");
**** v1    0.1 CLI RX|----------------------------#####--
**** v1    0.1 CLI RX|
**** v1    0.1 CLI RX|('<vcl.inline>' Line 6 Pos 17) -- ('<vcl.inline>' Line 6 Pos 33)
**** v1    0.1 CLI RX|                std.collect("foo");
**** v1    0.1 CLI RX|----------------#################--
**** v1    0.1 CLI RX|
**** v1    0.1 CLI RX|Running VCC-compiler failed, exited with 2
**** v1    0.1 CLI RX|VCL compilation failed
**   v1    0.1 VCL compilation failed (as expected)
***  v1    0.1 Found expected string: ("Wrong argument type.  Expected HEADER.  Got STRING.")
*    top   0.1 RESETTING after ../../../bin/varnishtest/tests/r01212.vtc
**   v1    0.1 Wait
**** v1    0.1 CLI TX|backend.list
***  v1    0.2 CLI RX  101
**** v1    0.2 CLI RX|Unknown request in manager process (child not running).
**** v1    0.2 CLI RX|Type 'help' for more info.
**   v1    0.2 Stop
**** v1    0.2 CLI TX|stop
***  v1    0.2 CLI RX  300
**** v1    0.2 CLI RX|Child in state stopped
**** v1    0.2 CLI TX|status
***  v1    0.2 CLI RX  200
**** v1    0.2 CLI RX|Child in state stopped
**** v1    0.2 STDOUT poll 0x10
**   v1    0.2 R 21953 Status: 0000 (u 0.004972 s 0.017307)
*    diag  0.0 ............................................................
#    top  TEST ../../../bin/varnishtest/tests/r01212.vtc TIMED OUT (kill -9)
#    top  TEST ../../../bin/varnishtest/tests/r01212.vtc FAILED (60.001) signal=9

1 @ SunOS 5.11 i86pc 1.04 32_sun12.4 uplex

*    top   0.0 TEST ../../../bin/varnishtest/tests/r01212.vtc starting
[...]
*    top   0.0 TEST #1212 - Vmod with HEADER argument given a STRING asserts the VCL compiler
[...]
**** v1    0.1 CLI TX|\tbackend b { .host = "127.0.0.1"; }
**** v1    0.1 CLI TX|\tsub vcl_recv {
**** v1    0.1 CLI TX|\t\tstd.collect("foo");
**** v1    0.1 CLI TX|\t}
**** v1    0.1 CLI TX|
**** v1    0.1 CLI TX|%XJEIFLH|)Xspa8P
***  v1    0.1 CLI RX  106
**** v1    0.1 CLI RX|Message from VCC-compiler:
**** v1    0.1 CLI RX|Security: Privilege proc_setid missing, will not change uid/gid
**** v1    0.1 CLI RX|Wrong argument type.  Expected HEADER.  Got STRING.
**** v1    0.1 CLI RX|('<vcl.inline>' Line 6 Pos 29) -- ('<vcl.inline>' Line 6 Pos 33)
**** v1    0.1 CLI RX|                std.collect("foo");
**** v1    0.1 CLI RX|----------------------------#####--
**** v1    0.1 CLI RX|
**** v1    0.1 CLI RX|('<vcl.inline>' Line 6 Pos 17) -- ('<vcl.inline>' Line 6 Pos 33)
**** v1    0.1 CLI RX|                std.collect("foo");
**** v1    0.1 CLI RX|----------------#################--
**** v1    0.1 CLI RX|
**** v1    0.1 CLI RX|Running VCC-compiler failed, exited with 2
**** v1    0.1 CLI RX|VCL compilation failed
**   v1    0.1 VCL compilation failed (as expected)
***  v1    0.1 Found expected string: ("Wrong argument type.  Expected HEADER.  Got STRING.")
*    top   0.1 RESETTING after ../../../bin/varnishtest/tests/r01212.vtc
**   v1    0.1 Wait
**** v1    0.1 CLI TX|backend.list
***  v1    0.1 CLI RX  101
**** v1    0.1 CLI RX|Unknown request in manager process (child not running).
**** v1    0.1 CLI RX|Type 'help' for more info.
**   v1    0.1 Stop
**** v1    0.1 CLI TX|stop
***  v1    0.1 CLI RX  300
**** v1    0.1 CLI RX|Child in state stopped
**** v1    0.1 CLI TX|status
***  v1    0.1 CLI RX  200
**** v1    0.1 CLI RX|Child in state stopped
**** v1    0.1 STDOUT poll 0x10
**   v1    0.1 R 15198 Status: 0000 (u 0.005000 s 0.018000)
*    diag  0.0 ............................................................
#    top  TEST ../../../bin/varnishtest/tests/r01212.vtc TIMED OUT (kill -9)
#    top  TEST ../../../bin/varnishtest/tests/r01212.vtc FAILED (60.002) signal=9

1 @ SunOS 5.11 i86pc 1.04 32_sun12.4 uplex

*    top   0.0 TEST ../../../bin/varnishtest/tests/r01212.vtc starting
[...]
*    top   0.0 TEST #1212 - Vmod with HEADER argument given a STRING asserts the VCL compiler
[...]
**** v1    0.1 CLI TX|\tbackend b { .host = "127.0.0.1"; }
**** v1    0.1 CLI TX|\tsub vcl_recv {
**** v1    0.1 CLI TX|\t\tstd.collect("foo");
**** v1    0.1 CLI TX|\t}
**** v1    0.1 CLI TX|
**** v1    0.1 CLI TX|%XJEIFLH|)Xspa8P
***  v1    0.1 CLI RX  106
**** v1    0.1 CLI RX|Message from VCC-compiler:
**** v1    0.1 CLI RX|Security: Privilege proc_setid missing, will not change uid/gid
**** v1    0.1 CLI RX|Wrong argument type.  Expected HEADER.  Got STRING.
**** v1    0.1 CLI RX|('<vcl.inline>' Line 6 Pos 29) -- ('<vcl.inline>' Line 6 Pos 33)
**** v1    0.1 CLI RX|                std.collect("foo");
**** v1    0.1 CLI RX|----------------------------#####--
**** v1    0.1 CLI RX|
**** v1    0.1 CLI RX|('<vcl.inline>' Line 6 Pos 17) -- ('<vcl.inline>' Line 6 Pos 33)
**** v1    0.1 CLI RX|                std.collect("foo");
**** v1    0.1 CLI RX|----------------#################--
**** v1    0.1 CLI RX|
**** v1    0.1 CLI RX|Running VCC-compiler failed, exited with 2
**** v1    0.1 CLI RX|VCL compilation failed
**   v1    0.1 VCL compilation failed (as expected)
***  v1    0.1 Found expected string: ("Wrong argument type.  Expected HEADER.  Got STRING.")
*    top   0.1 RESETTING after ../../../bin/varnishtest/tests/r01212.vtc
**   v1    0.1 Wait
**** v1    0.1 CLI TX|backend.list
***  v1    0.1 CLI RX  101
**** v1    0.1 CLI RX|Unknown request in manager process (child not running).
**** v1    0.1 CLI RX|Type 'help' for more info.
**   v1    0.1 Stop
**** v1    0.1 CLI TX|stop
***  v1    0.1 CLI RX  300
**** v1    0.1 CLI RX|Child in state stopped
**** v1    0.1 CLI TX|status
***  v1    0.1 CLI RX  200
**** v1    0.1 CLI RX|Child in state stopped
**** v1    0.1 STDOUT poll 0x10
**   v1    0.1 R 63487 Status: 0000 (u 0.005000 s 0.017000)
*    diag  0.0 ............................................................
#    top  TEST ../../../bin/varnishtest/tests/r01212.vtc TIMED OUT (kill -9)
#    top  TEST ../../../bin/varnishtest/tests/r01212.vtc FAILED (60.002) signal=9