r01510

8bbbdfa

1 @ SunOS 5.11 i86pc 1.04 64_gcc4.7 uplex

*    top   0.0 TEST ../../../bin/varnishtest/tests/r01510.vtc starting
[...]
*    top   0.0 TEST Duplicate object names
[...]
**** v1    0.1 CLI TX|\tsub vcl_init {
**** v1    0.1 CLI TX|\t\tnew first = debug.obj("FOO");
**** v1    0.1 CLI TX|\t}
**** v1    0.1 CLI TX|
**** v1    0.1 CLI TX|%XJEIFLH|)Xspa8P
***  v1    0.1 CLI RX  106
**** v1    0.1 CLI RX|Message from VCC-compiler:
**** v1    0.1 CLI RX|Security: Privilege proc_setid missing, will not change uid/gid
**** v1    0.1 CLI RX|Name 'first' already defined.
**** v1    0.1 CLI RX|('<vcl.inline>' Line 8 Pos 21)
**** v1    0.1 CLI RX|                new first = debug.obj("FOO");
**** v1    0.1 CLI RX|--------------------#####--------------------
**** v1    0.1 CLI RX|
**** v1    0.1 CLI RX|First definition:
**** v1    0.1 CLI RX|('<vcl.inline>' Line 5 Pos 17)
**** v1    0.1 CLI RX|        backend first { .host = "127.0.0.1"; }
**** v1    0.1 CLI RX|----------------#####-------------------------
**** v1    0.1 CLI RX|
**** v1    0.1 CLI RX|Running VCC-compiler failed, exited with 2
**** v1    0.1 CLI RX|VCL compilation failed
**   v1    0.1 VCL compilation failed (as expected)
***  v1    0.1 Found expected string: ("Name 'first' already defined.")
*    top   0.1 RESETTING after ../../../bin/varnishtest/tests/r01510.vtc
**   v1    0.1 Wait
**** v1    0.1 CLI TX|backend.list
***  v1    0.1 CLI RX  101
**** v1    0.1 CLI RX|Unknown request in manager process (child not running).
**** v1    0.1 CLI RX|Type 'help' for more info.
**   v1    0.1 Stop
**** v1    0.1 CLI TX|stop
***  v1    0.1 CLI RX  300
**** v1    0.1 CLI RX|Child in state stopped
**** v1    0.1 CLI TX|status
***  v1    0.1 CLI RX  200
**** v1    0.1 CLI RX|Child in state stopped
**** v1    0.2 STDOUT poll 0x10
**   v1    0.2 R 52376 Status: 0000 (u 0.009000 s 0.030000)
*    diag  0.0 ............................................................
#    top  TEST ../../../bin/varnishtest/tests/r01510.vtc TIMED OUT (kill -9)
#    top  TEST ../../../bin/varnishtest/tests/r01510.vtc FAILED (60.004) signal=9

1 @ SunOS 5.11 i86pc 1.04 32_sun12.4 uplex

*    top   0.0 TEST ../../../bin/varnishtest/tests/r01510.vtc starting
[...]
*    top   0.0 TEST Duplicate object names
[...]
**** v1    0.1 CLI TX|\tsub vcl_init {
**** v1    0.1 CLI TX|\t\tnew first = debug.obj("FOO");
**** v1    0.1 CLI TX|\t}
**** v1    0.1 CLI TX|
**** v1    0.1 CLI TX|%XJEIFLH|)Xspa8P
***  v1    0.1 CLI RX  106
**** v1    0.1 CLI RX|Message from VCC-compiler:
**** v1    0.1 CLI RX|Security: Privilege proc_setid missing, will not change uid/gid
**** v1    0.1 CLI RX|Name 'first' already defined.
**** v1    0.1 CLI RX|('<vcl.inline>' Line 8 Pos 21)
**** v1    0.1 CLI RX|                new first = debug.obj("FOO");
**** v1    0.1 CLI RX|--------------------#####--------------------
**** v1    0.1 CLI RX|
**** v1    0.1 CLI RX|First definition:
**** v1    0.1 CLI RX|('<vcl.inline>' Line 5 Pos 17)
**** v1    0.1 CLI RX|        backend first { .host = "127.0.0.1"; }
**** v1    0.1 CLI RX|----------------#####-------------------------
**** v1    0.1 CLI RX|
**** v1    0.1 CLI RX|Running VCC-compiler failed, exited with 2
**** v1    0.1 CLI RX|VCL compilation failed
**   v1    0.1 VCL compilation failed (as expected)
***  v1    0.1 Found expected string: ("Name 'first' already defined.")
*    top   0.1 RESETTING after ../../../bin/varnishtest/tests/r01510.vtc
**   v1    0.1 Wait
**** v1    0.1 CLI TX|backend.list
***  v1    0.1 CLI RX  101
**** v1    0.1 CLI RX|Unknown request in manager process (child not running).
**** v1    0.1 CLI RX|Type 'help' for more info.
**   v1    0.1 Stop
**** v1    0.1 CLI TX|stop
***  v1    0.1 CLI RX  300
**** v1    0.1 CLI RX|Child in state stopped
**** v1    0.1 CLI TX|status
***  v1    0.1 CLI RX  200
**** v1    0.1 CLI RX|Child in state stopped
**** v1    0.1 STDOUT poll 0x10
**   v1    0.1 R 69207 Status: 0000 (u 0.005000 s 0.019000)
*    diag  0.0 ............................................................
#    top  TEST ../../../bin/varnishtest/tests/r01510.vtc TIMED OUT (kill -9)
#    top  TEST ../../../bin/varnishtest/tests/r01510.vtc FAILED (60.002) signal=9

1 @ SunOS 5.11 i86pc 1.04 64_sun12.4 uplex

*    top   0.0 TEST ../../../bin/varnishtest/tests/r01510.vtc starting
[...]
*    top   0.0 TEST Duplicate object names
[...]
**** v1    0.2 CLI TX|\tsub vcl_init {
**** v1    0.2 CLI TX|\t\tnew first = debug.obj("FOO");
**** v1    0.2 CLI TX|\t}
**** v1    0.2 CLI TX|
**** v1    0.2 CLI TX|%XJEIFLH|)Xspa8P
***  v1    0.2 CLI RX  106
**** v1    0.2 CLI RX|Message from VCC-compiler:
**** v1    0.2 CLI RX|Security: Privilege proc_setid missing, will not change uid/gid
**** v1    0.2 CLI RX|Name 'first' already defined.
**** v1    0.2 CLI RX|('<vcl.inline>' Line 8 Pos 21)
**** v1    0.2 CLI RX|                new first = debug.obj("FOO");
**** v1    0.2 CLI RX|--------------------#####--------------------
**** v1    0.2 CLI RX|
**** v1    0.2 CLI RX|First definition:
**** v1    0.2 CLI RX|('<vcl.inline>' Line 5 Pos 17)
**** v1    0.2 CLI RX|        backend first { .host = "127.0.0.1"; }
**** v1    0.2 CLI RX|----------------#####-------------------------
**** v1    0.2 CLI RX|
**** v1    0.2 CLI RX|Running VCC-compiler failed, exited with 2
**** v1    0.2 CLI RX|VCL compilation failed
**   v1    0.2 VCL compilation failed (as expected)
***  v1    0.2 Found expected string: ("Name 'first' already defined.")
*    top   0.2 RESETTING after ../../../bin/varnishtest/tests/r01510.vtc
**   v1    0.2 Wait
**** v1    0.2 CLI TX|backend.list
***  v1    0.2 CLI RX  101
**** v1    0.2 CLI RX|Unknown request in manager process (child not running).
**** v1    0.2 CLI RX|Type 'help' for more info.
**   v1    0.2 Stop
**** v1    0.2 CLI TX|stop
***  v1    0.2 CLI RX  300
**** v1    0.2 CLI RX|Child in state stopped
**** v1    0.2 CLI TX|status
***  v1    0.2 CLI RX  200
**** v1    0.2 CLI RX|Child in state stopped
**** v1    0.2 STDOUT poll 0x10
**   v1    0.2 R 61217 Status: 0000 (u 0.011000 s 0.031000)
*    diag  0.0 ............................................................
#    top  TEST ../../../bin/varnishtest/tests/r01510.vtc TIMED OUT (kill -9)
#    top  TEST ../../../bin/varnishtest/tests/r01510.vtc FAILED (60.004) signal=9

1 @ SunOS 5.11 i86pc 1.04 32_sun12.4 uplex

*    top   0.0 TEST ../../../bin/varnishtest/tests/r01510.vtc starting
[...]
*    top   0.0 TEST Duplicate object names
[...]
**** v1    0.1 CLI TX|\tsub vcl_init {
**** v1    0.1 CLI TX|\t\tnew first = debug.obj("FOO");
**** v1    0.1 CLI TX|\t}
**** v1    0.1 CLI TX|
**** v1    0.1 CLI TX|%XJEIFLH|)Xspa8P
***  v1    0.1 CLI RX  106
**** v1    0.1 CLI RX|Message from VCC-compiler:
**** v1    0.1 CLI RX|Security: Privilege proc_setid missing, will not change uid/gid
**** v1    0.1 CLI RX|Name 'first' already defined.
**** v1    0.1 CLI RX|('<vcl.inline>' Line 8 Pos 21)
**** v1    0.1 CLI RX|                new first = debug.obj("FOO");
**** v1    0.1 CLI RX|--------------------#####--------------------
**** v1    0.1 CLI RX|
**** v1    0.1 CLI RX|First definition:
**** v1    0.1 CLI RX|('<vcl.inline>' Line 5 Pos 17)
**** v1    0.1 CLI RX|        backend first { .host = "127.0.0.1"; }
**** v1    0.1 CLI RX|----------------#####-------------------------
**** v1    0.1 CLI RX|
**** v1    0.1 CLI RX|Running VCC-compiler failed, exited with 2
**** v1    0.1 CLI RX|VCL compilation failed
**   v1    0.1 VCL compilation failed (as expected)
***  v1    0.1 Found expected string: ("Name 'first' already defined.")
*    top   0.1 RESETTING after ../../../bin/varnishtest/tests/r01510.vtc
**   v1    0.1 Wait
**** v1    0.1 CLI TX|backend.list
***  v1    0.1 CLI RX  101
**** v1    0.1 CLI RX|Unknown request in manager process (child not running).
**** v1    0.1 CLI RX|Type 'help' for more info.
**   v1    0.1 Stop
**** v1    0.1 CLI TX|stop
***  v1    0.1 CLI RX  300
**** v1    0.1 CLI RX|Child in state stopped
**** v1    0.1 CLI TX|status
***  v1    0.1 CLI RX  200
**** v1    0.1 CLI RX|Child in state stopped
**** v1    0.1 STDOUT poll 0x10
**   v1    0.1 R 95227 Status: 0000 (u 0.005000 s 0.018000)
*    diag  0.0 ............................................................
#    top  TEST ../../../bin/varnishtest/tests/r01510.vtc TIMED OUT (kill -9)
#    top  TEST ../../../bin/varnishtest/tests/r01510.vtc FAILED (60.002) signal=9

1 @ SunOS 5.11 i86pc 1.04 64_gcc4.7 uplex

*    top   0.0 TEST ../../../bin/varnishtest/tests/r01510.vtc starting
[...]
*    top   0.0 TEST Duplicate object names
[...]
**** v1    0.1 CLI TX|\tsub vcl_init {
**** v1    0.1 CLI TX|\t\tnew first = debug.obj("FOO");
**** v1    0.1 CLI TX|\t}
**** v1    0.1 CLI TX|
**** v1    0.1 CLI TX|%XJEIFLH|)Xspa8P
***  v1    0.1 CLI RX  106
**** v1    0.1 CLI RX|Message from VCC-compiler:
**** v1    0.1 CLI RX|Security: Privilege proc_setid missing, will not change uid/gid
**** v1    0.1 CLI RX|Name 'first' already defined.
**** v1    0.1 CLI RX|('<vcl.inline>' Line 8 Pos 21)
**** v1    0.1 CLI RX|                new first = debug.obj("FOO");
**** v1    0.1 CLI RX|--------------------#####--------------------
**** v1    0.1 CLI RX|
**** v1    0.1 CLI RX|First definition:
**** v1    0.1 CLI RX|('<vcl.inline>' Line 5 Pos 17)
**** v1    0.1 CLI RX|        backend first { .host = "127.0.0.1"; }
**** v1    0.1 CLI RX|----------------#####-------------------------
**** v1    0.1 CLI RX|
**** v1    0.1 CLI RX|Running VCC-compiler failed, exited with 2
**** v1    0.1 CLI RX|VCL compilation failed
**   v1    0.1 VCL compilation failed (as expected)
***  v1    0.1 Found expected string: ("Name 'first' already defined.")
*    top   0.1 RESETTING after ../../../bin/varnishtest/tests/r01510.vtc
**   v1    0.1 Wait
**** v1    0.1 CLI TX|backend.list
***  v1    0.1 CLI RX  101
**** v1    0.1 CLI RX|Unknown request in manager process (child not running).
**** v1    0.1 CLI RX|Type 'help' for more info.
**   v1    0.1 Stop
**** v1    0.1 CLI TX|stop
***  v1    0.1 CLI RX  300
**** v1    0.1 CLI RX|Child in state stopped
**** v1    0.1 CLI TX|status
***  v1    0.1 CLI RX  200
**** v1    0.1 CLI RX|Child in state stopped
**** v1    0.1 STDOUT poll 0x10
**   v1    0.1 R 6784 Status: 0000 (u 0.008000 s 0.027000)
*    diag  0.0 ............................................................
#    top  TEST ../../../bin/varnishtest/tests/r01510.vtc TIMED OUT (kill -9)
#    top  TEST ../../../bin/varnishtest/tests/r01510.vtc FAILED (60.003) signal=9

1 @ SunOS 5.11 i86pc 1.04 64_sun12.4 uplex

*    top   0.0 TEST ../../../bin/varnishtest/tests/r01510.vtc starting
[...]
*    top   0.0 TEST Duplicate object names
[...]
**** v1    0.1 CLI TX|\tsub vcl_init {
**** v1    0.1 CLI TX|\t\tnew first = debug.obj("FOO");
**** v1    0.1 CLI TX|\t}
**** v1    0.1 CLI TX|
**** v1    0.1 CLI TX|%XJEIFLH|)Xspa8P
***  v1    0.1 CLI RX  106
**** v1    0.1 CLI RX|Message from VCC-compiler:
**** v1    0.1 CLI RX|Security: Privilege proc_setid missing, will not change uid/gid
**** v1    0.1 CLI RX|Name 'first' already defined.
**** v1    0.1 CLI RX|('<vcl.inline>' Line 8 Pos 21)
**** v1    0.1 CLI RX|                new first = debug.obj("FOO");
**** v1    0.1 CLI RX|--------------------#####--------------------
**** v1    0.1 CLI RX|
**** v1    0.1 CLI RX|First definition:
**** v1    0.1 CLI RX|('<vcl.inline>' Line 5 Pos 17)
**** v1    0.1 CLI RX|        backend first { .host = "127.0.0.1"; }
**** v1    0.1 CLI RX|----------------#####-------------------------
**** v1    0.1 CLI RX|
**** v1    0.1 CLI RX|Running VCC-compiler failed, exited with 2
**** v1    0.1 CLI RX|VCL compilation failed
**   v1    0.1 VCL compilation failed (as expected)
***  v1    0.1 Found expected string: ("Name 'first' already defined.")
*    top   0.1 RESETTING after ../../../bin/varnishtest/tests/r01510.vtc
**   v1    0.1 Wait
**** v1    0.1 CLI TX|backend.list
***  v1    0.1 CLI RX  101
**** v1    0.1 CLI RX|Unknown request in manager process (child not running).
**** v1    0.1 CLI RX|Type 'help' for more info.
**   v1    0.1 Stop
**** v1    0.1 CLI TX|stop
***  v1    0.1 CLI RX  300
**** v1    0.1 CLI RX|Child in state stopped
**** v1    0.1 CLI TX|status
***  v1    0.1 CLI RX  200
**** v1    0.1 CLI RX|Child in state stopped
**** v1    0.1 STDOUT poll 0x10
**   v1    0.2 R 58152 Status: 0000 (u 0.008000 s 0.028000)
*    diag  0.0 ............................................................
#    top  TEST ../../../bin/varnishtest/tests/r01510.vtc TIMED OUT (kill -9)
#    top  TEST ../../../bin/varnishtest/tests/r01510.vtc FAILED (60.005) signal=9

1 @ SunOS 5.11 i86pc 1.04 32_sun12.4 uplex

*    top   0.0 TEST ../../../bin/varnishtest/tests/r01510.vtc starting
[...]
*    top   0.0 TEST Duplicate object names
[...]
**** v1    0.1 CLI TX|\tsub vcl_init {
**** v1    0.1 CLI TX|\t\tnew first = debug.obj("FOO");
**** v1    0.1 CLI TX|\t}
**** v1    0.1 CLI TX|
**** v1    0.1 CLI TX|%XJEIFLH|)Xspa8P
***  v1    0.1 CLI RX  106
**** v1    0.1 CLI RX|Message from VCC-compiler:
**** v1    0.1 CLI RX|Security: Privilege proc_setid missing, will not change uid/gid
**** v1    0.1 CLI RX|Name 'first' already defined.
**** v1    0.1 CLI RX|('<vcl.inline>' Line 8 Pos 21)
**** v1    0.1 CLI RX|                new first = debug.obj("FOO");
**** v1    0.1 CLI RX|--------------------#####--------------------
**** v1    0.1 CLI RX|
**** v1    0.1 CLI RX|First definition:
**** v1    0.1 CLI RX|('<vcl.inline>' Line 5 Pos 17)
**** v1    0.1 CLI RX|        backend first { .host = "127.0.0.1"; }
**** v1    0.1 CLI RX|----------------#####-------------------------
**** v1    0.1 CLI RX|
**** v1    0.1 CLI RX|Running VCC-compiler failed, exited with 2
**** v1    0.1 CLI RX|VCL compilation failed
**   v1    0.1 VCL compilation failed (as expected)
***  v1    0.1 Found expected string: ("Name 'first' already defined.")
*    top   0.1 RESETTING after ../../../bin/varnishtest/tests/r01510.vtc
**   v1    0.1 Wait
**** v1    0.1 CLI TX|backend.list
***  v1    0.1 CLI RX  101
**** v1    0.1 CLI RX|Unknown request in manager process (child not running).
**** v1    0.1 CLI RX|Type 'help' for more info.
**   v1    0.1 Stop
**** v1    0.1 CLI TX|stop
***  v1    0.1 CLI RX  300
**** v1    0.1 CLI RX|Child in state stopped
**** v1    0.1 CLI TX|status
***  v1    0.1 CLI RX  200
**** v1    0.1 CLI RX|Child in state stopped
**** v1    0.1 STDOUT poll 0x10
**   v1    0.1 R 90709 Status: 0000 (u 0.005000 s 0.020000)
*    diag  0.0 ............................................................
#    top  TEST ../../../bin/varnishtest/tests/r01510.vtc TIMED OUT (kill -9)
#    top  TEST ../../../bin/varnishtest/tests/r01510.vtc FAILED (60.002) signal=9

1 @ SunOS 5.11 i86pc 1.04 64_gcc4.7 uplex

*    top   0.0 TEST ../../../bin/varnishtest/tests/r01510.vtc starting
[...]
*    top   0.0 TEST Duplicate object names
[...]
**** v1    0.1 CLI TX|\tsub vcl_init {
**** v1    0.1 CLI TX|\t\tnew first = debug.obj("FOO");
**** v1    0.1 CLI TX|\t}
**** v1    0.1 CLI TX|
**** v1    0.1 CLI TX|%XJEIFLH|)Xspa8P
***  v1    0.1 CLI RX  106
**** v1    0.1 CLI RX|Message from VCC-compiler:
**** v1    0.1 CLI RX|Security: Privilege proc_setid missing, will not change uid/gid
**** v1    0.1 CLI RX|Name 'first' already defined.
**** v1    0.1 CLI RX|('<vcl.inline>' Line 8 Pos 21)
**** v1    0.1 CLI RX|                new first = debug.obj("FOO");
**** v1    0.1 CLI RX|--------------------#####--------------------
**** v1    0.1 CLI RX|
**** v1    0.1 CLI RX|First definition:
**** v1    0.1 CLI RX|('<vcl.inline>' Line 5 Pos 17)
**** v1    0.1 CLI RX|        backend first { .host = "127.0.0.1"; }
**** v1    0.1 CLI RX|----------------#####-------------------------
**** v1    0.1 CLI RX|
**** v1    0.1 CLI RX|Running VCC-compiler failed, exited with 2
**** v1    0.1 CLI RX|VCL compilation failed
**   v1    0.1 VCL compilation failed (as expected)
***  v1    0.1 Found expected string: ("Name 'first' already defined.")
*    top   0.1 RESETTING after ../../../bin/varnishtest/tests/r01510.vtc
**   v1    0.1 Wait
**** v1    0.1 CLI TX|backend.list
***  v1    0.1 CLI RX  101
**** v1    0.1 CLI RX|Unknown request in manager process (child not running).
**** v1    0.1 CLI RX|Type 'help' for more info.
**   v1    0.1 Stop
**** v1    0.1 CLI TX|stop
***  v1    0.1 CLI RX  300
**** v1    0.1 CLI RX|Child in state stopped
**** v1    0.1 CLI TX|status
***  v1    0.1 CLI RX  200
**** v1    0.1 CLI RX|Child in state stopped
**** v1    0.1 STDOUT poll 0x10
**   v1    0.1 R 31259 Status: 0000 (u 0.008000 s 0.026000)
*    diag  0.0 ............................................................
#    top  TEST ../../../bin/varnishtest/tests/r01510.vtc TIMED OUT (kill -9)
#    top  TEST ../../../bin/varnishtest/tests/r01510.vtc FAILED (60.004) signal=9

1 @ SunOS 5.11 i86pc 1.04 64_gcc4.7 uplex

*    top   0.0 TEST ../../../bin/varnishtest/tests/r01510.vtc starting
[...]
*    top   0.0 TEST Duplicate object names
[...]
**** v1    0.1 CLI TX|\tsub vcl_init {
**** v1    0.1 CLI TX|\t\tnew first = debug.obj("FOO");
**** v1    0.1 CLI TX|\t}
**** v1    0.1 CLI TX|
**** v1    0.1 CLI TX|%XJEIFLH|)Xspa8P
***  v1    0.1 CLI RX  106
**** v1    0.1 CLI RX|Message from VCC-compiler:
**** v1    0.1 CLI RX|Security: Privilege proc_setid missing, will not change uid/gid
**** v1    0.1 CLI RX|Name 'first' already defined.
**** v1    0.1 CLI RX|('<vcl.inline>' Line 8 Pos 21)
**** v1    0.1 CLI RX|                new first = debug.obj("FOO");
**** v1    0.1 CLI RX|--------------------#####--------------------
**** v1    0.1 CLI RX|
**** v1    0.1 CLI RX|First definition:
**** v1    0.1 CLI RX|('<vcl.inline>' Line 5 Pos 17)
**** v1    0.1 CLI RX|        backend first { .host = "127.0.0.1"; }
**** v1    0.1 CLI RX|----------------#####-------------------------
**** v1    0.1 CLI RX|
**** v1    0.1 CLI RX|Running VCC-compiler failed, exited with 2
**** v1    0.1 CLI RX|VCL compilation failed
**   v1    0.1 VCL compilation failed (as expected)
***  v1    0.1 Found expected string: ("Name 'first' already defined.")
*    top   0.1 RESETTING after ../../../bin/varnishtest/tests/r01510.vtc
**   v1    0.1 Wait
**** v1    0.1 CLI TX|backend.list
***  v1    0.1 CLI RX  101
**** v1    0.1 CLI RX|Unknown request in manager process (child not running).
**** v1    0.1 CLI RX|Type 'help' for more info.
**   v1    0.1 Stop
**** v1    0.1 CLI TX|stop
***  v1    0.1 CLI RX  300
**** v1    0.1 CLI RX|Child in state stopped
**** v1    0.1 CLI TX|status
***  v1    0.1 CLI RX  200
**** v1    0.1 CLI RX|Child in state stopped
**** v1    0.1 STDOUT poll 0x10
**   v1    0.1 R 89268 Status: 0000 (u 0.008000 s 0.027000)
*    diag  0.0 ............................................................
#    top  TEST ../../../bin/varnishtest/tests/r01510.vtc TIMED OUT (kill -9)
#    top  TEST ../../../bin/varnishtest/tests/r01510.vtc FAILED (60.004) signal=9

1 @ SunOS 5.11 i86pc 1.04 64_gcc4.7 uplex

*    top   0.0 TEST ../../../bin/varnishtest/tests/r01510.vtc starting
[...]
*    top   0.0 TEST Duplicate object names
[...]
**** v1    0.1 CLI TX|\tsub vcl_init {
**** v1    0.1 CLI TX|\t\tnew first = debug.obj("FOO");
**** v1    0.1 CLI TX|\t}
**** v1    0.1 CLI TX|
**** v1    0.1 CLI TX|%XJEIFLH|)Xspa8P
***  v1    0.1 CLI RX  106
**** v1    0.1 CLI RX|Message from VCC-compiler:
**** v1    0.1 CLI RX|Security: Privilege proc_setid missing, will not change uid/gid
**** v1    0.1 CLI RX|Name 'first' already defined.
**** v1    0.1 CLI RX|('<vcl.inline>' Line 8 Pos 21)
**** v1    0.1 CLI RX|                new first = debug.obj("FOO");
**** v1    0.1 CLI RX|--------------------#####--------------------
**** v1    0.1 CLI RX|
**** v1    0.1 CLI RX|First definition:
**** v1    0.1 CLI RX|('<vcl.inline>' Line 5 Pos 17)
**** v1    0.1 CLI RX|        backend first { .host = "127.0.0.1"; }
**** v1    0.1 CLI RX|----------------#####-------------------------
**** v1    0.1 CLI RX|
**** v1    0.1 CLI RX|Running VCC-compiler failed, exited with 2
**** v1    0.1 CLI RX|VCL compilation failed
**   v1    0.1 VCL compilation failed (as expected)
***  v1    0.1 Found expected string: ("Name 'first' already defined.")
*    top   0.1 RESETTING after ../../../bin/varnishtest/tests/r01510.vtc
**   v1    0.1 Wait
**** v1    0.1 CLI TX|backend.list
***  v1    0.1 CLI RX  101
**** v1    0.1 CLI RX|Unknown request in manager process (child not running).
**** v1    0.1 CLI RX|Type 'help' for more info.
**   v1    0.1 Stop
**** v1    0.1 CLI TX|stop
***  v1    0.1 CLI RX  300
**** v1    0.1 CLI RX|Child in state stopped
**** v1    0.1 CLI TX|status
***  v1    0.1 CLI RX  200
**** v1    0.1 CLI RX|Child in state stopped
**** v1    0.1 STDOUT poll 0x10
**   v1    0.1 R 86654 Status: 0000 (u 0.008000 s 0.027000)
*    diag  0.0 ............................................................
#    top  TEST ../../../bin/varnishtest/tests/r01510.vtc TIMED OUT (kill -9)
#    top  TEST ../../../bin/varnishtest/tests/r01510.vtc FAILED (60.003) signal=9

1 @ SunOS 5.11 i86pc 1.04 32_sun12.4 uplex

*    top   0.0 TEST ../../../bin/varnishtest/tests/r01510.vtc starting
[...]
*    top   0.0 TEST Duplicate object names
[...]
**** v1    0.1 CLI TX|\tsub vcl_init {
**** v1    0.1 CLI TX|\t\tnew first = debug.obj("FOO");
**** v1    0.1 CLI TX|\t}
**** v1    0.1 CLI TX|
**** v1    0.1 CLI TX|%XJEIFLH|)Xspa8P
***  v1    0.1 CLI RX  106
**** v1    0.1 CLI RX|Message from VCC-compiler:
**** v1    0.1 CLI RX|Security: Privilege proc_setid missing, will not change uid/gid
**** v1    0.1 CLI RX|Name 'first' already defined.
**** v1    0.1 CLI RX|('<vcl.inline>' Line 8 Pos 21)
**** v1    0.1 CLI RX|                new first = debug.obj("FOO");
**** v1    0.1 CLI RX|--------------------#####--------------------
**** v1    0.1 CLI RX|
**** v1    0.1 CLI RX|First definition:
**** v1    0.1 CLI RX|('<vcl.inline>' Line 5 Pos 17)
**** v1    0.1 CLI RX|        backend first { .host = "127.0.0.1"; }
**** v1    0.1 CLI RX|----------------#####-------------------------
**** v1    0.1 CLI RX|
**** v1    0.1 CLI RX|Running VCC-compiler failed, exited with 2
**** v1    0.1 CLI RX|VCL compilation failed
**   v1    0.1 VCL compilation failed (as expected)
***  v1    0.1 Found expected string: ("Name 'first' already defined.")
*    top   0.1 RESETTING after ../../../bin/varnishtest/tests/r01510.vtc
**   v1    0.1 Wait
**** v1    0.1 CLI TX|backend.list
***  v1    0.1 CLI RX  101
**** v1    0.1 CLI RX|Unknown request in manager process (child not running).
**** v1    0.1 CLI RX|Type 'help' for more info.
**   v1    0.1 Stop
**** v1    0.1 CLI TX|stop
***  v1    0.1 CLI RX  300
**** v1    0.1 CLI RX|Child in state stopped
**** v1    0.1 CLI TX|status
***  v1    0.1 CLI RX  200
**** v1    0.1 CLI RX|Child in state stopped
**** v1    0.1 STDOUT poll 0x10
**   v1    0.1 R 27017 Status: 0000 (u 0.006000 s 0.020000)
*    diag  0.0 ............................................................
#    top  TEST ../../../bin/varnishtest/tests/r01510.vtc TIMED OUT (kill -9)
#    top  TEST ../../../bin/varnishtest/tests/r01510.vtc FAILED (60.002) signal=9

1 @ SunOS 5.11 i86pc 1.04 64_gcc4.7 uplex

*    top   0.0 TEST ../../../bin/varnishtest/tests/r01510.vtc starting
[...]
*    top   0.0 TEST Duplicate object names
[...]
**** v1    0.2 CLI TX|\tsub vcl_init {
**** v1    0.2 CLI TX|\t\tnew first = debug.obj("FOO");
**** v1    0.2 CLI TX|\t}
**** v1    0.2 CLI TX|
**** v1    0.2 CLI TX|%XJEIFLH|)Xspa8P
***  v1    0.2 CLI RX  106
**** v1    0.2 CLI RX|Message from VCC-compiler:
**** v1    0.2 CLI RX|Security: Privilege proc_setid missing, will not change uid/gid
**** v1    0.2 CLI RX|Name 'first' already defined.
**** v1    0.2 CLI RX|('<vcl.inline>' Line 8 Pos 21)
**** v1    0.2 CLI RX|                new first = debug.obj("FOO");
**** v1    0.2 CLI RX|--------------------#####--------------------
**** v1    0.2 CLI RX|
**** v1    0.2 CLI RX|First definition:
**** v1    0.2 CLI RX|('<vcl.inline>' Line 5 Pos 17)
**** v1    0.2 CLI RX|        backend first { .host = "127.0.0.1"; }
**** v1    0.2 CLI RX|----------------#####-------------------------
**** v1    0.2 CLI RX|
**** v1    0.2 CLI RX|Running VCC-compiler failed, exited with 2
**** v1    0.2 CLI RX|VCL compilation failed
**   v1    0.2 VCL compilation failed (as expected)
***  v1    0.2 Found expected string: ("Name 'first' already defined.")
*    top   0.2 RESETTING after ../../../bin/varnishtest/tests/r01510.vtc
**   v1    0.2 Wait
**** v1    0.2 CLI TX|backend.list
***  v1    0.2 CLI RX  101
**** v1    0.2 CLI RX|Unknown request in manager process (child not running).
**** v1    0.2 CLI RX|Type 'help' for more info.
**   v1    0.2 Stop
**** v1    0.2 CLI TX|stop
***  v1    0.2 CLI RX  300
**** v1    0.2 CLI RX|Child in state stopped
**** v1    0.2 CLI TX|status
***  v1    0.2 CLI RX  200
**** v1    0.2 CLI RX|Child in state stopped
**** v1    0.2 STDOUT poll 0x10
**   v1    0.2 R 91200 Status: 0000 (u 0.014000 s 0.043000)
*    diag  0.0 ............................................................
#    top  TEST ../../../bin/varnishtest/tests/r01510.vtc TIMED OUT (kill -9)
#    top  TEST ../../../bin/varnishtest/tests/r01510.vtc FAILED (60.005) signal=9

1 @ SunOS 5.11 i86pc 1.04 32_sun12.4 uplex

*    top   0.0 TEST ../../../bin/varnishtest/tests/r01510.vtc starting
[...]
*    top   0.0 TEST Duplicate object names
[...]
**** v1    0.1 CLI TX|\tsub vcl_init {
**** v1    0.1 CLI TX|\t\tnew first = debug.obj("FOO");
**** v1    0.1 CLI TX|\t}
**** v1    0.1 CLI TX|
**** v1    0.1 CLI TX|%XJEIFLH|)Xspa8P
***  v1    0.1 CLI RX  106
**** v1    0.1 CLI RX|Message from VCC-compiler:
**** v1    0.1 CLI RX|Security: Privilege proc_setid missing, will not change uid/gid
**** v1    0.1 CLI RX|Name 'first' already defined.
**** v1    0.1 CLI RX|('<vcl.inline>' Line 8 Pos 21)
**** v1    0.1 CLI RX|                new first = debug.obj("FOO");
**** v1    0.1 CLI RX|--------------------#####--------------------
**** v1    0.1 CLI RX|
**** v1    0.1 CLI RX|First definition:
**** v1    0.1 CLI RX|('<vcl.inline>' Line 5 Pos 17)
**** v1    0.1 CLI RX|        backend first { .host = "127.0.0.1"; }
**** v1    0.1 CLI RX|----------------#####-------------------------
**** v1    0.1 CLI RX|
**** v1    0.1 CLI RX|Running VCC-compiler failed, exited with 2
**** v1    0.1 CLI RX|VCL compilation failed
**   v1    0.1 VCL compilation failed (as expected)
***  v1    0.1 Found expected string: ("Name 'first' already defined.")
*    top   0.1 RESETTING after ../../../bin/varnishtest/tests/r01510.vtc
**   v1    0.1 Wait
**** v1    0.1 CLI TX|backend.list
***  v1    0.1 CLI RX  101
**** v1    0.1 CLI RX|Unknown request in manager process (child not running).
**** v1    0.1 CLI RX|Type 'help' for more info.
**   v1    0.1 Stop
**** v1    0.1 CLI TX|stop
***  v1    0.1 CLI RX  300
**** v1    0.1 CLI RX|Child in state stopped
**** v1    0.1 CLI TX|status
***  v1    0.1 CLI RX  200
**** v1    0.1 CLI RX|Child in state stopped
**** v1    0.1 STDOUT poll 0x10
**   v1    0.1 R 9303 Status: 0000 (u 0.006000 s 0.020000)
*    diag  0.0 ............................................................
#    top  TEST ../../../bin/varnishtest/tests/r01510.vtc TIMED OUT (kill -9)
#    top  TEST ../../../bin/varnishtest/tests/r01510.vtc FAILED (60.002) signal=9

1 @ SunOS 5.11 i86pc 1.04 64_gcc4.7 uplex

*    top   0.0 TEST ../../../bin/varnishtest/tests/r01510.vtc starting
[...]
*    top   0.0 TEST Duplicate object names
[...]
**** v1    0.1 CLI TX|\tsub vcl_init {
**** v1    0.1 CLI TX|\t\tnew first = debug.obj("FOO");
**** v1    0.1 CLI TX|\t}
**** v1    0.1 CLI TX|
**** v1    0.1 CLI TX|%XJEIFLH|)Xspa8P
***  v1    0.1 CLI RX  106
**** v1    0.1 CLI RX|Message from VCC-compiler:
**** v1    0.1 CLI RX|Security: Privilege proc_setid missing, will not change uid/gid
**** v1    0.1 CLI RX|Name 'first' already defined.
**** v1    0.1 CLI RX|('<vcl.inline>' Line 8 Pos 21)
**** v1    0.1 CLI RX|                new first = debug.obj("FOO");
**** v1    0.1 CLI RX|--------------------#####--------------------
**** v1    0.1 CLI RX|
**** v1    0.1 CLI RX|First definition:
**** v1    0.1 CLI RX|('<vcl.inline>' Line 5 Pos 17)
**** v1    0.1 CLI RX|        backend first { .host = "127.0.0.1"; }
**** v1    0.1 CLI RX|----------------#####-------------------------
**** v1    0.1 CLI RX|
**** v1    0.1 CLI RX|Running VCC-compiler failed, exited with 2
**** v1    0.1 CLI RX|VCL compilation failed
**   v1    0.1 VCL compilation failed (as expected)
***  v1    0.1 Found expected string: ("Name 'first' already defined.")
*    top   0.1 RESETTING after ../../../bin/varnishtest/tests/r01510.vtc
**   v1    0.1 Wait
**** v1    0.1 CLI TX|backend.list
***  v1    0.1 CLI RX  101
**** v1    0.1 CLI RX|Unknown request in manager process (child not running).
**** v1    0.1 CLI RX|Type 'help' for more info.
**   v1    0.1 Stop
**** v1    0.1 CLI TX|stop
***  v1    0.1 CLI RX  300
**** v1    0.1 CLI RX|Child in state stopped
**** v1    0.1 CLI TX|status
***  v1    0.1 CLI RX  200
**** v1    0.1 CLI RX|Child in state stopped
**** v1    0.1 STDOUT poll 0x10
**   v1    0.1 R 61409 Status: 0000 (u 0.008000 s 0.027000)
*    diag  0.0 ............................................................
#    top  TEST ../../../bin/varnishtest/tests/r01510.vtc TIMED OUT (kill -9)
#    top  TEST ../../../bin/varnishtest/tests/r01510.vtc FAILED (60.003) signal=9

1 @ SunOS 5.11 i86pc 1.04 64_gcc4.7 uplex

*    top   0.0 TEST ../../../bin/varnishtest/tests/r01510.vtc starting
[...]
*    top   0.0 TEST Duplicate object names
[...]
**** v1    0.1 CLI TX|\tsub vcl_init {
**** v1    0.1 CLI TX|\t\tnew first = debug.obj("FOO");
**** v1    0.1 CLI TX|\t}
**** v1    0.1 CLI TX|
**** v1    0.1 CLI TX|%XJEIFLH|)Xspa8P
***  v1    0.1 CLI RX  106
**** v1    0.1 CLI RX|Message from VCC-compiler:
**** v1    0.1 CLI RX|Security: Privilege proc_setid missing, will not change uid/gid
**** v1    0.1 CLI RX|Name 'first' already defined.
**** v1    0.1 CLI RX|('<vcl.inline>' Line 8 Pos 21)
**** v1    0.1 CLI RX|                new first = debug.obj("FOO");
**** v1    0.1 CLI RX|--------------------#####--------------------
**** v1    0.1 CLI RX|
**** v1    0.1 CLI RX|First definition:
**** v1    0.1 CLI RX|('<vcl.inline>' Line 5 Pos 17)
**** v1    0.1 CLI RX|        backend first { .host = "127.0.0.1"; }
**** v1    0.1 CLI RX|----------------#####-------------------------
**** v1    0.1 CLI RX|
**** v1    0.1 CLI RX|Running VCC-compiler failed, exited with 2
**** v1    0.1 CLI RX|VCL compilation failed
**   v1    0.1 VCL compilation failed (as expected)
***  v1    0.1 Found expected string: ("Name 'first' already defined.")
*    top   0.1 RESETTING after ../../../bin/varnishtest/tests/r01510.vtc
**   v1    0.1 Wait
**** v1    0.1 CLI TX|backend.list
***  v1    0.1 CLI RX  101
**** v1    0.1 CLI RX|Unknown request in manager process (child not running).
**** v1    0.1 CLI RX|Type 'help' for more info.
**   v1    0.1 Stop
**** v1    0.1 CLI TX|stop
***  v1    0.1 CLI RX  300
**** v1    0.1 CLI RX|Child in state stopped
**** v1    0.1 CLI TX|status
***  v1    0.1 CLI RX  200
**** v1    0.1 CLI RX|Child in state stopped
**** v1    0.1 STDOUT poll 0x10
**   v1    0.1 R 83335 Status: 0000 (u 0.008000 s 0.027000)
*    diag  0.0 ............................................................
#    top  TEST ../../../bin/varnishtest/tests/r01510.vtc TIMED OUT (kill -9)
#    top  TEST ../../../bin/varnishtest/tests/r01510.vtc FAILED (60.003) signal=9

1 @ SunOS 5.11 i86pc 1.04 32_sun12.4 uplex

*    top   0.0 TEST ../../../bin/varnishtest/tests/r01510.vtc starting
[...]
*    top   0.0 TEST Duplicate object names
[...]
**** v1    0.1 CLI TX|\tsub vcl_init {
**** v1    0.1 CLI TX|\t\tnew first = debug.obj("FOO");
**** v1    0.1 CLI TX|\t}
**** v1    0.1 CLI TX|
**** v1    0.1 CLI TX|%XJEIFLH|)Xspa8P
***  v1    0.1 CLI RX  106
**** v1    0.1 CLI RX|Message from VCC-compiler:
**** v1    0.1 CLI RX|Security: Privilege proc_setid missing, will not change uid/gid
**** v1    0.1 CLI RX|Name 'first' already defined.
**** v1    0.1 CLI RX|('<vcl.inline>' Line 8 Pos 21)
**** v1    0.1 CLI RX|                new first = debug.obj("FOO");
**** v1    0.1 CLI RX|--------------------#####--------------------
**** v1    0.1 CLI RX|
**** v1    0.1 CLI RX|First definition:
**** v1    0.1 CLI RX|('<vcl.inline>' Line 5 Pos 17)
**** v1    0.1 CLI RX|        backend first { .host = "127.0.0.1"; }
**** v1    0.1 CLI RX|----------------#####-------------------------
**** v1    0.1 CLI RX|
**** v1    0.1 CLI RX|Running VCC-compiler failed, exited with 2
**** v1    0.1 CLI RX|VCL compilation failed
**   v1    0.1 VCL compilation failed (as expected)
***  v1    0.1 Found expected string: ("Name 'first' already defined.")
*    top   0.1 RESETTING after ../../../bin/varnishtest/tests/r01510.vtc
**   v1    0.1 Wait
**** v1    0.1 CLI TX|backend.list
***  v1    0.1 CLI RX  101
**** v1    0.1 CLI RX|Unknown request in manager process (child not running).
**** v1    0.1 CLI RX|Type 'help' for more info.
**   v1    0.1 Stop
**** v1    0.1 CLI TX|stop
***  v1    0.1 CLI RX  300
**** v1    0.1 CLI RX|Child in state stopped
**** v1    0.1 CLI TX|status
***  v1    0.1 CLI RX  200
**** v1    0.1 CLI RX|Child in state stopped
**** v1    0.1 STDOUT poll 0x10
**   v1    0.1 R 73384 Status: 0000 (u 0.006000 s 0.020000)
*    diag  0.0 ............................................................
#    top  TEST ../../../bin/varnishtest/tests/r01510.vtc TIMED OUT (kill -9)
#    top  TEST ../../../bin/varnishtest/tests/r01510.vtc FAILED (60.002) signal=9

1 @ SunOS 5.11 i86pc 1.04 64_gcc4.7 uplex

*    top   0.0 TEST ../../../bin/varnishtest/tests/r01510.vtc starting
[...]
*    top   0.0 TEST Duplicate object names
[...]
**** v1    0.1 CLI TX|\tsub vcl_init {
**** v1    0.1 CLI TX|\t\tnew first = debug.obj("FOO");
**** v1    0.1 CLI TX|\t}
**** v1    0.1 CLI TX|
**** v1    0.1 CLI TX|%XJEIFLH|)Xspa8P
***  v1    0.1 CLI RX  106
**** v1    0.1 CLI RX|Message from VCC-compiler:
**** v1    0.1 CLI RX|Security: Privilege proc_setid missing, will not change uid/gid
**** v1    0.1 CLI RX|Name 'first' already defined.
**** v1    0.1 CLI RX|('<vcl.inline>' Line 8 Pos 21)
**** v1    0.1 CLI RX|                new first = debug.obj("FOO");
**** v1    0.1 CLI RX|--------------------#####--------------------
**** v1    0.1 CLI RX|
**** v1    0.1 CLI RX|First definition:
**** v1    0.1 CLI RX|('<vcl.inline>' Line 5 Pos 17)
**** v1    0.1 CLI RX|        backend first { .host = "127.0.0.1"; }
**** v1    0.1 CLI RX|----------------#####-------------------------
**** v1    0.1 CLI RX|
**** v1    0.1 CLI RX|Running VCC-compiler failed, exited with 2
**** v1    0.1 CLI RX|VCL compilation failed
**   v1    0.1 VCL compilation failed (as expected)
***  v1    0.1 Found expected string: ("Name 'first' already defined.")
*    top   0.1 RESETTING after ../../../bin/varnishtest/tests/r01510.vtc
**   v1    0.1 Wait
**** v1    0.1 CLI TX|backend.list
***  v1    0.1 CLI RX  101
**** v1    0.1 CLI RX|Unknown request in manager process (child not running).
**** v1    0.1 CLI RX|Type 'help' for more info.
**   v1    0.1 Stop
**** v1    0.1 CLI TX|stop
***  v1    0.1 CLI RX  300
**** v1    0.1 CLI RX|Child in state stopped
**** v1    0.1 CLI TX|status
***  v1    0.1 CLI RX  200
**** v1    0.1 CLI RX|Child in state stopped
**** v1    0.1 STDOUT poll 0x10
**   v1    0.1 R 15922 Status: 0000 (u 0.008000 s 0.027000)
*    diag  0.0 ............................................................
#    top  TEST ../../../bin/varnishtest/tests/r01510.vtc TIMED OUT (kill -9)
#    top  TEST ../../../bin/varnishtest/tests/r01510.vtc FAILED (60.004) signal=9

1 @ SunOS 5.11 i86pc 1.04 32_sun12.4 uplex

*    top   0.0 TEST ../../../bin/varnishtest/tests/r01510.vtc starting
[...]
*    top   0.0 TEST Duplicate object names
[...]
**** v1    0.1 CLI TX|\tsub vcl_init {
**** v1    0.1 CLI TX|\t\tnew first = debug.obj("FOO");
**** v1    0.1 CLI TX|\t}
**** v1    0.1 CLI TX|
**** v1    0.1 CLI TX|%XJEIFLH|)Xspa8P
***  v1    0.1 CLI RX  106
**** v1    0.1 CLI RX|Message from VCC-compiler:
**** v1    0.1 CLI RX|Security: Privilege proc_setid missing, will not change uid/gid
**** v1    0.1 CLI RX|Name 'first' already defined.
**** v1    0.1 CLI RX|('<vcl.inline>' Line 8 Pos 21)
**** v1    0.1 CLI RX|                new first = debug.obj("FOO");
**** v1    0.1 CLI RX|--------------------#####--------------------
**** v1    0.1 CLI RX|
**** v1    0.1 CLI RX|First definition:
**** v1    0.1 CLI RX|('<vcl.inline>' Line 5 Pos 17)
**** v1    0.1 CLI RX|        backend first { .host = "127.0.0.1"; }
**** v1    0.1 CLI RX|----------------#####-------------------------
**** v1    0.1 CLI RX|
**** v1    0.1 CLI RX|Running VCC-compiler failed, exited with 2
**** v1    0.1 CLI RX|VCL compilation failed
**   v1    0.1 VCL compilation failed (as expected)
***  v1    0.1 Found expected string: ("Name 'first' already defined.")
*    top   0.1 RESETTING after ../../../bin/varnishtest/tests/r01510.vtc
**   v1    0.1 Wait
**** v1    0.1 CLI TX|backend.list
***  v1    0.1 CLI RX  101
**** v1    0.1 CLI RX|Unknown request in manager process (child not running).
**** v1    0.1 CLI RX|Type 'help' for more info.
**   v1    0.1 Stop
**** v1    0.1 CLI TX|stop
***  v1    0.1 CLI RX  300
**** v1    0.1 CLI RX|Child in state stopped
**** v1    0.1 CLI TX|status
***  v1    0.1 CLI RX  200
**** v1    0.1 CLI RX|Child in state stopped
**** v1    0.1 STDOUT poll 0x10
**   v1    0.1 R 23770 Status: 0000 (u 0.005000 s 0.020000)
*    diag  0.0 ............................................................
#    top  TEST ../../../bin/varnishtest/tests/r01510.vtc TIMED OUT (kill -9)
#    top  TEST ../../../bin/varnishtest/tests/r01510.vtc FAILED (60.002) signal=9

1 @ SunOS 5.11 i86pc 1.04 64_gcc4.7 uplex

*    top   0.0 TEST ../../../bin/varnishtest/tests/r01510.vtc starting
[...]
*    top   0.0 TEST Duplicate object names
[...]
**** v1    0.1 CLI TX|\tsub vcl_init {
**** v1    0.1 CLI TX|\t\tnew first = debug.obj("FOO");
**** v1    0.1 CLI TX|\t}
**** v1    0.1 CLI TX|
**** v1    0.1 CLI TX|%XJEIFLH|)Xspa8P
***  v1    0.1 CLI RX  106
**** v1    0.1 CLI RX|Message from VCC-compiler:
**** v1    0.1 CLI RX|Security: Privilege proc_setid missing, will not change uid/gid
**** v1    0.1 CLI RX|Name 'first' already defined.
**** v1    0.1 CLI RX|('<vcl.inline>' Line 8 Pos 21)
**** v1    0.1 CLI RX|                new first = debug.obj("FOO");
**** v1    0.1 CLI RX|--------------------#####--------------------
**** v1    0.1 CLI RX|
**** v1    0.1 CLI RX|First definition:
**** v1    0.1 CLI RX|('<vcl.inline>' Line 5 Pos 17)
**** v1    0.1 CLI RX|        backend first { .host = "127.0.0.1"; }
**** v1    0.1 CLI RX|----------------#####-------------------------
**** v1    0.1 CLI RX|
**** v1    0.1 CLI RX|Running VCC-compiler failed, exited with 2
**** v1    0.1 CLI RX|VCL compilation failed
**   v1    0.1 VCL compilation failed (as expected)
***  v1    0.1 Found expected string: ("Name 'first' already defined.")
*    top   0.1 RESETTING after ../../../bin/varnishtest/tests/r01510.vtc
**   v1    0.1 Wait
**** v1    0.1 CLI TX|backend.list
***  v1    0.1 CLI RX  101
**** v1    0.1 CLI RX|Unknown request in manager process (child not running).
**** v1    0.1 CLI RX|Type 'help' for more info.
**   v1    0.1 Stop
**** v1    0.1 CLI TX|stop
***  v1    0.1 CLI RX  300
**** v1    0.1 CLI RX|Child in state stopped
**** v1    0.1 CLI TX|status
***  v1    0.1 CLI RX  200
**** v1    0.1 CLI RX|Child in state stopped
**** v1    0.1 STDOUT poll 0x10
**   v1    0.1 R 21960 Status: 0000 (u 0.008000 s 0.027000)
*    diag  0.0 ............................................................
#    top  TEST ../../../bin/varnishtest/tests/r01510.vtc TIMED OUT (kill -9)
#    top  TEST ../../../bin/varnishtest/tests/r01510.vtc FAILED (60.004) signal=9

1 @ SunOS 5.11 i86pc 1.04 64_gcc4.7 uplex

*    top   0.0 TEST ../../../bin/varnishtest/tests/r01510.vtc starting
[...]
*    top   0.0 TEST Duplicate object names
[...]
**** v1    0.1 CLI TX|\tsub vcl_init {
**** v1    0.1 CLI TX|\t\tnew first = debug.obj("FOO");
**** v1    0.1 CLI TX|\t}
**** v1    0.1 CLI TX|
**** v1    0.1 CLI TX|%XJEIFLH|)Xspa8P
***  v1    0.2 CLI RX  106
**** v1    0.2 CLI RX|Message from VCC-compiler:
**** v1    0.2 CLI RX|Security: Privilege proc_setid missing, will not change uid/gid
**** v1    0.2 CLI RX|Name 'first' already defined.
**** v1    0.2 CLI RX|('<vcl.inline>' Line 8 Pos 21)
**** v1    0.2 CLI RX|                new first = debug.obj("FOO");
**** v1    0.2 CLI RX|--------------------#####--------------------
**** v1    0.2 CLI RX|
**** v1    0.2 CLI RX|First definition:
**** v1    0.2 CLI RX|('<vcl.inline>' Line 5 Pos 17)
**** v1    0.2 CLI RX|        backend first { .host = "127.0.0.1"; }
**** v1    0.2 CLI RX|----------------#####-------------------------
**** v1    0.2 CLI RX|
**** v1    0.2 CLI RX|Running VCC-compiler failed, exited with 2
**** v1    0.2 CLI RX|VCL compilation failed
**   v1    0.2 VCL compilation failed (as expected)
***  v1    0.2 Found expected string: ("Name 'first' already defined.")
*    top   0.2 RESETTING after ../../../bin/varnishtest/tests/r01510.vtc
**   v1    0.2 Wait
**** v1    0.2 CLI TX|backend.list
***  v1    0.2 CLI RX  101
**** v1    0.2 CLI RX|Unknown request in manager process (child not running).
**** v1    0.2 CLI RX|Type 'help' for more info.
**   v1    0.2 Stop
**** v1    0.2 CLI TX|stop
***  v1    0.2 CLI RX  300
**** v1    0.2 CLI RX|Child in state stopped
**** v1    0.2 CLI TX|status
***  v1    0.2 CLI RX  200
**** v1    0.2 CLI RX|Child in state stopped
**** v1    0.2 STDOUT poll 0x10
**   v1    0.2 R 71917 Status: 0000 (u 0.008000 s 0.030000)
*    diag  0.0 ............................................................
#    top  TEST ../../../bin/varnishtest/tests/r01510.vtc TIMED OUT (kill -9)
#    top  TEST ../../../bin/varnishtest/tests/r01510.vtc FAILED (60.005) signal=9

1 @ SunOS 5.11 i86pc 1.04 64_gcc4.7 uplex

*    top   0.0 TEST ../../../bin/varnishtest/tests/r01510.vtc starting
[...]
*    top   0.0 TEST Duplicate object names
[...]
**** v1    0.1 CLI TX|\tsub vcl_init {
**** v1    0.1 CLI TX|\t\tnew first = debug.obj("FOO");
**** v1    0.1 CLI TX|\t}
**** v1    0.1 CLI TX|
**** v1    0.1 CLI TX|%XJEIFLH|)Xspa8P
***  v1    0.1 CLI RX  106
**** v1    0.1 CLI RX|Message from VCC-compiler:
**** v1    0.1 CLI RX|Security: Privilege proc_setid missing, will not change uid/gid
**** v1    0.1 CLI RX|Name 'first' already defined.
**** v1    0.1 CLI RX|('<vcl.inline>' Line 8 Pos 21)
**** v1    0.1 CLI RX|                new first = debug.obj("FOO");
**** v1    0.1 CLI RX|--------------------#####--------------------
**** v1    0.1 CLI RX|
**** v1    0.1 CLI RX|First definition:
**** v1    0.1 CLI RX|('<vcl.inline>' Line 5 Pos 17)
**** v1    0.1 CLI RX|        backend first { .host = "127.0.0.1"; }
**** v1    0.1 CLI RX|----------------#####-------------------------
**** v1    0.1 CLI RX|
**** v1    0.1 CLI RX|Running VCC-compiler failed, exited with 2
**** v1    0.1 CLI RX|VCL compilation failed
**   v1    0.1 VCL compilation failed (as expected)
***  v1    0.1 Found expected string: ("Name 'first' already defined.")
*    top   0.1 RESETTING after ../../../bin/varnishtest/tests/r01510.vtc
**   v1    0.1 Wait
**** v1    0.1 CLI TX|backend.list
***  v1    0.1 CLI RX  101
**** v1    0.1 CLI RX|Unknown request in manager process (child not running).
**** v1    0.1 CLI RX|Type 'help' for more info.
**   v1    0.1 Stop
**** v1    0.1 CLI TX|stop
***  v1    0.1 CLI RX  300
**** v1    0.1 CLI RX|Child in state stopped
**** v1    0.1 CLI TX|status
***  v1    0.1 CLI RX  200
**** v1    0.1 CLI RX|Child in state stopped
**** v1    0.1 STDOUT poll 0x10
**   v1    0.1 R 37463 Status: 0000 (u 0.008000 s 0.027000)
*    diag  0.0 ............................................................
#    top  TEST ../../../bin/varnishtest/tests/r01510.vtc TIMED OUT (kill -9)
#    top  TEST ../../../bin/varnishtest/tests/r01510.vtc FAILED (60.003) signal=9

1 @ SunOS 5.11 i86pc 1.04 64_gcc4.7 uplex

*    top   0.0 TEST ../../../bin/varnishtest/tests/r01510.vtc starting
[...]
*    top   0.0 TEST Duplicate object names
[...]
**** v1    0.1 CLI TX|\tsub vcl_init {
**** v1    0.1 CLI TX|\t\tnew first = debug.obj("FOO");
**** v1    0.1 CLI TX|\t}
**** v1    0.1 CLI TX|
**** v1    0.1 CLI TX|%XJEIFLH|)Xspa8P
***  v1    0.1 CLI RX  106
**** v1    0.1 CLI RX|Message from VCC-compiler:
**** v1    0.1 CLI RX|Security: Privilege proc_setid missing, will not change uid/gid
**** v1    0.1 CLI RX|Name 'first' already defined.
**** v1    0.1 CLI RX|('<vcl.inline>' Line 8 Pos 21)
**** v1    0.1 CLI RX|                new first = debug.obj("FOO");
**** v1    0.1 CLI RX|--------------------#####--------------------
**** v1    0.1 CLI RX|
**** v1    0.1 CLI RX|First definition:
**** v1    0.1 CLI RX|('<vcl.inline>' Line 5 Pos 17)
**** v1    0.1 CLI RX|        backend first { .host = "127.0.0.1"; }
**** v1    0.1 CLI RX|----------------#####-------------------------
**** v1    0.1 CLI RX|
**** v1    0.1 CLI RX|Running VCC-compiler failed, exited with 2
**** v1    0.1 CLI RX|VCL compilation failed
**   v1    0.1 VCL compilation failed (as expected)
***  v1    0.1 Found expected string: ("Name 'first' already defined.")
*    top   0.1 RESETTING after ../../../bin/varnishtest/tests/r01510.vtc
**   v1    0.1 Wait
**** v1    0.1 CLI TX|backend.list
***  v1    0.1 CLI RX  101
**** v1    0.1 CLI RX|Unknown request in manager process (child not running).
**** v1    0.1 CLI RX|Type 'help' for more info.
**   v1    0.1 Stop
**** v1    0.1 CLI TX|stop
***  v1    0.1 CLI RX  300
**** v1    0.1 CLI RX|Child in state stopped
**** v1    0.1 CLI TX|status
***  v1    0.1 CLI RX  200
**** v1    0.1 CLI RX|Child in state stopped
**** v1    0.1 STDOUT poll 0x10
**   v1    0.1 R 2608 Status: 0000 (u 0.008000 s 0.028000)
*    diag  0.0 ............................................................
#    top  TEST ../../../bin/varnishtest/tests/r01510.vtc TIMED OUT (kill -9)
#    top  TEST ../../../bin/varnishtest/tests/r01510.vtc FAILED (60.003) signal=9

1 @ SunOS 5.11 i86pc 1.04 64_gcc4.7 uplex

*    top   0.0 TEST ../../../bin/varnishtest/tests/r01510.vtc starting
[...]
*    top   0.0 TEST Duplicate object names
[...]
**** v1    0.1 CLI TX|\tsub vcl_init {
**** v1    0.1 CLI TX|\t\tnew first = debug.obj("FOO");
**** v1    0.1 CLI TX|\t}
**** v1    0.1 CLI TX|
**** v1    0.1 CLI TX|%XJEIFLH|)Xspa8P
***  v1    0.1 CLI RX  106
**** v1    0.1 CLI RX|Message from VCC-compiler:
**** v1    0.1 CLI RX|Security: Privilege proc_setid missing, will not change uid/gid
**** v1    0.1 CLI RX|Name 'first' already defined.
**** v1    0.1 CLI RX|('<vcl.inline>' Line 8 Pos 21)
**** v1    0.1 CLI RX|                new first = debug.obj("FOO");
**** v1    0.1 CLI RX|--------------------#####--------------------
**** v1    0.1 CLI RX|
**** v1    0.1 CLI RX|First definition:
**** v1    0.1 CLI RX|('<vcl.inline>' Line 5 Pos 17)
**** v1    0.1 CLI RX|        backend first { .host = "127.0.0.1"; }
**** v1    0.1 CLI RX|----------------#####-------------------------
**** v1    0.1 CLI RX|
**** v1    0.1 CLI RX|Running VCC-compiler failed, exited with 2
**** v1    0.1 CLI RX|VCL compilation failed
**   v1    0.1 VCL compilation failed (as expected)
***  v1    0.1 Found expected string: ("Name 'first' already defined.")
*    top   0.1 RESETTING after ../../../bin/varnishtest/tests/r01510.vtc
**   v1    0.1 Wait
**** v1    0.1 CLI TX|backend.list
***  v1    0.1 CLI RX  101
**** v1    0.1 CLI RX|Unknown request in manager process (child not running).
**** v1    0.1 CLI RX|Type 'help' for more info.
**   v1    0.1 Stop
**** v1    0.1 CLI TX|stop
***  v1    0.1 CLI RX  300
**** v1    0.1 CLI RX|Child in state stopped
**** v1    0.1 CLI TX|status
***  v1    0.1 CLI RX  200
**** v1    0.1 CLI RX|Child in state stopped
**** v1    0.1 STDOUT poll 0x10
**   v1    0.1 R 65050 Status: 0000 (u 0.009000 s 0.029000)
*    diag  0.0 ............................................................
#    top  TEST ../../../bin/varnishtest/tests/r01510.vtc TIMED OUT (kill -9)
#    top  TEST ../../../bin/varnishtest/tests/r01510.vtc FAILED (60.004) signal=9

1 @ SunOS 5.11 i86pc 1.04 32_sun12.4 uplex

*    top   0.0 TEST ../../../bin/varnishtest/tests/r01510.vtc starting
[...]
*    top   0.0 TEST Duplicate object names
[...]
**** v1    0.1 CLI TX|\tsub vcl_init {
**** v1    0.1 CLI TX|\t\tnew first = debug.obj("FOO");
**** v1    0.1 CLI TX|\t}
**** v1    0.1 CLI TX|
**** v1    0.1 CLI TX|%XJEIFLH|)Xspa8P
***  v1    0.1 CLI RX  106
**** v1    0.1 CLI RX|Message from VCC-compiler:
**** v1    0.1 CLI RX|Security: Privilege proc_setid missing, will not change uid/gid
**** v1    0.1 CLI RX|Name 'first' already defined.
**** v1    0.1 CLI RX|('<vcl.inline>' Line 8 Pos 21)
**** v1    0.1 CLI RX|                new first = debug.obj("FOO");
**** v1    0.1 CLI RX|--------------------#####--------------------
**** v1    0.1 CLI RX|
**** v1    0.1 CLI RX|First definition:
**** v1    0.1 CLI RX|('<vcl.inline>' Line 5 Pos 17)
**** v1    0.1 CLI RX|        backend first { .host = "127.0.0.1"; }
**** v1    0.1 CLI RX|----------------#####-------------------------
**** v1    0.1 CLI RX|
**** v1    0.1 CLI RX|Running VCC-compiler failed, exited with 2
**** v1    0.1 CLI RX|VCL compilation failed
**   v1    0.1 VCL compilation failed (as expected)
***  v1    0.1 Found expected string: ("Name 'first' already defined.")
*    top   0.1 RESETTING after ../../../bin/varnishtest/tests/r01510.vtc
**   v1    0.1 Wait
**** v1    0.1 CLI TX|backend.list
***  v1    0.1 CLI RX  101
**** v1    0.1 CLI RX|Unknown request in manager process (child not running).
**** v1    0.1 CLI RX|Type 'help' for more info.
**   v1    0.1 Stop
**** v1    0.1 CLI TX|stop
***  v1    0.1 CLI RX  300
**** v1    0.1 CLI RX|Child in state stopped
**** v1    0.1 CLI TX|status
***  v1    0.1 CLI RX  200
**** v1    0.1 CLI RX|Child in state stopped
**** v1    0.1 STDOUT poll 0x10
**   v1    0.1 R 32206 Status: 0000 (u 0.007000 s 0.025000)
*    diag  0.0 ............................................................
#    top  TEST ../../../bin/varnishtest/tests/r01510.vtc TIMED OUT (kill -9)
#    top  TEST ../../../bin/varnishtest/tests/r01510.vtc FAILED (60.002) signal=9

1 @ SunOS 5.11 i86pc 1.04 64_gcc4.7 uplex

*    top   0.0 TEST ../../../bin/varnishtest/tests/r01510.vtc starting
[...]
*    top   0.0 TEST Duplicate object names
[...]
**** v1    0.1 CLI TX|\tsub vcl_init {
**** v1    0.1 CLI TX|\t\tnew first = debug.obj("FOO");
**** v1    0.1 CLI TX|\t}
**** v1    0.1 CLI TX|
**** v1    0.1 CLI TX|%XJEIFLH|)Xspa8P
***  v1    0.2 CLI RX  106
**** v1    0.2 CLI RX|Message from VCC-compiler:
**** v1    0.2 CLI RX|Security: Privilege proc_setid missing, will not change uid/gid
**** v1    0.2 CLI RX|Name 'first' already defined.
**** v1    0.2 CLI RX|('<vcl.inline>' Line 8 Pos 21)
**** v1    0.2 CLI RX|                new first = debug.obj("FOO");
**** v1    0.2 CLI RX|--------------------#####--------------------
**** v1    0.2 CLI RX|
**** v1    0.2 CLI RX|First definition:
**** v1    0.2 CLI RX|('<vcl.inline>' Line 5 Pos 17)
**** v1    0.2 CLI RX|        backend first { .host = "127.0.0.1"; }
**** v1    0.2 CLI RX|----------------#####-------------------------
**** v1    0.2 CLI RX|
**** v1    0.2 CLI RX|Running VCC-compiler failed, exited with 2
**** v1    0.2 CLI RX|VCL compilation failed
**   v1    0.2 VCL compilation failed (as expected)
***  v1    0.2 Found expected string: ("Name 'first' already defined.")
*    top   0.2 RESETTING after ../../../bin/varnishtest/tests/r01510.vtc
**   v1    0.2 Wait
**** v1    0.2 CLI TX|backend.list
***  v1    0.2 CLI RX  101
**** v1    0.2 CLI RX|Unknown request in manager process (child not running).
**** v1    0.2 CLI RX|Type 'help' for more info.
**   v1    0.2 Stop
**** v1    0.2 CLI TX|stop
***  v1    0.2 CLI RX  300
**** v1    0.2 CLI RX|Child in state stopped
**** v1    0.2 CLI TX|status
***  v1    0.2 CLI RX  200
**** v1    0.2 CLI RX|Child in state stopped
**** v1    0.2 STDOUT poll 0x10
**   v1    0.2 R 9415 Status: 0000 (u 0.008000 s 0.028000)
*    diag  0.0 ............................................................
#    top  TEST ../../../bin/varnishtest/tests/r01510.vtc TIMED OUT (kill -9)
#    top  TEST ../../../bin/varnishtest/tests/r01510.vtc FAILED (60.004) signal=9

1 @ SunOS 5.11 i86pc 1.04 32_sun12.4 uplex

*    top   0.0 TEST ../../../bin/varnishtest/tests/r01510.vtc starting
[...]
*    top   0.0 TEST Duplicate object names
[...]
**** v1    0.1 CLI TX|\tsub vcl_init {
**** v1    0.1 CLI TX|\t\tnew first = debug.obj("FOO");
**** v1    0.1 CLI TX|\t}
**** v1    0.1 CLI TX|
**** v1    0.1 CLI TX|%XJEIFLH|)Xspa8P
***  v1    0.1 CLI RX  106
**** v1    0.1 CLI RX|Message from VCC-compiler:
**** v1    0.1 CLI RX|Security: Privilege proc_setid missing, will not change uid/gid
**** v1    0.1 CLI RX|Name 'first' already defined.
**** v1    0.1 CLI RX|('<vcl.inline>' Line 8 Pos 21)
**** v1    0.1 CLI RX|                new first = debug.obj("FOO");
**** v1    0.1 CLI RX|--------------------#####--------------------
**** v1    0.1 CLI RX|
**** v1    0.1 CLI RX|First definition:
**** v1    0.1 CLI RX|('<vcl.inline>' Line 5 Pos 17)
**** v1    0.1 CLI RX|        backend first { .host = "127.0.0.1"; }
**** v1    0.1 CLI RX|----------------#####-------------------------
**** v1    0.1 CLI RX|
**** v1    0.1 CLI RX|Running VCC-compiler failed, exited with 2
**** v1    0.1 CLI RX|VCL compilation failed
**   v1    0.1 VCL compilation failed (as expected)
***  v1    0.1 Found expected string: ("Name 'first' already defined.")
*    top   0.1 RESETTING after ../../../bin/varnishtest/tests/r01510.vtc
**   v1    0.1 Wait
**** v1    0.1 CLI TX|backend.list
***  v1    0.1 CLI RX  101
**** v1    0.1 CLI RX|Unknown request in manager process (child not running).
**** v1    0.1 CLI RX|Type 'help' for more info.
**   v1    0.1 Stop
**** v1    0.1 CLI TX|stop
***  v1    0.1 CLI RX  300
**** v1    0.1 CLI RX|Child in state stopped
**** v1    0.1 CLI TX|status
***  v1    0.1 CLI RX  200
**** v1    0.1 CLI RX|Child in state stopped
**** v1    0.1 STDOUT poll 0x10
**   v1    0.1 R 9238 Status: 0000 (u 0.005000 s 0.019000)
*    diag  0.0 ............................................................
#    top  TEST ../../../bin/varnishtest/tests/r01510.vtc TIMED OUT (kill -9)
#    top  TEST ../../../bin/varnishtest/tests/r01510.vtc FAILED (60.002) signal=9

1 @ SunOS 5.11 i86pc 1.04 32_sun12.4 uplex

*    top   0.0 TEST ../../../bin/varnishtest/tests/r01510.vtc starting
[...]
*    top   0.0 TEST Duplicate object names
[...]
**** v1    0.1 CLI TX|\tsub vcl_init {
**** v1    0.1 CLI TX|\t\tnew first = debug.obj("FOO");
**** v1    0.1 CLI TX|\t}
**** v1    0.1 CLI TX|
**** v1    0.1 CLI TX|%XJEIFLH|)Xspa8P
***  v1    0.1 CLI RX  106
**** v1    0.1 CLI RX|Message from VCC-compiler:
**** v1    0.1 CLI RX|Security: Privilege proc_setid missing, will not change uid/gid
**** v1    0.1 CLI RX|Name 'first' already defined.
**** v1    0.1 CLI RX|('<vcl.inline>' Line 8 Pos 21)
**** v1    0.1 CLI RX|                new first = debug.obj("FOO");
**** v1    0.1 CLI RX|--------------------#####--------------------
**** v1    0.1 CLI RX|
**** v1    0.1 CLI RX|First definition:
**** v1    0.1 CLI RX|('<vcl.inline>' Line 5 Pos 17)
**** v1    0.1 CLI RX|        backend first { .host = "127.0.0.1"; }
**** v1    0.1 CLI RX|----------------#####-------------------------
**** v1    0.1 CLI RX|
**** v1    0.1 CLI RX|Running VCC-compiler failed, exited with 2
**** v1    0.1 CLI RX|VCL compilation failed
**   v1    0.1 VCL compilation failed (as expected)
***  v1    0.1 Found expected string: ("Name 'first' already defined.")
*    top   0.1 RESETTING after ../../../bin/varnishtest/tests/r01510.vtc
**   v1    0.1 Wait
**** v1    0.1 CLI TX|backend.list
***  v1    0.1 CLI RX  101
**** v1    0.1 CLI RX|Unknown request in manager process (child not running).
**** v1    0.1 CLI RX|Type 'help' for more info.
**   v1    0.1 Stop
**** v1    0.1 CLI TX|stop
***  v1    0.1 CLI RX  300
**** v1    0.1 CLI RX|Child in state stopped
**** v1    0.1 CLI TX|status
***  v1    0.1 CLI RX  200
**** v1    0.1 CLI RX|Child in state stopped
**** v1    0.1 STDOUT poll 0x10
**   v1    0.1 R 19572 Status: 0000 (u 0.006000 s 0.021000)
*    diag  0.0 ............................................................
#    top  TEST ../../../bin/varnishtest/tests/r01510.vtc TIMED OUT (kill -9)
#    top  TEST ../../../bin/varnishtest/tests/r01510.vtc FAILED (60.002) signal=9

1 @ SunOS 5.11 i86pc 1.04 64_gcc4.7 uplex

*    top   0.0 TEST ../../../bin/varnishtest/tests/r01510.vtc starting
[...]
*    top   0.0 TEST Duplicate object names
[...]
**** v1    0.1 CLI TX|\tsub vcl_init {
**** v1    0.1 CLI TX|\t\tnew first = debug.obj("FOO");
**** v1    0.1 CLI TX|\t}
**** v1    0.1 CLI TX|
**** v1    0.1 CLI TX|%XJEIFLH|)Xspa8P
***  v1    0.1 CLI RX  106
**** v1    0.1 CLI RX|Message from VCC-compiler:
**** v1    0.1 CLI RX|Security: Privilege proc_setid missing, will not change uid/gid
**** v1    0.1 CLI RX|Name 'first' already defined.
**** v1    0.1 CLI RX|('<vcl.inline>' Line 8 Pos 21)
**** v1    0.1 CLI RX|                new first = debug.obj("FOO");
**** v1    0.1 CLI RX|--------------------#####--------------------
**** v1    0.1 CLI RX|
**** v1    0.1 CLI RX|First definition:
**** v1    0.1 CLI RX|('<vcl.inline>' Line 5 Pos 17)
**** v1    0.1 CLI RX|        backend first { .host = "127.0.0.1"; }
**** v1    0.1 CLI RX|----------------#####-------------------------
**** v1    0.1 CLI RX|
**** v1    0.1 CLI RX|Running VCC-compiler failed, exited with 2
**** v1    0.1 CLI RX|VCL compilation failed
**   v1    0.1 VCL compilation failed (as expected)
***  v1    0.1 Found expected string: ("Name 'first' already defined.")
*    top   0.1 RESETTING after ../../../bin/varnishtest/tests/r01510.vtc
**   v1    0.1 Wait
**** v1    0.1 CLI TX|backend.list
***  v1    0.1 CLI RX  101
**** v1    0.1 CLI RX|Unknown request in manager process (child not running).
**** v1    0.1 CLI RX|Type 'help' for more info.
**   v1    0.1 Stop
**** v1    0.1 CLI TX|stop
***  v1    0.1 CLI RX  300
**** v1    0.1 CLI RX|Child in state stopped
**** v1    0.1 CLI TX|status
***  v1    0.1 CLI RX  200
**** v1    0.1 CLI RX|Child in state stopped
**** v1    0.1 STDOUT poll 0x10
**   v1    0.1 R 33592 Status: 0000 (u 0.009000 s 0.028000)
*    diag  0.0 ............................................................
#    top  TEST ../../../bin/varnishtest/tests/r01510.vtc TIMED OUT (kill -9)
#    top  TEST ../../../bin/varnishtest/tests/r01510.vtc FAILED (60.003) signal=9

1 @ SunOS 5.11 i86pc 1.04 64_gcc4.7 uplex

*    top   0.0 TEST ../../../bin/varnishtest/tests/r01510.vtc starting
[...]
*    top   0.0 TEST Duplicate object names
[...]
**** v1    0.1 CLI TX|\tsub vcl_init {
**** v1    0.1 CLI TX|\t\tnew first = debug.obj("FOO");
**** v1    0.1 CLI TX|\t}
**** v1    0.1 CLI TX|
**** v1    0.1 CLI TX|%XJEIFLH|)Xspa8P
***  v1    0.1 CLI RX  106
**** v1    0.1 CLI RX|Message from VCC-compiler:
**** v1    0.1 CLI RX|Security: Privilege proc_setid missing, will not change uid/gid
**** v1    0.1 CLI RX|Name 'first' already defined.
**** v1    0.1 CLI RX|('<vcl.inline>' Line 8 Pos 21)
**** v1    0.1 CLI RX|                new first = debug.obj("FOO");
**** v1    0.1 CLI RX|--------------------#####--------------------
**** v1    0.1 CLI RX|
**** v1    0.1 CLI RX|First definition:
**** v1    0.1 CLI RX|('<vcl.inline>' Line 5 Pos 17)
**** v1    0.1 CLI RX|        backend first { .host = "127.0.0.1"; }
**** v1    0.1 CLI RX|----------------#####-------------------------
**** v1    0.1 CLI RX|
**** v1    0.1 CLI RX|Running VCC-compiler failed, exited with 2
**** v1    0.1 CLI RX|VCL compilation failed
**   v1    0.1 VCL compilation failed (as expected)
***  v1    0.1 Found expected string: ("Name 'first' already defined.")
*    top   0.1 RESETTING after ../../../bin/varnishtest/tests/r01510.vtc
**   v1    0.1 Wait
**** v1    0.1 CLI TX|backend.list
***  v1    0.1 CLI RX  101
**** v1    0.1 CLI RX|Unknown request in manager process (child not running).
**** v1    0.1 CLI RX|Type 'help' for more info.
**   v1    0.1 Stop
**** v1    0.1 CLI TX|stop
***  v1    0.1 CLI RX  300
**** v1    0.1 CLI RX|Child in state stopped
**** v1    0.1 CLI TX|status
***  v1    0.1 CLI RX  200
**** v1    0.1 CLI RX|Child in state stopped
**** v1    0.1 STDOUT poll 0x10
**   v1    0.2 R 26624 Status: 0000 (u 0.009000 s 0.030000)
*    diag  0.0 ............................................................
#    top  TEST ../../../bin/varnishtest/tests/r01510.vtc TIMED OUT (kill -9)
#    top  TEST ../../../bin/varnishtest/tests/r01510.vtc FAILED (60.004) signal=9

1 @ SunOS 5.11 i86pc 1.04 64_gcc4.7 uplex

*    top   0.0 TEST ../../../bin/varnishtest/tests/r01510.vtc starting
[...]
*    top   0.0 TEST Duplicate object names
[...]
**** v1    0.1 CLI TX|\tsub vcl_init {
**** v1    0.1 CLI TX|\t\tnew first = debug.obj("FOO");
**** v1    0.1 CLI TX|\t}
**** v1    0.1 CLI TX|
**** v1    0.1 CLI TX|%XJEIFLH|)Xspa8P
***  v1    0.1 CLI RX  106
**** v1    0.1 CLI RX|Message from VCC-compiler:
**** v1    0.1 CLI RX|Security: Privilege proc_setid missing, will not change uid/gid
**** v1    0.1 CLI RX|Name 'first' already defined.
**** v1    0.1 CLI RX|('<vcl.inline>' Line 8 Pos 21)
**** v1    0.1 CLI RX|                new first = debug.obj("FOO");
**** v1    0.1 CLI RX|--------------------#####--------------------
**** v1    0.1 CLI RX|
**** v1    0.1 CLI RX|First definition:
**** v1    0.1 CLI RX|('<vcl.inline>' Line 5 Pos 17)
**** v1    0.1 CLI RX|        backend first { .host = "127.0.0.1"; }
**** v1    0.1 CLI RX|----------------#####-------------------------
**** v1    0.1 CLI RX|
**** v1    0.1 CLI RX|Running VCC-compiler failed, exited with 2
**** v1    0.1 CLI RX|VCL compilation failed
**   v1    0.1 VCL compilation failed (as expected)
***  v1    0.1 Found expected string: ("Name 'first' already defined.")
*    top   0.1 RESETTING after ../../../bin/varnishtest/tests/r01510.vtc
**   v1    0.1 Wait
**** v1    0.1 CLI TX|backend.list
***  v1    0.1 CLI RX  101
**** v1    0.1 CLI RX|Unknown request in manager process (child not running).
**** v1    0.1 CLI RX|Type 'help' for more info.
**   v1    0.1 Stop
**** v1    0.1 CLI TX|stop
***  v1    0.1 CLI RX  300
**** v1    0.1 CLI RX|Child in state stopped
**** v1    0.1 CLI TX|status
***  v1    0.1 CLI RX  200
**** v1    0.1 CLI RX|Child in state stopped
**** v1    0.2 STDOUT poll 0x10
**   v1    0.2 R 72957 Status: 0000 (u 0.009000 s 0.030000)
*    diag  0.0 ............................................................
#    top  TEST ../../../bin/varnishtest/tests/r01510.vtc TIMED OUT (kill -9)
#    top  TEST ../../../bin/varnishtest/tests/r01510.vtc FAILED (60.005) signal=9

1 @ SunOS 5.11 i86pc 1.04 64_gcc4.7 uplex

*    top   0.0 TEST ../../../bin/varnishtest/tests/r01510.vtc starting
[...]
*    top   0.0 TEST Duplicate object names
[...]
**** v1    0.1 CLI TX|\tsub vcl_init {
**** v1    0.1 CLI TX|\t\tnew first = debug.obj("FOO");
**** v1    0.1 CLI TX|\t}
**** v1    0.1 CLI TX|
**** v1    0.1 CLI TX|%XJEIFLH|)Xspa8P
***  v1    0.2 CLI RX  106
**** v1    0.2 CLI RX|Message from VCC-compiler:
**** v1    0.2 CLI RX|Security: Privilege proc_setid missing, will not change uid/gid
**** v1    0.2 CLI RX|Name 'first' already defined.
**** v1    0.2 CLI RX|('<vcl.inline>' Line 8 Pos 21)
**** v1    0.2 CLI RX|                new first = debug.obj("FOO");
**** v1    0.2 CLI RX|--------------------#####--------------------
**** v1    0.2 CLI RX|
**** v1    0.2 CLI RX|First definition:
**** v1    0.2 CLI RX|('<vcl.inline>' Line 5 Pos 17)
**** v1    0.2 CLI RX|        backend first { .host = "127.0.0.1"; }
**** v1    0.2 CLI RX|----------------#####-------------------------
**** v1    0.2 CLI RX|
**** v1    0.2 CLI RX|Running VCC-compiler failed, exited with 2
**** v1    0.2 CLI RX|VCL compilation failed
**   v1    0.2 VCL compilation failed (as expected)
***  v1    0.2 Found expected string: ("Name 'first' already defined.")
*    top   0.2 RESETTING after ../../../bin/varnishtest/tests/r01510.vtc
**   v1    0.2 Wait
**** v1    0.2 CLI TX|backend.list
***  v1    0.2 CLI RX  101
**** v1    0.2 CLI RX|Unknown request in manager process (child not running).
**** v1    0.2 CLI RX|Type 'help' for more info.
**   v1    0.2 Stop
**** v1    0.2 CLI TX|stop
***  v1    0.2 CLI RX  300
**** v1    0.2 CLI RX|Child in state stopped
**** v1    0.2 CLI TX|status
***  v1    0.2 CLI RX  200
**** v1    0.2 CLI RX|Child in state stopped
**** v1    0.2 STDOUT poll 0x10
**   v1    0.2 R 42286 Status: 0000 (u 0.010000 s 0.032000)
*    diag  0.0 ............................................................
#    top  TEST ../../../bin/varnishtest/tests/r01510.vtc TIMED OUT (kill -9)
#    top  TEST ../../../bin/varnishtest/tests/r01510.vtc FAILED (60.004) signal=9

d3baf27

1 @ SunOS 5.11 i86pc 1.04 64_gcc4.7 uplex

*    top   0.0 TEST ../../../bin/varnishtest/tests/r01510.vtc starting
[...]
*    top   0.0 TEST Duplicate object names
[...]
**** v1    0.1 CLI TX|\tsub vcl_init {
**** v1    0.1 CLI TX|\t\tnew first = debug.obj("FOO");
**** v1    0.1 CLI TX|\t}
**** v1    0.1 CLI TX|
**** v1    0.1 CLI TX|%XJEIFLH|)Xspa8P
***  v1    0.1 CLI RX  106
**** v1    0.1 CLI RX|Message from VCC-compiler:
**** v1    0.1 CLI RX|Security: Privilege proc_setid missing, will not change uid/gid
**** v1    0.1 CLI RX|Name 'first' already defined.
**** v1    0.1 CLI RX|('<vcl.inline>' Line 8 Pos 21)
**** v1    0.1 CLI RX|                new first = debug.obj("FOO");
**** v1    0.1 CLI RX|--------------------#####--------------------
**** v1    0.1 CLI RX|
**** v1    0.1 CLI RX|First definition:
**** v1    0.1 CLI RX|('<vcl.inline>' Line 5 Pos 17)
**** v1    0.1 CLI RX|        backend first { .host = "127.0.0.1"; }
**** v1    0.1 CLI RX|----------------#####-------------------------
**** v1    0.1 CLI RX|
**** v1    0.1 CLI RX|Running VCC-compiler failed, exited with 2
**** v1    0.1 CLI RX|VCL compilation failed
**   v1    0.1 VCL compilation failed (as expected)
***  v1    0.1 Found expected string: ("Name 'first' already defined.")
*    top   0.1 RESETTING after ../../../bin/varnishtest/tests/r01510.vtc
**   v1    0.1 Wait
**** v1    0.1 CLI TX|backend.list
***  v1    0.1 CLI RX  101
**** v1    0.1 CLI RX|Unknown request in manager process (child not running).
**** v1    0.1 CLI RX|Type 'help' for more info.
**   v1    0.1 Stop
**** v1    0.1 CLI TX|stop
***  v1    0.1 CLI RX  300
**** v1    0.1 CLI RX|Child in state stopped
**** v1    0.1 CLI TX|status
***  v1    0.1 CLI RX  200
**** v1    0.1 CLI RX|Child in state stopped
**** v1    0.1 STDOUT poll 0x10
**   v1    0.1 R 35188 Status: 0000 (u 0.008000 s 0.025000)
*    diag  0.0 ............................................................
#    top  TEST ../../../bin/varnishtest/tests/r01510.vtc TIMED OUT (kill -9)
#    top  TEST ../../../bin/varnishtest/tests/r01510.vtc FAILED (60.004) signal=9

1 @ SunOS 5.11 i86pc 1.04 32_sun12.4 uplex

*    top   0.0 TEST ../../../bin/varnishtest/tests/r01510.vtc starting
[...]
*    top   0.0 TEST Duplicate object names
[...]
**** v1    0.1 CLI TX|\tsub vcl_init {
**** v1    0.1 CLI TX|\t\tnew first = debug.obj("FOO");
**** v1    0.1 CLI TX|\t}
**** v1    0.1 CLI TX|
**** v1    0.1 CLI TX|%XJEIFLH|)Xspa8P
***  v1    0.1 CLI RX  106
**** v1    0.1 CLI RX|Message from VCC-compiler:
**** v1    0.1 CLI RX|Security: Privilege proc_setid missing, will not change uid/gid
**** v1    0.1 CLI RX|Name 'first' already defined.
**** v1    0.1 CLI RX|('<vcl.inline>' Line 8 Pos 21)
**** v1    0.1 CLI RX|                new first = debug.obj("FOO");
**** v1    0.1 CLI RX|--------------------#####--------------------
**** v1    0.1 CLI RX|
**** v1    0.1 CLI RX|First definition:
**** v1    0.1 CLI RX|('<vcl.inline>' Line 5 Pos 17)
**** v1    0.1 CLI RX|        backend first { .host = "127.0.0.1"; }
**** v1    0.1 CLI RX|----------------#####-------------------------
**** v1    0.1 CLI RX|
**** v1    0.1 CLI RX|Running VCC-compiler failed, exited with 2
**** v1    0.1 CLI RX|VCL compilation failed
**   v1    0.1 VCL compilation failed (as expected)
***  v1    0.1 Found expected string: ("Name 'first' already defined.")
*    top   0.1 RESETTING after ../../../bin/varnishtest/tests/r01510.vtc
**   v1    0.1 Wait
**** v1    0.1 CLI TX|backend.list
***  v1    0.1 CLI RX  101
**** v1    0.1 CLI RX|Unknown request in manager process (child not running).
**** v1    0.1 CLI RX|Type 'help' for more info.
**   v1    0.1 Stop
**** v1    0.1 CLI TX|stop
***  v1    0.1 CLI RX  300
**** v1    0.1 CLI RX|Child in state stopped
**** v1    0.1 CLI TX|status
***  v1    0.1 CLI RX  200
**** v1    0.1 CLI RX|Child in state stopped
**** v1    0.1 STDOUT poll 0x10
**   v1    0.1 R 703 Status: 0000 (u 0.007000 s 0.022000)
*    diag  0.0 ............................................................
#    top  TEST ../../../bin/varnishtest/tests/r01510.vtc TIMED OUT (kill -9)
#    top  TEST ../../../bin/varnishtest/tests/r01510.vtc FAILED (60.002) signal=9

1 @ SunOS 5.11 i86pc 1.04 32_sun12.4 uplex

*    top   0.0 TEST ../../../bin/varnishtest/tests/r01510.vtc starting
[...]
*    top   0.0 TEST Duplicate object names
[...]
**** v1    0.1 CLI TX|\tsub vcl_init {
**** v1    0.1 CLI TX|\t\tnew first = debug.obj("FOO");
**** v1    0.1 CLI TX|\t}
**** v1    0.1 CLI TX|
**** v1    0.1 CLI TX|%XJEIFLH|)Xspa8P
***  v1    0.1 CLI RX  106
**** v1    0.1 CLI RX|Message from VCC-compiler:
**** v1    0.1 CLI RX|Security: Privilege proc_setid missing, will not change uid/gid
**** v1    0.1 CLI RX|Name 'first' already defined.
**** v1    0.1 CLI RX|('<vcl.inline>' Line 8 Pos 21)
**** v1    0.1 CLI RX|                new first = debug.obj("FOO");
**** v1    0.1 CLI RX|--------------------#####--------------------
**** v1    0.1 CLI RX|
**** v1    0.1 CLI RX|First definition:
**** v1    0.1 CLI RX|('<vcl.inline>' Line 5 Pos 17)
**** v1    0.1 CLI RX|        backend first { .host = "127.0.0.1"; }
**** v1    0.1 CLI RX|----------------#####-------------------------
**** v1    0.1 CLI RX|
**** v1    0.1 CLI RX|Running VCC-compiler failed, exited with 2
**** v1    0.1 CLI RX|VCL compilation failed
**   v1    0.1 VCL compilation failed (as expected)
***  v1    0.1 Found expected string: ("Name 'first' already defined.")
*    top   0.1 RESETTING after ../../../bin/varnishtest/tests/r01510.vtc
**   v1    0.1 Wait
**** v1    0.1 CLI TX|backend.list
***  v1    0.1 CLI RX  101
**** v1    0.1 CLI RX|Unknown request in manager process (child not running).
**** v1    0.1 CLI RX|Type 'help' for more info.
**   v1    0.1 Stop
**** v1    0.1 CLI TX|stop
***  v1    0.1 CLI RX  300
**** v1    0.1 CLI RX|Child in state stopped
**** v1    0.1 CLI TX|status
***  v1    0.1 CLI RX  200
**** v1    0.1 CLI RX|Child in state stopped
**** v1    0.1 STDOUT poll 0x10
**   v1    0.1 R 21148 Status: 0000 (u 0.005000 s 0.018000)
*    diag  0.0 ............................................................
#    top  TEST ../../../bin/varnishtest/tests/r01510.vtc TIMED OUT (kill -9)
#    top  TEST ../../../bin/varnishtest/tests/r01510.vtc FAILED (60.002) signal=9

1 @ SunOS 5.11 i86pc 1.04 32_sun12.4 uplex

*    top   0.0 TEST ../../../bin/varnishtest/tests/r01510.vtc starting
[...]
*    top   0.0 TEST Duplicate object names
[...]
**** v1    0.1 CLI TX|\tsub vcl_init {
**** v1    0.1 CLI TX|\t\tnew first = debug.obj("FOO");
**** v1    0.1 CLI TX|\t}
**** v1    0.1 CLI TX|
**** v1    0.1 CLI TX|%XJEIFLH|)Xspa8P
***  v1    0.1 CLI RX  106
**** v1    0.1 CLI RX|Message from VCC-compiler:
**** v1    0.1 CLI RX|Security: Privilege proc_setid missing, will not change uid/gid
**** v1    0.1 CLI RX|Name 'first' already defined.
**** v1    0.1 CLI RX|('<vcl.inline>' Line 8 Pos 21)
**** v1    0.1 CLI RX|                new first = debug.obj("FOO");
**** v1    0.1 CLI RX|--------------------#####--------------------
**** v1    0.1 CLI RX|
**** v1    0.1 CLI RX|First definition:
**** v1    0.1 CLI RX|('<vcl.inline>' Line 5 Pos 17)
**** v1    0.1 CLI RX|        backend first { .host = "127.0.0.1"; }
**** v1    0.1 CLI RX|----------------#####-------------------------
**** v1    0.1 CLI RX|
**** v1    0.1 CLI RX|Running VCC-compiler failed, exited with 2
**** v1    0.1 CLI RX|VCL compilation failed
**   v1    0.1 VCL compilation failed (as expected)
***  v1    0.1 Found expected string: ("Name 'first' already defined.")
*    top   0.1 RESETTING after ../../../bin/varnishtest/tests/r01510.vtc
**   v1    0.1 Wait
**** v1    0.1 CLI TX|backend.list
***  v1    0.1 CLI RX  101
**** v1    0.1 CLI RX|Unknown request in manager process (child not running).
**** v1    0.1 CLI RX|Type 'help' for more info.
**   v1    0.1 Stop
**** v1    0.1 CLI TX|stop
***  v1    0.1 CLI RX  300
**** v1    0.1 CLI RX|Child in state stopped
**** v1    0.1 CLI TX|status
***  v1    0.1 CLI RX  200
**** v1    0.1 CLI RX|Child in state stopped
**** v1    0.1 STDOUT poll 0x10
**   v1    0.1 R 82184 Status: 0000 (u 0.005000 s 0.018000)
*    diag  0.0 ............................................................
#    top  TEST ../../../bin/varnishtest/tests/r01510.vtc TIMED OUT (kill -9)
#    top  TEST ../../../bin/varnishtest/tests/r01510.vtc FAILED (60.002) signal=9

1 @ SunOS 5.11 i86pc 1.04 64_gcc4.7 uplex

*    top   0.0 TEST ../../../bin/varnishtest/tests/r01510.vtc starting
[...]
*    top   0.0 TEST Duplicate object names
[...]
**** v1    0.1 CLI TX|\tsub vcl_init {
**** v1    0.1 CLI TX|\t\tnew first = debug.obj("FOO");
**** v1    0.1 CLI TX|\t}
**** v1    0.1 CLI TX|
**** v1    0.1 CLI TX|%XJEIFLH|)Xspa8P
***  v1    0.1 CLI RX  106
**** v1    0.1 CLI RX|Message from VCC-compiler:
**** v1    0.1 CLI RX|Security: Privilege proc_setid missing, will not change uid/gid
**** v1    0.1 CLI RX|Name 'first' already defined.
**** v1    0.1 CLI RX|('<vcl.inline>' Line 8 Pos 21)
**** v1    0.1 CLI RX|                new first = debug.obj("FOO");
**** v1    0.1 CLI RX|--------------------#####--------------------
**** v1    0.1 CLI RX|
**** v1    0.1 CLI RX|First definition:
**** v1    0.1 CLI RX|('<vcl.inline>' Line 5 Pos 17)
**** v1    0.1 CLI RX|        backend first { .host = "127.0.0.1"; }
**** v1    0.1 CLI RX|----------------#####-------------------------
**** v1    0.1 CLI RX|
**** v1    0.1 CLI RX|Running VCC-compiler failed, exited with 2
**** v1    0.1 CLI RX|VCL compilation failed
**   v1    0.1 VCL compilation failed (as expected)
***  v1    0.1 Found expected string: ("Name 'first' already defined.")
*    top   0.1 RESETTING after ../../../bin/varnishtest/tests/r01510.vtc
**   v1    0.1 Wait
**** v1    0.1 CLI TX|backend.list
***  v1    0.1 CLI RX  101
**** v1    0.1 CLI RX|Unknown request in manager process (child not running).
**** v1    0.1 CLI RX|Type 'help' for more info.
**   v1    0.1 Stop
**** v1    0.1 CLI TX|stop
***  v1    0.1 CLI RX  300
**** v1    0.1 CLI RX|Child in state stopped
**** v1    0.1 CLI TX|status
***  v1    0.1 CLI RX  200
**** v1    0.1 CLI RX|Child in state stopped
**** v1    0.1 STDOUT poll 0x10
**   v1    0.1 R 58079 Status: 0000 (u 0.008000 s 0.027000)
*    diag  0.0 ............................................................
#    top  TEST ../../../bin/varnishtest/tests/r01510.vtc TIMED OUT (kill -9)
#    top  TEST ../../../bin/varnishtest/tests/r01510.vtc FAILED (60.004) signal=9

1 @ SunOS 5.11 i86pc 1.04 64_gcc4.7 uplex

*    top   0.0 TEST ../../../bin/varnishtest/tests/r01510.vtc starting
[...]
*    top   0.0 TEST Duplicate object names
[...]
**** v1    0.1 CLI TX|\tsub vcl_init {
**** v1    0.1 CLI TX|\t\tnew first = debug.obj("FOO");
**** v1    0.1 CLI TX|\t}
**** v1    0.1 CLI TX|
**** v1    0.1 CLI TX|%XJEIFLH|)Xspa8P
***  v1    0.1 CLI RX  106
**** v1    0.1 CLI RX|Message from VCC-compiler:
**** v1    0.1 CLI RX|Security: Privilege proc_setid missing, will not change uid/gid
**** v1    0.1 CLI RX|Name 'first' already defined.
**** v1    0.1 CLI RX|('<vcl.inline>' Line 8 Pos 21)
**** v1    0.1 CLI RX|                new first = debug.obj("FOO");
**** v1    0.1 CLI RX|--------------------#####--------------------
**** v1    0.1 CLI RX|
**** v1    0.1 CLI RX|First definition:
**** v1    0.1 CLI RX|('<vcl.inline>' Line 5 Pos 17)
**** v1    0.1 CLI RX|        backend first { .host = "127.0.0.1"; }
**** v1    0.1 CLI RX|----------------#####-------------------------
**** v1    0.1 CLI RX|
**** v1    0.1 CLI RX|Running VCC-compiler failed, exited with 2
**** v1    0.1 CLI RX|VCL compilation failed
**   v1    0.1 VCL compilation failed (as expected)
***  v1    0.1 Found expected string: ("Name 'first' already defined.")
*    top   0.1 RESETTING after ../../../bin/varnishtest/tests/r01510.vtc
**   v1    0.1 Wait
**** v1    0.1 CLI TX|backend.list
***  v1    0.1 CLI RX  101
**** v1    0.1 CLI RX|Unknown request in manager process (child not running).
**** v1    0.1 CLI RX|Type 'help' for more info.
**   v1    0.1 Stop
**** v1    0.1 CLI TX|stop
***  v1    0.1 CLI RX  300
**** v1    0.1 CLI RX|Child in state stopped
**** v1    0.1 CLI TX|status
***  v1    0.1 CLI RX  200
**** v1    0.1 CLI RX|Child in state stopped
**** v1    0.1 STDOUT poll 0x10
**   v1    0.1 R 35171 Status: 0000 (u 0.008000 s 0.026000)
*    diag  0.0 ............................................................
#    top  TEST ../../../bin/varnishtest/tests/r01510.vtc TIMED OUT (kill -9)
#    top  TEST ../../../bin/varnishtest/tests/r01510.vtc FAILED (60.004) signal=9

1 @ SunOS 5.11 i86pc 1.04 32_sun12.4 uplex

*    top   0.0 TEST ../../../bin/varnishtest/tests/r01510.vtc starting
[...]
*    top   0.0 TEST Duplicate object names
[...]
**** v1    0.1 CLI TX|\tsub vcl_init {
**** v1    0.1 CLI TX|\t\tnew first = debug.obj("FOO");
**** v1    0.1 CLI TX|\t}
**** v1    0.1 CLI TX|
**** v1    0.1 CLI TX|%XJEIFLH|)Xspa8P
***  v1    0.1 CLI RX  106
**** v1    0.1 CLI RX|Message from VCC-compiler:
**** v1    0.1 CLI RX|Security: Privilege proc_setid missing, will not change uid/gid
**** v1    0.1 CLI RX|Name 'first' already defined.
**** v1    0.1 CLI RX|('<vcl.inline>' Line 8 Pos 21)
**** v1    0.1 CLI RX|                new first = debug.obj("FOO");
**** v1    0.1 CLI RX|--------------------#####--------------------
**** v1    0.1 CLI RX|
**** v1    0.1 CLI RX|First definition:
**** v1    0.1 CLI RX|('<vcl.inline>' Line 5 Pos 17)
**** v1    0.1 CLI RX|        backend first { .host = "127.0.0.1"; }
**** v1    0.1 CLI RX|----------------#####-------------------------
**** v1    0.1 CLI RX|
**** v1    0.1 CLI RX|Running VCC-compiler failed, exited with 2
**** v1    0.1 CLI RX|VCL compilation failed
**   v1    0.1 VCL compilation failed (as expected)
***  v1    0.1 Found expected string: ("Name 'first' already defined.")
*    top   0.1 RESETTING after ../../../bin/varnishtest/tests/r01510.vtc
**   v1    0.1 Wait
**** v1    0.1 CLI TX|backend.list
***  v1    0.1 CLI RX  101
**** v1    0.1 CLI RX|Unknown request in manager process (child not running).
**** v1    0.1 CLI RX|Type 'help' for more info.
**   v1    0.1 Stop
**** v1    0.1 CLI TX|stop
***  v1    0.1 CLI RX  300
**** v1    0.1 CLI RX|Child in state stopped
**** v1    0.1 CLI TX|status
***  v1    0.1 CLI RX  200
**** v1    0.1 CLI RX|Child in state stopped
**** v1    0.1 STDOUT poll 0x10
**   v1    0.1 R 248 Status: 0000 (u 0.005000 s 0.018000)
*    diag  0.0 ............................................................
#    top  TEST ../../../bin/varnishtest/tests/r01510.vtc TIMED OUT (kill -9)
#    top  TEST ../../../bin/varnishtest/tests/r01510.vtc FAILED (60.002) signal=9

1 @ SunOS 5.11 i86pc 1.04 32_sun12.4 uplex

*    top   0.0 TEST ../../../bin/varnishtest/tests/r01510.vtc starting
[...]
*    top   0.0 TEST Duplicate object names
[...]
**** v1    0.1 CLI TX|\tsub vcl_init {
**** v1    0.1 CLI TX|\t\tnew first = debug.obj("FOO");
**** v1    0.1 CLI TX|\t}
**** v1    0.1 CLI TX|
**** v1    0.1 CLI TX|%XJEIFLH|)Xspa8P
***  v1    0.1 CLI RX  106
**** v1    0.1 CLI RX|Message from VCC-compiler:
**** v1    0.1 CLI RX|Security: Privilege proc_setid missing, will not change uid/gid
**** v1    0.1 CLI RX|Name 'first' already defined.
**** v1    0.1 CLI RX|('<vcl.inline>' Line 8 Pos 21)
**** v1    0.1 CLI RX|                new first = debug.obj("FOO");
**** v1    0.1 CLI RX|--------------------#####--------------------
**** v1    0.1 CLI RX|
**** v1    0.1 CLI RX|First definition:
**** v1    0.1 CLI RX|('<vcl.inline>' Line 5 Pos 17)
**** v1    0.1 CLI RX|        backend first { .host = "127.0.0.1"; }
**** v1    0.1 CLI RX|----------------#####-------------------------
**** v1    0.1 CLI RX|
**** v1    0.1 CLI RX|Running VCC-compiler failed, exited with 2
**** v1    0.1 CLI RX|VCL compilation failed
**   v1    0.1 VCL compilation failed (as expected)
***  v1    0.1 Found expected string: ("Name 'first' already defined.")
*    top   0.1 RESETTING after ../../../bin/varnishtest/tests/r01510.vtc
**   v1    0.1 Wait
**** v1    0.1 CLI TX|backend.list
***  v1    0.1 CLI RX  101
**** v1    0.1 CLI RX|Unknown request in manager process (child not running).
**** v1    0.1 CLI RX|Type 'help' for more info.
**   v1    0.1 Stop
**** v1    0.1 CLI TX|stop
***  v1    0.1 CLI RX  300
**** v1    0.1 CLI RX|Child in state stopped
**** v1    0.1 CLI TX|status
***  v1    0.1 CLI RX  200
**** v1    0.1 CLI RX|Child in state stopped
**** v1    0.1 STDOUT poll 0x10
**   v1    0.1 R 8141 Status: 0000 (u 0.006000 s 0.020000)
*    diag  0.0 ............................................................
#    top  TEST ../../../bin/varnishtest/tests/r01510.vtc TIMED OUT (kill -9)
#    top  TEST ../../../bin/varnishtest/tests/r01510.vtc FAILED (60.002) signal=9

1 @ SunOS 5.11 i86pc 1.04 64_gcc4.7 uplex

*    top   0.0 TEST ../../../bin/varnishtest/tests/r01510.vtc starting
[...]
*    top   0.0 TEST Duplicate object names
[...]
**** v1    0.1 CLI TX|\tsub vcl_init {
**** v1    0.1 CLI TX|\t\tnew first = debug.obj("FOO");
**** v1    0.1 CLI TX|\t}
**** v1    0.1 CLI TX|
**** v1    0.1 CLI TX|%XJEIFLH|)Xspa8P
***  v1    0.1 CLI RX  106
**** v1    0.1 CLI RX|Message from VCC-compiler:
**** v1    0.1 CLI RX|Security: Privilege proc_setid missing, will not change uid/gid
**** v1    0.1 CLI RX|Name 'first' already defined.
**** v1    0.1 CLI RX|('<vcl.inline>' Line 8 Pos 21)
**** v1    0.1 CLI RX|                new first = debug.obj("FOO");
**** v1    0.1 CLI RX|--------------------#####--------------------
**** v1    0.1 CLI RX|
**** v1    0.1 CLI RX|First definition:
**** v1    0.1 CLI RX|('<vcl.inline>' Line 5 Pos 17)
**** v1    0.1 CLI RX|        backend first { .host = "127.0.0.1"; }
**** v1    0.1 CLI RX|----------------#####-------------------------
**** v1    0.1 CLI RX|
**** v1    0.1 CLI RX|Running VCC-compiler failed, exited with 2
**** v1    0.1 CLI RX|VCL compilation failed
**   v1    0.1 VCL compilation failed (as expected)
***  v1    0.1 Found expected string: ("Name 'first' already defined.")
*    top   0.1 RESETTING after ../../../bin/varnishtest/tests/r01510.vtc
**   v1    0.1 Wait
**** v1    0.1 CLI TX|backend.list
***  v1    0.1 CLI RX  101
**** v1    0.1 CLI RX|Unknown request in manager process (child not running).
**** v1    0.1 CLI RX|Type 'help' for more info.
**   v1    0.1 Stop
**** v1    0.1 CLI TX|stop
***  v1    0.1 CLI RX  300
**** v1    0.1 CLI RX|Child in state stopped
**** v1    0.1 CLI TX|status
***  v1    0.1 CLI RX  200
**** v1    0.1 CLI RX|Child in state stopped
**** v1    0.1 STDOUT poll 0x10
**   v1    0.1 R 8210 Status: 0000 (u 0.008000 s 0.026000)
*    diag  0.0 ............................................................
#    top  TEST ../../../bin/varnishtest/tests/r01510.vtc TIMED OUT (kill -9)
#    top  TEST ../../../bin/varnishtest/tests/r01510.vtc FAILED (60.004) signal=9

1 @ SunOS 5.11 i86pc 1.04 32_sun12.4 uplex

*    top   0.0 TEST ../../../bin/varnishtest/tests/r01510.vtc starting
[...]
*    top   0.0 TEST Duplicate object names
[...]
**** v1    0.1 CLI TX|\tsub vcl_init {
**** v1    0.1 CLI TX|\t\tnew first = debug.obj("FOO");
**** v1    0.1 CLI TX|\t}
**** v1    0.1 CLI TX|
**** v1    0.1 CLI TX|%XJEIFLH|)Xspa8P
***  v1    0.1 CLI RX  106
**** v1    0.1 CLI RX|Message from VCC-compiler:
**** v1    0.1 CLI RX|Security: Privilege proc_setid missing, will not change uid/gid
**** v1    0.1 CLI RX|Name 'first' already defined.
**** v1    0.1 CLI RX|('<vcl.inline>' Line 8 Pos 21)
**** v1    0.1 CLI RX|                new first = debug.obj("FOO");
**** v1    0.1 CLI RX|--------------------#####--------------------
**** v1    0.1 CLI RX|
**** v1    0.1 CLI RX|First definition:
**** v1    0.1 CLI RX|('<vcl.inline>' Line 5 Pos 17)
**** v1    0.1 CLI RX|        backend first { .host = "127.0.0.1"; }
**** v1    0.1 CLI RX|----------------#####-------------------------
**** v1    0.1 CLI RX|
**** v1    0.1 CLI RX|Running VCC-compiler failed, exited with 2
**** v1    0.1 CLI RX|VCL compilation failed
**   v1    0.1 VCL compilation failed (as expected)
***  v1    0.1 Found expected string: ("Name 'first' already defined.")
*    top   0.1 RESETTING after ../../../bin/varnishtest/tests/r01510.vtc
**   v1    0.1 Wait
**** v1    0.1 CLI TX|backend.list
***  v1    0.1 CLI RX  101
**** v1    0.1 CLI RX|Unknown request in manager process (child not running).
**** v1    0.1 CLI RX|Type 'help' for more info.
**   v1    0.1 Stop
**** v1    0.1 CLI TX|stop
***  v1    0.1 CLI RX  300
**** v1    0.1 CLI RX|Child in state stopped
**** v1    0.1 CLI TX|status
***  v1    0.1 CLI RX  200
**** v1    0.1 CLI RX|Child in state stopped
**** v1    0.1 STDOUT poll 0x10
**   v1    0.1 R 12322 Status: 0000 (u 0.005000 s 0.020000)
*    diag  0.0 ............................................................
#    top  TEST ../../../bin/varnishtest/tests/r01510.vtc TIMED OUT (kill -9)
#    top  TEST ../../../bin/varnishtest/tests/r01510.vtc FAILED (60.002) signal=9

1 @ SunOS 5.11 i86pc 1.04 64_gcc4.7 uplex

*    top   0.0 TEST ../../../bin/varnishtest/tests/r01510.vtc starting
[...]
*    top   0.0 TEST Duplicate object names
[...]
**** v1    0.1 CLI TX|\tsub vcl_init {
**** v1    0.1 CLI TX|\t\tnew first = debug.obj("FOO");
**** v1    0.1 CLI TX|\t}
**** v1    0.1 CLI TX|
**** v1    0.1 CLI TX|%XJEIFLH|)Xspa8P
***  v1    0.1 CLI RX  106
**** v1    0.1 CLI RX|Message from VCC-compiler:
**** v1    0.1 CLI RX|Security: Privilege proc_setid missing, will not change uid/gid
**** v1    0.1 CLI RX|Name 'first' already defined.
**** v1    0.1 CLI RX|('<vcl.inline>' Line 8 Pos 21)
**** v1    0.1 CLI RX|                new first = debug.obj("FOO");
**** v1    0.1 CLI RX|--------------------#####--------------------
**** v1    0.1 CLI RX|
**** v1    0.1 CLI RX|First definition:
**** v1    0.1 CLI RX|('<vcl.inline>' Line 5 Pos 17)
**** v1    0.1 CLI RX|        backend first { .host = "127.0.0.1"; }
**** v1    0.1 CLI RX|----------------#####-------------------------
**** v1    0.1 CLI RX|
**** v1    0.1 CLI RX|Running VCC-compiler failed, exited with 2
**** v1    0.1 CLI RX|VCL compilation failed
**   v1    0.1 VCL compilation failed (as expected)
***  v1    0.1 Found expected string: ("Name 'first' already defined.")
*    top   0.1 RESETTING after ../../../bin/varnishtest/tests/r01510.vtc
**   v1    0.1 Wait
**** v1    0.1 CLI TX|backend.list
***  v1    0.1 CLI RX  101
**** v1    0.1 CLI RX|Unknown request in manager process (child not running).
**** v1    0.1 CLI RX|Type 'help' for more info.
**   v1    0.1 Stop
**** v1    0.1 CLI TX|stop
***  v1    0.1 CLI RX  300
**** v1    0.1 CLI RX|Child in state stopped
**** v1    0.1 CLI TX|status
***  v1    0.1 CLI RX  200
**** v1    0.1 CLI RX|Child in state stopped
**** v1    0.1 STDOUT poll 0x10
**   v1    0.1 R 76705 Status: 0000 (u 0.008000 s 0.027000)
*    diag  0.0 ............................................................
#    top  TEST ../../../bin/varnishtest/tests/r01510.vtc TIMED OUT (kill -9)
#    top  TEST ../../../bin/varnishtest/tests/r01510.vtc FAILED (60.003) signal=9

1 @ SunOS 5.11 i86pc 1.04 32_sun12.4 uplex

*    top   0.0 TEST ../../../bin/varnishtest/tests/r01510.vtc starting
[...]
*    top   0.0 TEST Duplicate object names
[...]
**** v1    0.1 CLI TX|\tsub vcl_init {
**** v1    0.1 CLI TX|\t\tnew first = debug.obj("FOO");
**** v1    0.1 CLI TX|\t}
**** v1    0.1 CLI TX|
**** v1    0.1 CLI TX|%XJEIFLH|)Xspa8P
***  v1    0.1 CLI RX  106
**** v1    0.1 CLI RX|Message from VCC-compiler:
**** v1    0.1 CLI RX|Security: Privilege proc_setid missing, will not change uid/gid
**** v1    0.1 CLI RX|Name 'first' already defined.
**** v1    0.1 CLI RX|('<vcl.inline>' Line 8 Pos 21)
**** v1    0.1 CLI RX|                new first = debug.obj("FOO");
**** v1    0.1 CLI RX|--------------------#####--------------------
**** v1    0.1 CLI RX|
**** v1    0.1 CLI RX|First definition:
**** v1    0.1 CLI RX|('<vcl.inline>' Line 5 Pos 17)
**** v1    0.1 CLI RX|        backend first { .host = "127.0.0.1"; }
**** v1    0.1 CLI RX|----------------#####-------------------------
**** v1    0.1 CLI RX|
**** v1    0.1 CLI RX|Running VCC-compiler failed, exited with 2
**** v1    0.1 CLI RX|VCL compilation failed
**   v1    0.1 VCL compilation failed (as expected)
***  v1    0.1 Found expected string: ("Name 'first' already defined.")
*    top   0.1 RESETTING after ../../../bin/varnishtest/tests/r01510.vtc
**   v1    0.1 Wait
**** v1    0.1 CLI TX|backend.list
***  v1    0.1 CLI RX  101
**** v1    0.1 CLI RX|Unknown request in manager process (child not running).
**** v1    0.1 CLI RX|Type 'help' for more info.
**   v1    0.1 Stop
**** v1    0.1 CLI TX|stop
***  v1    0.1 CLI RX  300
**** v1    0.1 CLI RX|Child in state stopped
**** v1    0.1 CLI TX|status
***  v1    0.1 CLI RX  200
**** v1    0.1 CLI RX|Child in state stopped
**** v1    0.1 STDOUT poll 0x10
**   v1    0.1 R 96771 Status: 0000 (u 0.005000 s 0.019000)
*    diag  0.0 ............................................................
#    top  TEST ../../../bin/varnishtest/tests/r01510.vtc TIMED OUT (kill -9)
#    top  TEST ../../../bin/varnishtest/tests/r01510.vtc FAILED (60.002) signal=9

1 @ SunOS 5.11 i86pc 1.04 64_gcc4.7 uplex

*    top   0.0 TEST ../../../bin/varnishtest/tests/r01510.vtc starting
[...]
*    top   0.0 TEST Duplicate object names
[...]
**** v1    0.2 CLI TX|\tsub vcl_init {
**** v1    0.2 CLI TX|\t\tnew first = debug.obj("FOO");
**** v1    0.2 CLI TX|\t}
**** v1    0.2 CLI TX|
**** v1    0.2 CLI TX|%XJEIFLH|)Xspa8P
***  v1    0.2 CLI RX  106
**** v1    0.2 CLI RX|Message from VCC-compiler:
**** v1    0.2 CLI RX|Security: Privilege proc_setid missing, will not change uid/gid
**** v1    0.2 CLI RX|Name 'first' already defined.
**** v1    0.2 CLI RX|('<vcl.inline>' Line 8 Pos 21)
**** v1    0.2 CLI RX|                new first = debug.obj("FOO");
**** v1    0.2 CLI RX|--------------------#####--------------------
**** v1    0.2 CLI RX|
**** v1    0.2 CLI RX|First definition:
**** v1    0.2 CLI RX|('<vcl.inline>' Line 5 Pos 17)
**** v1    0.2 CLI RX|        backend first { .host = "127.0.0.1"; }
**** v1    0.2 CLI RX|----------------#####-------------------------
**** v1    0.2 CLI RX|
**** v1    0.2 CLI RX|Running VCC-compiler failed, exited with 2
**** v1    0.2 CLI RX|VCL compilation failed
**   v1    0.2 VCL compilation failed (as expected)
***  v1    0.2 Found expected string: ("Name 'first' already defined.")
*    top   0.2 RESETTING after ../../../bin/varnishtest/tests/r01510.vtc
**   v1    0.2 Wait
**** v1    0.2 CLI TX|backend.list
***  v1    0.2 CLI RX  101
**** v1    0.2 CLI RX|Unknown request in manager process (child not running).
**** v1    0.2 CLI RX|Type 'help' for more info.
**   v1    0.2 Stop
**** v1    0.2 CLI TX|stop
***  v1    0.2 CLI RX  300
**** v1    0.2 CLI RX|Child in state stopped
**** v1    0.2 CLI TX|status
***  v1    0.2 CLI RX  200
**** v1    0.2 CLI RX|Child in state stopped
**** v1    0.2 STDOUT poll 0x10
**   v1    0.2 R 64591 Status: 0000 (u 0.013000 s 0.042000)
*    diag  0.0 ............................................................
#    top  TEST ../../../bin/varnishtest/tests/r01510.vtc TIMED OUT (kill -9)
#    top  TEST ../../../bin/varnishtest/tests/r01510.vtc FAILED (60.005) signal=9

1 @ SunOS 5.11 i86pc 1.04 64_gcc4.7 uplex

*    top   0.0 TEST ../../../bin/varnishtest/tests/r01510.vtc starting
[...]
*    top   0.0 TEST Duplicate object names
[...]
**** v1    0.1 CLI TX|\tsub vcl_init {
**** v1    0.1 CLI TX|\t\tnew first = debug.obj("FOO");
**** v1    0.1 CLI TX|\t}
**** v1    0.1 CLI TX|
**** v1    0.1 CLI TX|%XJEIFLH|)Xspa8P
***  v1    0.1 CLI RX  106
**** v1    0.1 CLI RX|Message from VCC-compiler:
**** v1    0.1 CLI RX|Security: Privilege proc_setid missing, will not change uid/gid
**** v1    0.1 CLI RX|Name 'first' already defined.
**** v1    0.1 CLI RX|('<vcl.inline>' Line 8 Pos 21)
**** v1    0.1 CLI RX|                new first = debug.obj("FOO");
**** v1    0.1 CLI RX|--------------------#####--------------------
**** v1    0.1 CLI RX|
**** v1    0.1 CLI RX|First definition:
**** v1    0.1 CLI RX|('<vcl.inline>' Line 5 Pos 17)
**** v1    0.1 CLI RX|        backend first { .host = "127.0.0.1"; }
**** v1    0.1 CLI RX|----------------#####-------------------------
**** v1    0.1 CLI RX|
**** v1    0.1 CLI RX|Running VCC-compiler failed, exited with 2
**** v1    0.1 CLI RX|VCL compilation failed
**   v1    0.1 VCL compilation failed (as expected)
***  v1    0.1 Found expected string: ("Name 'first' already defined.")
*    top   0.1 RESETTING after ../../../bin/varnishtest/tests/r01510.vtc
**   v1    0.1 Wait
**** v1    0.1 CLI TX|backend.list
***  v1    0.1 CLI RX  101
**** v1    0.1 CLI RX|Unknown request in manager process (child not running).
**** v1    0.1 CLI RX|Type 'help' for more info.
**   v1    0.1 Stop
**** v1    0.1 CLI TX|stop
***  v1    0.1 CLI RX  300
**** v1    0.1 CLI RX|Child in state stopped
**** v1    0.1 CLI TX|status
***  v1    0.1 CLI RX  200
**** v1    0.1 CLI RX|Child in state stopped
**** v1    0.1 STDOUT poll 0x10
**   v1    0.2 R 18292 Status: 0000 (u 0.009000 s 0.030000)
*    diag  0.0 ............................................................
#    top  TEST ../../../bin/varnishtest/tests/r01510.vtc TIMED OUT (kill -9)
#    top  TEST ../../../bin/varnishtest/tests/r01510.vtc FAILED (60.004) signal=9

1 @ SunOS 5.11 i86pc 1.04 64_gcc4.7 uplex

*    top   0.0 TEST ../../../bin/varnishtest/tests/r01510.vtc starting
[...]
*    top   0.0 TEST Duplicate object names
[...]
**** v1    0.1 CLI TX|\tsub vcl_init {
**** v1    0.1 CLI TX|\t\tnew first = debug.obj("FOO");
**** v1    0.1 CLI TX|\t}
**** v1    0.1 CLI TX|
**** v1    0.1 CLI TX|%XJEIFLH|)Xspa8P
***  v1    0.1 CLI RX  106
**** v1    0.1 CLI RX|Message from VCC-compiler:
**** v1    0.1 CLI RX|Security: Privilege proc_setid missing, will not change uid/gid
**** v1    0.1 CLI RX|Name 'first' already defined.
**** v1    0.1 CLI RX|('<vcl.inline>' Line 8 Pos 21)
**** v1    0.1 CLI RX|                new first = debug.obj("FOO");
**** v1    0.1 CLI RX|--------------------#####--------------------
**** v1    0.1 CLI RX|
**** v1    0.1 CLI RX|First definition:
**** v1    0.1 CLI RX|('<vcl.inline>' Line 5 Pos 17)
**** v1    0.1 CLI RX|        backend first { .host = "127.0.0.1"; }
**** v1    0.1 CLI RX|----------------#####-------------------------
**** v1    0.1 CLI RX|
**** v1    0.1 CLI RX|Running VCC-compiler failed, exited with 2
**** v1    0.1 CLI RX|VCL compilation failed
**   v1    0.1 VCL compilation failed (as expected)
***  v1    0.1 Found expected string: ("Name 'first' already defined.")
*    top   0.1 RESETTING after ../../../bin/varnishtest/tests/r01510.vtc
**   v1    0.1 Wait
**** v1    0.1 CLI TX|backend.list
***  v1    0.1 CLI RX  101
**** v1    0.1 CLI RX|Unknown request in manager process (child not running).
**** v1    0.1 CLI RX|Type 'help' for more info.
**   v1    0.1 Stop
**** v1    0.1 CLI TX|stop
***  v1    0.1 CLI RX  300
**** v1    0.1 CLI RX|Child in state stopped
**** v1    0.1 CLI TX|status
***  v1    0.1 CLI RX  200
**** v1    0.1 CLI RX|Child in state stopped
**** v1    0.1 STDOUT poll 0x10
**   v1    0.1 R 73856 Status: 0000 (u 0.008000 s 0.029000)
*    diag  0.0 ............................................................
#    top  TEST ../../../bin/varnishtest/tests/r01510.vtc TIMED OUT (kill -9)
#    top  TEST ../../../bin/varnishtest/tests/r01510.vtc FAILED (60.003) signal=9

1 @ SunOS 5.11 i86pc 1.04 32_sun12.4 uplex

*    top   0.0 TEST ../../../bin/varnishtest/tests/r01510.vtc starting
[...]
*    top   0.0 TEST Duplicate object names
[...]
**** v1    0.1 CLI TX|\tsub vcl_init {
**** v1    0.1 CLI TX|\t\tnew first = debug.obj("FOO");
**** v1    0.1 CLI TX|\t}
**** v1    0.1 CLI TX|
**** v1    0.1 CLI TX|%XJEIFLH|)Xspa8P
***  v1    0.1 CLI RX  106
**** v1    0.1 CLI RX|Message from VCC-compiler:
**** v1    0.1 CLI RX|Security: Privilege proc_setid missing, will not change uid/gid
**** v1    0.1 CLI RX|Name 'first' already defined.
**** v1    0.1 CLI RX|('<vcl.inline>' Line 8 Pos 21)
**** v1    0.1 CLI RX|                new first = debug.obj("FOO");
**** v1    0.1 CLI RX|--------------------#####--------------------
**** v1    0.1 CLI RX|
**** v1    0.1 CLI RX|First definition:
**** v1    0.1 CLI RX|('<vcl.inline>' Line 5 Pos 17)
**** v1    0.1 CLI RX|        backend first { .host = "127.0.0.1"; }
**** v1    0.1 CLI RX|----------------#####-------------------------
**** v1    0.1 CLI RX|
**** v1    0.1 CLI RX|Running VCC-compiler failed, exited with 2
**** v1    0.1 CLI RX|VCL compilation failed
**   v1    0.1 VCL compilation failed (as expected)
***  v1    0.1 Found expected string: ("Name 'first' already defined.")
*    top   0.1 RESETTING after ../../../bin/varnishtest/tests/r01510.vtc
**   v1    0.1 Wait
**** v1    0.1 CLI TX|backend.list
***  v1    0.1 CLI RX  101
**** v1    0.1 CLI RX|Unknown request in manager process (child not running).
**** v1    0.1 CLI RX|Type 'help' for more info.
**   v1    0.1 Stop
**** v1    0.1 CLI TX|stop
***  v1    0.1 CLI RX  300
**** v1    0.1 CLI RX|Child in state stopped
**** v1    0.1 CLI TX|status
***  v1    0.1 CLI RX  200
**** v1    0.1 CLI RX|Child in state stopped
**** v1    0.1 STDOUT poll 0x10
**   v1    0.1 R 99830 Status: 0000 (u 0.006000 s 0.021000)
*    diag  0.0 ............................................................
#    top  TEST ../../../bin/varnishtest/tests/r01510.vtc TIMED OUT (kill -9)
#    top  TEST ../../../bin/varnishtest/tests/r01510.vtc FAILED (60.002) signal=9

1 @ SunOS 5.11 i86pc 1.04 32_sun12.4 uplex

*    top   0.0 TEST ../../../bin/varnishtest/tests/r01510.vtc starting
[...]
*    top   0.0 TEST Duplicate object names
[...]
**** v1    0.1 CLI TX|\tsub vcl_init {
**** v1    0.1 CLI TX|\t\tnew first = debug.obj("FOO");
**** v1    0.1 CLI TX|\t}
**** v1    0.1 CLI TX|
**** v1    0.1 CLI TX|%XJEIFLH|)Xspa8P
***  v1    0.1 CLI RX  106
**** v1    0.1 CLI RX|Message from VCC-compiler:
**** v1    0.1 CLI RX|Security: Privilege proc_setid missing, will not change uid/gid
**** v1    0.1 CLI RX|Name 'first' already defined.
**** v1    0.1 CLI RX|('<vcl.inline>' Line 8 Pos 21)
**** v1    0.1 CLI RX|                new first = debug.obj("FOO");
**** v1    0.1 CLI RX|--------------------#####--------------------
**** v1    0.1 CLI RX|
**** v1    0.1 CLI RX|First definition:
**** v1    0.1 CLI RX|('<vcl.inline>' Line 5 Pos 17)
**** v1    0.1 CLI RX|        backend first { .host = "127.0.0.1"; }
**** v1    0.1 CLI RX|----------------#####-------------------------
**** v1    0.1 CLI RX|
**** v1    0.1 CLI RX|Running VCC-compiler failed, exited with 2
**** v1    0.1 CLI RX|VCL compilation failed
**   v1    0.1 VCL compilation failed (as expected)
***  v1    0.1 Found expected string: ("Name 'first' already defined.")
*    top   0.1 RESETTING after ../../../bin/varnishtest/tests/r01510.vtc
**   v1    0.1 Wait
**** v1    0.1 CLI TX|backend.list
***  v1    0.1 CLI RX  101
**** v1    0.1 CLI RX|Unknown request in manager process (child not running).
**** v1    0.1 CLI RX|Type 'help' for more info.
**   v1    0.1 Stop
**** v1    0.1 CLI TX|stop
***  v1    0.1 CLI RX  300
**** v1    0.1 CLI RX|Child in state stopped
**** v1    0.1 CLI TX|status
***  v1    0.1 CLI RX  200
**** v1    0.1 CLI RX|Child in state stopped
**** v1    0.1 STDOUT poll 0x10
**   v1    0.1 R 23204 Status: 0000 (u 0.006000 s 0.020000)
*    diag  0.0 ............................................................
#    top  TEST ../../../bin/varnishtest/tests/r01510.vtc TIMED OUT (kill -9)
#    top  TEST ../../../bin/varnishtest/tests/r01510.vtc FAILED (60.002) signal=9

1 @ SunOS 5.11 i86pc 1.04 64_gcc4.7 uplex

*    top   0.0 TEST ../../../bin/varnishtest/tests/r01510.vtc starting
[...]
*    top   0.0 TEST Duplicate object names
[...]
**** v1    0.1 CLI TX|\tsub vcl_init {
**** v1    0.1 CLI TX|\t\tnew first = debug.obj("FOO");
**** v1    0.1 CLI TX|\t}
**** v1    0.1 CLI TX|
**** v1    0.1 CLI TX|%XJEIFLH|)Xspa8P
***  v1    0.1 CLI RX  106
**** v1    0.1 CLI RX|Message from VCC-compiler:
**** v1    0.1 CLI RX|Security: Privilege proc_setid missing, will not change uid/gid
**** v1    0.1 CLI RX|Name 'first' already defined.
**** v1    0.1 CLI RX|('<vcl.inline>' Line 8 Pos 21)
**** v1    0.1 CLI RX|                new first = debug.obj("FOO");
**** v1    0.1 CLI RX|--------------------#####--------------------
**** v1    0.1 CLI RX|
**** v1    0.1 CLI RX|First definition:
**** v1    0.1 CLI RX|('<vcl.inline>' Line 5 Pos 17)
**** v1    0.1 CLI RX|        backend first { .host = "127.0.0.1"; }
**** v1    0.1 CLI RX|----------------#####-------------------------
**** v1    0.1 CLI RX|
**** v1    0.1 CLI RX|Running VCC-compiler failed, exited with 2
**** v1    0.1 CLI RX|VCL compilation failed
**   v1    0.1 VCL compilation failed (as expected)
***  v1    0.1 Found expected string: ("Name 'first' already defined.")
*    top   0.1 RESETTING after ../../../bin/varnishtest/tests/r01510.vtc
**   v1    0.1 Wait
**** v1    0.1 CLI TX|backend.list
***  v1    0.1 CLI RX  101
**** v1    0.1 CLI RX|Unknown request in manager process (child not running).
**** v1    0.1 CLI RX|Type 'help' for more info.
**   v1    0.1 Stop
**** v1    0.1 CLI TX|stop
***  v1    0.1 CLI RX  300
**** v1    0.1 CLI RX|Child in state stopped
**** v1    0.1 CLI TX|status
***  v1    0.1 CLI RX  200
**** v1    0.1 CLI RX|Child in state stopped
**** v1    0.1 STDOUT poll 0x10
**   v1    0.1 R 6114 Status: 0000 (u 0.008000 s 0.026000)
*    diag  0.0 ............................................................
#    top  TEST ../../../bin/varnishtest/tests/r01510.vtc TIMED OUT (kill -9)
#    top  TEST ../../../bin/varnishtest/tests/r01510.vtc FAILED (60.003) signal=9

1 @ SunOS 5.11 i86pc 1.04 64_gcc4.7 uplex

*    top   0.0 TEST ../../../bin/varnishtest/tests/r01510.vtc starting
[...]
*    top   0.0 TEST Duplicate object names
[...]
**** v1    0.1 CLI TX|\tsub vcl_init {
**** v1    0.1 CLI TX|\t\tnew first = debug.obj("FOO");
**** v1    0.1 CLI TX|\t}
**** v1    0.1 CLI TX|
**** v1    0.1 CLI TX|%XJEIFLH|)Xspa8P
***  v1    0.1 CLI RX  106
**** v1    0.1 CLI RX|Message from VCC-compiler:
**** v1    0.1 CLI RX|Security: Privilege proc_setid missing, will not change uid/gid
**** v1    0.1 CLI RX|Name 'first' already defined.
**** v1    0.1 CLI RX|('<vcl.inline>' Line 8 Pos 21)
**** v1    0.1 CLI RX|                new first = debug.obj("FOO");
**** v1    0.1 CLI RX|--------------------#####--------------------
**** v1    0.1 CLI RX|
**** v1    0.1 CLI RX|First definition:
**** v1    0.1 CLI RX|('<vcl.inline>' Line 5 Pos 17)
**** v1    0.1 CLI RX|        backend first { .host = "127.0.0.1"; }
**** v1    0.1 CLI RX|----------------#####-------------------------
**** v1    0.1 CLI RX|
**** v1    0.1 CLI RX|Running VCC-compiler failed, exited with 2
**** v1    0.1 CLI RX|VCL compilation failed
**   v1    0.1 VCL compilation failed (as expected)
***  v1    0.1 Found expected string: ("Name 'first' already defined.")
*    top   0.1 RESETTING after ../../../bin/varnishtest/tests/r01510.vtc
**   v1    0.1 Wait
**** v1    0.1 CLI TX|backend.list
***  v1    0.1 CLI RX  101
**** v1    0.1 CLI RX|Unknown request in manager process (child not running).
**** v1    0.1 CLI RX|Type 'help' for more info.
**   v1    0.1 Stop
**** v1    0.1 CLI TX|stop
***  v1    0.1 CLI RX  300
**** v1    0.1 CLI RX|Child in state stopped
**** v1    0.1 CLI TX|status
***  v1    0.1 CLI RX  200
**** v1    0.1 CLI RX|Child in state stopped
**** v1    0.1 STDOUT poll 0x10
**   v1    0.1 R 84877 Status: 0000 (u 0.008000 s 0.027000)
*    diag  0.0 ............................................................
#    top  TEST ../../../bin/varnishtest/tests/r01510.vtc TIMED OUT (kill -9)
#    top  TEST ../../../bin/varnishtest/tests/r01510.vtc FAILED (60.004) signal=9

bd4794e

1 @ SunOS 5.11 i86pc 1.04 64_gcc4.7 uplex

*    top   0.0 TEST ../../../bin/varnishtest/tests/r01510.vtc starting
[...]
*    top   0.0 TEST Duplicate object names
[...]
**** v1    0.1 CLI TX|\tsub vcl_init {
**** v1    0.1 CLI TX|\t\tnew first = debug.obj("FOO");
**** v1    0.1 CLI TX|\t}
**** v1    0.1 CLI TX|
**** v1    0.1 CLI TX|%XJEIFLH|)Xspa8P
***  v1    0.1 CLI RX  106
**** v1    0.1 CLI RX|Message from VCC-compiler:
**** v1    0.1 CLI RX|Security: Privilege proc_setid missing, will not change uid/gid
**** v1    0.1 CLI RX|Name 'first' already defined.
**** v1    0.1 CLI RX|('<vcl.inline>' Line 8 Pos 21)
**** v1    0.1 CLI RX|                new first = debug.obj("FOO");
**** v1    0.1 CLI RX|--------------------#####--------------------
**** v1    0.1 CLI RX|
**** v1    0.1 CLI RX|First definition:
**** v1    0.1 CLI RX|('<vcl.inline>' Line 5 Pos 17)
**** v1    0.1 CLI RX|        backend first { .host = "127.0.0.1"; }
**** v1    0.1 CLI RX|----------------#####-------------------------
**** v1    0.1 CLI RX|
**** v1    0.1 CLI RX|Running VCC-compiler failed, exited with 2
**** v1    0.1 CLI RX|VCL compilation failed
**   v1    0.1 VCL compilation failed (as expected)
***  v1    0.1 Found expected string: ("Name 'first' already defined.")
*    top   0.1 RESETTING after ../../../bin/varnishtest/tests/r01510.vtc
**   v1    0.1 Wait
**** v1    0.1 CLI TX|backend.list
***  v1    0.1 CLI RX  101
**** v1    0.1 CLI RX|Unknown request in manager process (child not running).
**** v1    0.1 CLI RX|Type 'help' for more info.
**   v1    0.1 Stop
**** v1    0.1 CLI TX|stop
***  v1    0.1 CLI RX  300
**** v1    0.1 CLI RX|Child in state stopped
**** v1    0.1 CLI TX|status
***  v1    0.1 CLI RX  200
**** v1    0.1 CLI RX|Child in state stopped
**** v1    0.1 STDOUT poll 0x10
**   v1    0.2 R 32526 Status: 0000 (u 0.008000 s 0.029000)
*    diag  0.0 ............................................................
#    top  TEST ../../../bin/varnishtest/tests/r01510.vtc TIMED OUT (kill -9)
#    top  TEST ../../../bin/varnishtest/tests/r01510.vtc FAILED (60.004) signal=9

1 @ SunOS 5.11 i86pc 1.04 32_sun12.4 uplex

*    top   0.0 TEST ../../../bin/varnishtest/tests/r01510.vtc starting
[...]
*    top   0.0 TEST Duplicate object names
[...]
**** v1    0.1 CLI TX|
**** v1    0.1 CLI TX|\tsub vcl_init {
**** v1    0.1 CLI TX|\t\tnew first = debug.obj("FOO");
**** v1    0.1 CLI TX|\t}
**** v1    0.1 CLI TX|
**** v1    0.1 CLI TX|%XJEIFLH|)Xspa8P
***  v1    0.1 CLI RX  106
**** v1    0.1 CLI RX|Message from VCC-compiler:
**** v1    0.1 CLI RX|Security: Privilege proc_setid missing, will not change uid/gid
**** v1    0.1 CLI RX|Name 'first' already defined.
**** v1    0.1 CLI RX|('<vcl.inline>' Line 8 Pos 21)
**** v1    0.1 CLI RX|                new first = debug.obj("FOO");
**** v1    0.1 CLI RX|--------------------#####--------------------
**** v1    0.1 CLI RX|
**** v1    0.1 CLI RX|First definition:
**** v1    0.1 CLI RX|('<vcl.inline>' Line 5 Pos 17)
**** v1    0.1 CLI RX|        backend first { .host = "127.0.0.1"; }
**** v1    0.1 CLI RX|----------------#####-------------------------
**** v1    0.1 CLI RX|
**** v1    0.1 CLI RX|Running VCC-compiler failed, exited with 2
**** v1    0.1 CLI RX|VCL compilation failed
**   v1    0.1 VCL compilation failed (as expected)
***  v1    0.1 Found expected string: ("Name 'first' already defined.")
*    top   0.1 RESETTING after ../../../bin/varnishtest/tests/r01510.vtc
**   v1    0.1 Wait
**** v1    0.1 CLI TX|backend.list
***  v1    0.1 CLI RX  101
**** v1    0.1 CLI RX|Unknown request in manager process (child not running).
**** v1    0.1 CLI RX|Type 'help' for more info.
**   v1    0.1 Stop
**** v1    0.1 CLI TX|stop
***  v1    0.1 CLI RX  300
**** v1    0.1 CLI RX|Child in state stopped
**** v1    0.1 CLI TX|status
***  v1    0.1 CLI RX  200
**** v1    0.1 CLI RX|Child in state stopped
**** v1    0.1 STDOUT poll 0x10
**   v1    0.1 R 3571 Status: 0000 (u 0.006000 s 0.020000)
#    top  TEST ../../../bin/varnishtest/tests/r01510.vtc TIMED OUT (kill -9)
#    top  TEST ../../../bin/varnishtest/tests/r01510.vtc FAILED (60.002) signal=9

1 @ SunOS 5.11 i86pc 1.04 64_gcc4.7 uplex

*    top   0.0 TEST ../../../bin/varnishtest/tests/r01510.vtc starting
[...]
*    top   0.0 TEST Duplicate object names
[...]
**** v1    0.1 CLI TX|
**** v1    0.1 CLI TX|\tsub vcl_init {
**** v1    0.1 CLI TX|\t\tnew first = debug.obj("FOO");
**** v1    0.1 CLI TX|\t}
**** v1    0.1 CLI TX|
**** v1    0.1 CLI TX|%XJEIFLH|)Xspa8P
***  v1    0.1 CLI RX  106
**** v1    0.1 CLI RX|Message from VCC-compiler:
**** v1    0.1 CLI RX|Security: Privilege proc_setid missing, will not change uid/gid
**** v1    0.1 CLI RX|Name 'first' already defined.
**** v1    0.1 CLI RX|('<vcl.inline>' Line 8 Pos 21)
**** v1    0.1 CLI RX|                new first = debug.obj("FOO");
**** v1    0.1 CLI RX|--------------------#####--------------------
**** v1    0.1 CLI RX|
**** v1    0.1 CLI RX|First definition:
**** v1    0.1 CLI RX|('<vcl.inline>' Line 5 Pos 17)
**** v1    0.1 CLI RX|        backend first { .host = "127.0.0.1"; }
**** v1    0.1 CLI RX|----------------#####-------------------------
**** v1    0.1 CLI RX|
**** v1    0.1 CLI RX|Running VCC-compiler failed, exited with 2
**** v1    0.1 CLI RX|VCL compilation failed
**   v1    0.1 VCL compilation failed (as expected)
***  v1    0.1 Found expected string: ("Name 'first' already defined.")
*    top   0.1 RESETTING after ../../../bin/varnishtest/tests/r01510.vtc
**   v1    0.1 Wait
**** v1    0.1 CLI TX|backend.list
***  v1    0.1 CLI RX  101
**** v1    0.1 CLI RX|Unknown request in manager process (child not running).
**** v1    0.1 CLI RX|Type 'help' for more info.
**   v1    0.1 Stop
**** v1    0.1 CLI TX|stop
***  v1    0.1 CLI RX  300
**** v1    0.1 CLI RX|Child in state stopped
**** v1    0.1 CLI TX|status
***  v1    0.1 CLI RX  200
**** v1    0.1 CLI RX|Child in state stopped
**** v1    0.1 STDOUT poll 0x10
**   v1    0.1 R 55369 Status: 0000 (u 0.008000 s 0.027000)
#    top  TEST ../../../bin/varnishtest/tests/r01510.vtc TIMED OUT (kill -9)
#    top  TEST ../../../bin/varnishtest/tests/r01510.vtc FAILED (60.003) signal=9

1 @ SunOS 5.11 i86pc 1.04 64_gcc4.7 uplex

*    top   0.0 TEST ../../../bin/varnishtest/tests/r01510.vtc starting
[...]
*    top   0.0 TEST Duplicate object names
[...]
**** v1    0.1 CLI TX|
**** v1    0.1 CLI TX|\tsub vcl_init {
**** v1    0.1 CLI TX|\t\tnew first = debug.obj("FOO");
**** v1    0.1 CLI TX|\t}
**** v1    0.1 CLI TX|
**** v1    0.1 CLI TX|%XJEIFLH|)Xspa8P
***  v1    0.1 CLI RX  106
**** v1    0.1 CLI RX|Message from VCC-compiler:
**** v1    0.1 CLI RX|Security: Privilege proc_setid missing, will not change uid/gid
**** v1    0.1 CLI RX|Name 'first' already defined.
**** v1    0.1 CLI RX|('<vcl.inline>' Line 8 Pos 21)
**** v1    0.1 CLI RX|                new first = debug.obj("FOO");
**** v1    0.1 CLI RX|--------------------#####--------------------
**** v1    0.1 CLI RX|
**** v1    0.1 CLI RX|First definition:
**** v1    0.1 CLI RX|('<vcl.inline>' Line 5 Pos 17)
**** v1    0.1 CLI RX|        backend first { .host = "127.0.0.1"; }
**** v1    0.1 CLI RX|----------------#####-------------------------
**** v1    0.1 CLI RX|
**** v1    0.1 CLI RX|Running VCC-compiler failed, exited with 2
**** v1    0.1 CLI RX|VCL compilation failed
**   v1    0.1 VCL compilation failed (as expected)
***  v1    0.1 Found expected string: ("Name 'first' already defined.")
*    top   0.1 RESETTING after ../../../bin/varnishtest/tests/r01510.vtc
**   v1    0.1 Wait
**** v1    0.1 CLI TX|backend.list
***  v1    0.1 CLI RX  101
**** v1    0.1 CLI RX|Unknown request in manager process (child not running).
**** v1    0.1 CLI RX|Type 'help' for more info.
**   v1    0.1 Stop
**** v1    0.1 CLI TX|stop
***  v1    0.1 CLI RX  300
**** v1    0.1 CLI RX|Child in state stopped
**** v1    0.1 CLI TX|status
***  v1    0.1 CLI RX  200
**** v1    0.1 CLI RX|Child in state stopped
**** v1    0.1 STDOUT poll 0x10
**   v1    0.1 R 70579 Status: 0000 (u 0.008000 s 0.027000)
#    top  TEST ../../../bin/varnishtest/tests/r01510.vtc TIMED OUT (kill -9)
#    top  TEST ../../../bin/varnishtest/tests/r01510.vtc FAILED (60.003) signal=9

1 @ SunOS 5.11 i86pc 1.04 64_gcc4.7 uplex

*    top   0.0 TEST ../../../bin/varnishtest/tests/r01510.vtc starting
[...]
*    top   0.0 TEST Duplicate object names
[...]
**** v1    0.1 CLI TX|
**** v1    0.1 CLI TX|\tsub vcl_init {
**** v1    0.1 CLI TX|\t\tnew first = debug.obj("FOO");
**** v1    0.1 CLI TX|\t}
**** v1    0.1 CLI TX|
**** v1    0.1 CLI TX|%XJEIFLH|)Xspa8P
***  v1    0.1 CLI RX  106
**** v1    0.1 CLI RX|Message from VCC-compiler:
**** v1    0.1 CLI RX|Security: Privilege proc_setid missing, will not change uid/gid
**** v1    0.1 CLI RX|Name 'first' already defined.
**** v1    0.1 CLI RX|('<vcl.inline>' Line 8 Pos 21)
**** v1    0.1 CLI RX|                new first = debug.obj("FOO");
**** v1    0.1 CLI RX|--------------------#####--------------------
**** v1    0.1 CLI RX|
**** v1    0.1 CLI RX|First definition:
**** v1    0.1 CLI RX|('<vcl.inline>' Line 5 Pos 17)
**** v1    0.1 CLI RX|        backend first { .host = "127.0.0.1"; }
**** v1    0.1 CLI RX|----------------#####-------------------------
**** v1    0.1 CLI RX|
**** v1    0.1 CLI RX|Running VCC-compiler failed, exited with 2
**** v1    0.1 CLI RX|VCL compilation failed
**   v1    0.1 VCL compilation failed (as expected)
***  v1    0.1 Found expected string: ("Name 'first' already defined.")
*    top   0.1 RESETTING after ../../../bin/varnishtest/tests/r01510.vtc
**   v1    0.1 Wait
**** v1    0.1 CLI TX|backend.list
***  v1    0.1 CLI RX  101
**** v1    0.1 CLI RX|Unknown request in manager process (child not running).
**** v1    0.1 CLI RX|Type 'help' for more info.
**   v1    0.1 Stop
**** v1    0.1 CLI TX|stop
***  v1    0.1 CLI RX  300
**** v1    0.1 CLI RX|Child in state stopped
**** v1    0.1 CLI TX|status
***  v1    0.1 CLI RX  200
**** v1    0.1 CLI RX|Child in state stopped
**** v1    0.1 STDOUT poll 0x10
**   v1    0.1 R 71036 Status: 0000 (u 0.008000 s 0.028000)
#    top  TEST ../../../bin/varnishtest/tests/r01510.vtc TIMED OUT (kill -9)
#    top  TEST ../../../bin/varnishtest/tests/r01510.vtc FAILED (60.003) signal=9

1 @ SunOS 5.11 i86pc 1.04 64_gcc4.7 uplex

*    top   0.0 TEST ../../../bin/varnishtest/tests/r01510.vtc starting
[...]
*    top   0.0 TEST Duplicate object names
[...]
**** v1    0.1 CLI TX|
**** v1    0.1 CLI TX|\tsub vcl_init {
**** v1    0.1 CLI TX|\t\tnew first = debug.obj("FOO");
**** v1    0.1 CLI TX|\t}
**** v1    0.1 CLI TX|
**** v1    0.1 CLI TX|%XJEIFLH|)Xspa8P
***  v1    0.1 CLI RX  106
**** v1    0.1 CLI RX|Message from VCC-compiler:
**** v1    0.1 CLI RX|Security: Privilege proc_setid missing, will not change uid/gid
**** v1    0.1 CLI RX|Name 'first' already defined.
**** v1    0.1 CLI RX|('<vcl.inline>' Line 8 Pos 21)
**** v1    0.1 CLI RX|                new first = debug.obj("FOO");
**** v1    0.1 CLI RX|--------------------#####--------------------
**** v1    0.1 CLI RX|
**** v1    0.1 CLI RX|First definition:
**** v1    0.1 CLI RX|('<vcl.inline>' Line 5 Pos 17)
**** v1    0.1 CLI RX|        backend first { .host = "127.0.0.1"; }
**** v1    0.1 CLI RX|----------------#####-------------------------
**** v1    0.1 CLI RX|
**** v1    0.1 CLI RX|Running VCC-compiler failed, exited with 2
**** v1    0.1 CLI RX|VCL compilation failed
**   v1    0.1 VCL compilation failed (as expected)
***  v1    0.1 Found expected string: ("Name 'first' already defined.")
*    top   0.1 RESETTING after ../../../bin/varnishtest/tests/r01510.vtc
**   v1    0.1 Wait
**** v1    0.1 CLI TX|backend.list
***  v1    0.1 CLI RX  101
**** v1    0.1 CLI RX|Unknown request in manager process (child not running).
**** v1    0.1 CLI RX|Type 'help' for more info.
**   v1    0.1 Stop
**** v1    0.1 CLI TX|stop
***  v1    0.1 CLI RX  300
**** v1    0.1 CLI RX|Child in state stopped
**** v1    0.1 CLI TX|status
***  v1    0.1 CLI RX  200
**** v1    0.1 CLI RX|Child in state stopped
**** v1    0.1 STDOUT poll 0x10
**   v1    0.1 R 89155 Status: 0000 (u 0.008000 s 0.027000)
#    top  TEST ../../../bin/varnishtest/tests/r01510.vtc TIMED OUT (kill -9)
#    top  TEST ../../../bin/varnishtest/tests/r01510.vtc FAILED (60.003) signal=9

1 @ SunOS 5.11 i86pc 1.04 32_sun12.4 uplex

*    top   0.0 TEST ../../../bin/varnishtest/tests/r01510.vtc starting
[...]
*    top   0.0 TEST Duplicate object names
[...]
**** v1    0.1 CLI TX|
**** v1    0.1 CLI TX|\tsub vcl_init {
**** v1    0.1 CLI TX|\t\tnew first = debug.obj("FOO");
**** v1    0.1 CLI TX|\t}
**** v1    0.1 CLI TX|
**** v1    0.1 CLI TX|%XJEIFLH|)Xspa8P
***  v1    0.1 CLI RX  106
**** v1    0.1 CLI RX|Message from VCC-compiler:
**** v1    0.1 CLI RX|Security: Privilege proc_setid missing, will not change uid/gid
**** v1    0.1 CLI RX|Name 'first' already defined.
**** v1    0.1 CLI RX|('<vcl.inline>' Line 8 Pos 21)
**** v1    0.1 CLI RX|                new first = debug.obj("FOO");
**** v1    0.1 CLI RX|--------------------#####--------------------
**** v1    0.1 CLI RX|
**** v1    0.1 CLI RX|First definition:
**** v1    0.1 CLI RX|('<vcl.inline>' Line 5 Pos 17)
**** v1    0.1 CLI RX|        backend first { .host = "127.0.0.1"; }
**** v1    0.1 CLI RX|----------------#####-------------------------
**** v1    0.1 CLI RX|
**** v1    0.1 CLI RX|Running VCC-compiler failed, exited with 2
**** v1    0.1 CLI RX|VCL compilation failed
**   v1    0.1 VCL compilation failed (as expected)
***  v1    0.1 Found expected string: ("Name 'first' already defined.")
*    top   0.1 RESETTING after ../../../bin/varnishtest/tests/r01510.vtc
**   v1    0.1 Wait
**** v1    0.1 CLI TX|backend.list
***  v1    0.1 CLI RX  101
**** v1    0.1 CLI RX|Unknown request in manager process (child not running).
**** v1    0.1 CLI RX|Type 'help' for more info.
**   v1    0.1 Stop
**** v1    0.1 CLI TX|stop
***  v1    0.1 CLI RX  300
**** v1    0.1 CLI RX|Child in state stopped
**** v1    0.1 CLI TX|status
***  v1    0.1 CLI RX  200
**** v1    0.1 CLI RX|Child in state stopped
**** v1    0.1 STDOUT poll 0x10
**   v1    0.1 R 24201 Status: 0000 (u 0.005000 s 0.018000)
#    top  TEST ../../../bin/varnishtest/tests/r01510.vtc TIMED OUT (kill -9)
#    top  TEST ../../../bin/varnishtest/tests/r01510.vtc FAILED (60.002) signal=9

1 @ SunOS 5.11 i86pc 1.04 32_gcc4.7 uplex

*    top   0.0 TEST ../../../bin/varnishtest/tests/r01510.vtc starting
[...]
*    top   0.0 TEST Duplicate object names
[...]
**** v1    0.1 CLI TX|
**** v1    0.1 CLI TX|\tsub vcl_init {
**** v1    0.1 CLI TX|\t\tnew first = debug.obj("FOO");
**** v1    0.1 CLI TX|\t}
**** v1    0.1 CLI TX|
**** v1    0.1 CLI TX|%XJEIFLH|)Xspa8P
***  v1    0.1 CLI RX  106
**** v1    0.1 CLI RX|Message from VCC-compiler:
**** v1    0.1 CLI RX|Security: Privilege proc_setid missing, will not change uid/gid
**** v1    0.1 CLI RX|Name 'first' already defined.
**** v1    0.1 CLI RX|('<vcl.inline>' Line 8 Pos 21)
**** v1    0.1 CLI RX|                new first = debug.obj("FOO");
**** v1    0.1 CLI RX|--------------------#####--------------------
**** v1    0.1 CLI RX|
**** v1    0.1 CLI RX|First definition:
**** v1    0.1 CLI RX|('<vcl.inline>' Line 5 Pos 17)
**** v1    0.1 CLI RX|        backend first { .host = "127.0.0.1"; }
**** v1    0.1 CLI RX|----------------#####-------------------------
**** v1    0.1 CLI RX|
**** v1    0.1 CLI RX|Running VCC-compiler failed, exited with 2
**** v1    0.1 CLI RX|VCL compilation failed
**   v1    0.1 VCL compilation failed (as expected)
***  v1    0.1 Found expected string: ("Name 'first' already defined.")
*    top   0.1 RESETTING after ../../../bin/varnishtest/tests/r01510.vtc
**   v1    0.1 Wait
**** v1    0.1 CLI TX|backend.list
***  v1    0.1 CLI RX  101
**** v1    0.1 CLI RX|Unknown request in manager process (child not running).
**** v1    0.1 CLI RX|Type 'help' for more info.
**   v1    0.1 Stop
**** v1    0.1 CLI TX|stop
***  v1    0.1 CLI RX  300
**** v1    0.1 CLI RX|Child in state stopped
**** v1    0.1 CLI TX|status
***  v1    0.1 CLI RX  200
**** v1    0.1 CLI RX|Child in state stopped
**** v1    0.1 STDOUT poll 0x10
**   v1    0.2 R 873 Status: 0000 (u 0.008000 s 0.026000)
#    top  TEST ../../../bin/varnishtest/tests/r01510.vtc TIMED OUT (kill -9)
#    top  TEST ../../../bin/varnishtest/tests/r01510.vtc FAILED (60.010) signal=9

1 @ SunOS 5.11 i86pc 1.04 64_gcc4.7 uplex

*    top   0.0 TEST ../../../bin/varnishtest/tests/r01510.vtc starting
[...]
*    top   0.0 TEST Duplicate object names
[...]
**** v1    0.1 CLI TX|
**** v1    0.1 CLI TX|\tsub vcl_init {
**** v1    0.1 CLI TX|\t\tnew first = debug.obj("FOO");
**** v1    0.1 CLI TX|\t}
**** v1    0.1 CLI TX|
**** v1    0.1 CLI TX|%XJEIFLH|)Xspa8P
***  v1    0.1 CLI RX  106
**** v1    0.1 CLI RX|Message from VCC-compiler:
**** v1    0.1 CLI RX|Security: Privilege proc_setid missing, will not change uid/gid
**** v1    0.1 CLI RX|Name 'first' already defined.
**** v1    0.1 CLI RX|('<vcl.inline>' Line 8 Pos 21)
**** v1    0.1 CLI RX|                new first = debug.obj("FOO");
**** v1    0.1 CLI RX|--------------------#####--------------------
**** v1    0.1 CLI RX|
**** v1    0.1 CLI RX|First definition:
**** v1    0.1 CLI RX|('<vcl.inline>' Line 5 Pos 17)
**** v1    0.1 CLI RX|        backend first { .host = "127.0.0.1"; }
**** v1    0.1 CLI RX|----------------#####-------------------------
**** v1    0.1 CLI RX|
**** v1    0.1 CLI RX|Running VCC-compiler failed, exited with 2
**** v1    0.1 CLI RX|VCL compilation failed
**   v1    0.1 VCL compilation failed (as expected)
***  v1    0.1 Found expected string: ("Name 'first' already defined.")
*    top   0.1 RESETTING after ../../../bin/varnishtest/tests/r01510.vtc
**   v1    0.1 Wait
**** v1    0.1 CLI TX|backend.list
***  v1    0.1 CLI RX  101
**** v1    0.1 CLI RX|Unknown request in manager process (child not running).
**** v1    0.1 CLI RX|Type 'help' for more info.
**   v1    0.1 Stop
**** v1    0.1 CLI TX|stop
***  v1    0.1 CLI RX  300
**** v1    0.1 CLI RX|Child in state stopped
**** v1    0.1 CLI TX|status
***  v1    0.1 CLI RX  200
**** v1    0.1 CLI RX|Child in state stopped
**** v1    0.1 STDOUT poll 0x10
**   v1    0.1 R 61620 Status: 0000 (u 0.008000 s 0.024000)
#    top  TEST ../../../bin/varnishtest/tests/r01510.vtc TIMED OUT (kill -9)
#    top  TEST ../../../bin/varnishtest/tests/r01510.vtc FAILED (60.003) signal=9

1 @ SunOS 5.11 i86pc 1.04 64_gcc4.7 uplex

*    top   0.0 TEST ../../../bin/varnishtest/tests/r01510.vtc starting
[...]
*    top   0.0 TEST Duplicate object names
[...]
**** v1    0.1 CLI TX|
**** v1    0.1 CLI TX|\tsub vcl_init {
**** v1    0.1 CLI TX|\t\tnew first = debug.obj("FOO");
**** v1    0.1 CLI TX|\t}
**** v1    0.1 CLI TX|
**** v1    0.1 CLI TX|%XJEIFLH|)Xspa8P
***  v1    0.1 CLI RX  106
**** v1    0.1 CLI RX|Message from VCC-compiler:
**** v1    0.1 CLI RX|Security: Privilege proc_setid missing, will not change uid/gid
**** v1    0.1 CLI RX|Name 'first' already defined.
**** v1    0.1 CLI RX|('<vcl.inline>' Line 8 Pos 21)
**** v1    0.1 CLI RX|                new first = debug.obj("FOO");
**** v1    0.1 CLI RX|--------------------#####--------------------
**** v1    0.1 CLI RX|
**** v1    0.1 CLI RX|First definition:
**** v1    0.1 CLI RX|('<vcl.inline>' Line 5 Pos 17)
**** v1    0.1 CLI RX|        backend first { .host = "127.0.0.1"; }
**** v1    0.1 CLI RX|----------------#####-------------------------
**** v1    0.1 CLI RX|
**** v1    0.1 CLI RX|Running VCC-compiler failed, exited with 2
**** v1    0.1 CLI RX|VCL compilation failed
**   v1    0.1 VCL compilation failed (as expected)
***  v1    0.1 Found expected string: ("Name 'first' already defined.")
*    top   0.1 RESETTING after ../../../bin/varnishtest/tests/r01510.vtc
**   v1    0.1 Wait
**** v1    0.1 CLI TX|backend.list
***  v1    0.1 CLI RX  101
**** v1    0.1 CLI RX|Unknown request in manager process (child not running).
**** v1    0.1 CLI RX|Type 'help' for more info.
**   v1    0.1 Stop
**** v1    0.1 CLI TX|stop
***  v1    0.1 CLI RX  300
**** v1    0.1 CLI RX|Child in state stopped
**** v1    0.1 CLI TX|status
***  v1    0.1 CLI RX  200
**** v1    0.1 CLI RX|Child in state stopped
**** v1    0.1 STDOUT poll 0x10
**   v1    0.1 R 12032 Status: 0000 (u 0.008000 s 0.026000)
#    top  TEST ../../../bin/varnishtest/tests/r01510.vtc TIMED OUT (kill -9)
#    top  TEST ../../../bin/varnishtest/tests/r01510.vtc FAILED (60.003) signal=9

1 @ SunOS 5.11 i86pc 1.04 64_sun12.4 uplex

*    top   0.0 TEST ../../../bin/varnishtest/tests/r01510.vtc starting
[...]
*    top   0.0 TEST Duplicate object names
[...]
**** v1    0.2 CLI TX|
**** v1    0.2 CLI TX|\tsub vcl_init {
**** v1    0.2 CLI TX|\t\tnew first = debug.obj("FOO");
**** v1    0.2 CLI TX|\t}
**** v1    0.2 CLI TX|
**** v1    0.2 CLI TX|%XJEIFLH|)Xspa8P
***  v1    0.2 CLI RX  106
**** v1    0.2 CLI RX|Message from VCC-compiler:
**** v1    0.2 CLI RX|Security: Privilege proc_setid missing, will not change uid/gid
**** v1    0.2 CLI RX|Name 'first' already defined.
**** v1    0.2 CLI RX|('<vcl.inline>' Line 8 Pos 21)
**** v1    0.2 CLI RX|                new first = debug.obj("FOO");
**** v1    0.2 CLI RX|--------------------#####--------------------
**** v1    0.2 CLI RX|
**** v1    0.2 CLI RX|First definition:
**** v1    0.2 CLI RX|('<vcl.inline>' Line 5 Pos 17)
**** v1    0.2 CLI RX|        backend first { .host = "127.0.0.1"; }
**** v1    0.2 CLI RX|----------------#####-------------------------
**** v1    0.2 CLI RX|
**** v1    0.2 CLI RX|Running VCC-compiler failed, exited with 2
**** v1    0.2 CLI RX|VCL compilation failed
**   v1    0.2 VCL compilation failed (as expected)
***  v1    0.2 Found expected string: ("Name 'first' already defined.")
*    top   0.2 RESETTING after ../../../bin/varnishtest/tests/r01510.vtc
**   v1    0.2 Wait
**** v1    0.2 CLI TX|backend.list
***  v1    0.2 CLI RX  101
**** v1    0.2 CLI RX|Unknown request in manager process (child not running).
**** v1    0.2 CLI RX|Type 'help' for more info.
**   v1    0.2 Stop
**** v1    0.2 CLI TX|stop
***  v1    0.2 CLI RX  300
**** v1    0.2 CLI RX|Child in state stopped
**** v1    0.2 CLI TX|status
***  v1    0.2 CLI RX  200
**** v1    0.2 CLI RX|Child in state stopped
**** v1    0.2 STDOUT poll 0x10
**   v1    0.2 R 59686 Status: 0000 (u 0.013000 s 0.039000)
#    top  TEST ../../../bin/varnishtest/tests/r01510.vtc TIMED OUT (kill -9)
#    top  TEST ../../../bin/varnishtest/tests/r01510.vtc FAILED (60.005) signal=9

1 @ SunOS 5.11 i86pc 1.04 32_sun12.4 uplex

*    top   0.0 TEST ../../../bin/varnishtest/tests/r01510.vtc starting
[...]
*    top   0.0 TEST Duplicate object names
[...]
**** v1    0.1 CLI TX|
**** v1    0.1 CLI TX|\tsub vcl_init {
**** v1    0.1 CLI TX|\t\tnew first = debug.obj("FOO");
**** v1    0.1 CLI TX|\t}
**** v1    0.1 CLI TX|
**** v1    0.1 CLI TX|%XJEIFLH|)Xspa8P
***  v1    0.1 CLI RX  106
**** v1    0.1 CLI RX|Message from VCC-compiler:
**** v1    0.1 CLI RX|Security: Privilege proc_setid missing, will not change uid/gid
**** v1    0.1 CLI RX|Name 'first' already defined.
**** v1    0.1 CLI RX|('<vcl.inline>' Line 8 Pos 21)
**** v1    0.1 CLI RX|                new first = debug.obj("FOO");
**** v1    0.1 CLI RX|--------------------#####--------------------
**** v1    0.1 CLI RX|
**** v1    0.1 CLI RX|First definition:
**** v1    0.1 CLI RX|('<vcl.inline>' Line 5 Pos 17)
**** v1    0.1 CLI RX|        backend first { .host = "127.0.0.1"; }
**** v1    0.1 CLI RX|----------------#####-------------------------
**** v1    0.1 CLI RX|
**** v1    0.1 CLI RX|Running VCC-compiler failed, exited with 2
**** v1    0.1 CLI RX|VCL compilation failed
**   v1    0.1 VCL compilation failed (as expected)
***  v1    0.1 Found expected string: ("Name 'first' already defined.")
*    top   0.1 RESETTING after ../../../bin/varnishtest/tests/r01510.vtc
**   v1    0.1 Wait
**** v1    0.1 CLI TX|backend.list
***  v1    0.1 CLI RX  101
**** v1    0.1 CLI RX|Unknown request in manager process (child not running).
**** v1    0.1 CLI RX|Type 'help' for more info.
**   v1    0.1 Stop
**** v1    0.1 CLI TX|stop
***  v1    0.1 CLI RX  300
**** v1    0.1 CLI RX|Child in state stopped
**** v1    0.1 CLI TX|status
***  v1    0.1 CLI RX  200
**** v1    0.1 CLI RX|Child in state stopped
**** v1    0.1 STDOUT poll 0x10
**   v1    0.1 R 49912 Status: 0000 (u 0.006000 s 0.019000)
#    top  TEST ../../../bin/varnishtest/tests/r01510.vtc TIMED OUT (kill -9)
#    top  TEST ../../../bin/varnishtest/tests/r01510.vtc FAILED (60.001) signal=9

1 @ SunOS 5.11 i86pc 1.04 64_gcc4.7 uplex

*    top   0.0 TEST ../../../bin/varnishtest/tests/r01510.vtc starting
[...]
*    top   0.0 TEST Duplicate object names
[...]
**** v1    0.2 CLI TX|
**** v1    0.2 CLI TX|\tsub vcl_init {
**** v1    0.2 CLI TX|\t\tnew first = debug.obj("FOO");
**** v1    0.2 CLI TX|\t}
**** v1    0.2 CLI TX|
**** v1    0.2 CLI TX|%XJEIFLH|)Xspa8P
***  v1    0.2 CLI RX  106
**** v1    0.2 CLI RX|Message from VCC-compiler:
**** v1    0.2 CLI RX|Security: Privilege proc_setid missing, will not change uid/gid
**** v1    0.2 CLI RX|Name 'first' already defined.
**** v1    0.2 CLI RX|('<vcl.inline>' Line 8 Pos 21)
**** v1    0.2 CLI RX|                new first = debug.obj("FOO");
**** v1    0.2 CLI RX|--------------------#####--------------------
**** v1    0.2 CLI RX|
**** v1    0.2 CLI RX|First definition:
**** v1    0.2 CLI RX|('<vcl.inline>' Line 5 Pos 17)
**** v1    0.2 CLI RX|        backend first { .host = "127.0.0.1"; }
**** v1    0.2 CLI RX|----------------#####-------------------------
**** v1    0.2 CLI RX|
**** v1    0.2 CLI RX|Running VCC-compiler failed, exited with 2
**** v1    0.2 CLI RX|VCL compilation failed
**   v1    0.2 VCL compilation failed (as expected)
***  v1    0.2 Found expected string: ("Name 'first' already defined.")
*    top   0.2 RESETTING after ../../../bin/varnishtest/tests/r01510.vtc
**   v1    0.2 Wait
**** v1    0.2 CLI TX|backend.list
***  v1    0.2 CLI RX  101
**** v1    0.2 CLI RX|Unknown request in manager process (child not running).
**** v1    0.2 CLI RX|Type 'help' for more info.
**   v1    0.2 Stop
**** v1    0.2 CLI TX|stop
***  v1    0.2 CLI RX  300
**** v1    0.2 CLI RX|Child in state stopped
**** v1    0.2 CLI TX|status
***  v1    0.2 CLI RX  200
**** v1    0.2 CLI RX|Child in state stopped
**** v1    0.2 STDOUT poll 0x10
**   v1    0.2 R 92488 Status: 0000 (u 0.013000 s 0.043000)
#    top  TEST ../../../bin/varnishtest/tests/r01510.vtc TIMED OUT (kill -9)
#    top  TEST ../../../bin/varnishtest/tests/r01510.vtc FAILED (60.005) signal=9

1 @ SunOS 5.11 i86pc 1.04 32_sun12.4 uplex

*    top   0.0 TEST ../../../bin/varnishtest/tests/r01510.vtc starting
[...]
*    top   0.0 TEST Duplicate object names
[...]
**** v1    0.1 CLI TX|
**** v1    0.1 CLI TX|\tsub vcl_init {
**** v1    0.1 CLI TX|\t\tnew first = debug.obj("FOO");
**** v1    0.1 CLI TX|\t}
**** v1    0.1 CLI TX|
**** v1    0.1 CLI TX|%XJEIFLH|)Xspa8P
***  v1    0.1 CLI RX  106
**** v1    0.1 CLI RX|Message from VCC-compiler:
**** v1    0.1 CLI RX|Security: Privilege proc_setid missing, will not change uid/gid
**** v1    0.1 CLI RX|Name 'first' already defined.
**** v1    0.1 CLI RX|('<vcl.inline>' Line 8 Pos 21)
**** v1    0.1 CLI RX|                new first = debug.obj("FOO");
**** v1    0.1 CLI RX|--------------------#####--------------------
**** v1    0.1 CLI RX|
**** v1    0.1 CLI RX|First definition:
**** v1    0.1 CLI RX|('<vcl.inline>' Line 5 Pos 17)
**** v1    0.1 CLI RX|        backend first { .host = "127.0.0.1"; }
**** v1    0.1 CLI RX|----------------#####-------------------------
**** v1    0.1 CLI RX|
**** v1    0.1 CLI RX|Running VCC-compiler failed, exited with 2
**** v1    0.1 CLI RX|VCL compilation failed
**   v1    0.1 VCL compilation failed (as expected)
***  v1    0.1 Found expected string: ("Name 'first' already defined.")
*    top   0.1 RESETTING after ../../../bin/varnishtest/tests/r01510.vtc
**   v1    0.1 Wait
**** v1    0.1 CLI TX|backend.list
***  v1    0.1 CLI RX  101
**** v1    0.1 CLI RX|Unknown request in manager process (child not running).
**** v1    0.1 CLI RX|Type 'help' for more info.
**   v1    0.1 Stop
**** v1    0.1 CLI TX|stop
***  v1    0.1 CLI RX  300
**** v1    0.1 CLI RX|Child in state stopped
**** v1    0.1 CLI TX|status
***  v1    0.1 CLI RX  200
**** v1    0.1 CLI RX|Child in state stopped
**** v1    0.1 STDOUT poll 0x10
**   v1    0.1 R 12658 Status: 0000 (u 0.005000 s 0.018000)
#    top  TEST ../../../bin/varnishtest/tests/r01510.vtc TIMED OUT (kill -9)
#    top  TEST ../../../bin/varnishtest/tests/r01510.vtc FAILED (60.002) signal=9

1 @ SunOS 5.11 i86pc 1.04 64_gcc4.7 uplex

*    top   0.0 TEST ../../../bin/varnishtest/tests/r01510.vtc starting
[...]
*    top   0.0 TEST Duplicate object names
[...]
**** v1    0.2 CLI TX|
**** v1    0.2 CLI TX|\tsub vcl_init {
**** v1    0.2 CLI TX|\t\tnew first = debug.obj("FOO");
**** v1    0.2 CLI TX|\t}
**** v1    0.2 CLI TX|
**** v1    0.2 CLI TX|%XJEIFLH|)Xspa8P
***  v1    0.2 CLI RX  106
**** v1    0.2 CLI RX|Message from VCC-compiler:
**** v1    0.2 CLI RX|Security: Privilege proc_setid missing, will not change uid/gid
**** v1    0.2 CLI RX|Name 'first' already defined.
**** v1    0.2 CLI RX|('<vcl.inline>' Line 8 Pos 21)
**** v1    0.2 CLI RX|                new first = debug.obj("FOO");
**** v1    0.2 CLI RX|--------------------#####--------------------
**** v1    0.2 CLI RX|
**** v1    0.2 CLI RX|First definition:
**** v1    0.2 CLI RX|('<vcl.inline>' Line 5 Pos 17)
**** v1    0.2 CLI RX|        backend first { .host = "127.0.0.1"; }
**** v1    0.2 CLI RX|----------------#####-------------------------
**** v1    0.2 CLI RX|
**** v1    0.2 CLI RX|Running VCC-compiler failed, exited with 2
**** v1    0.2 CLI RX|VCL compilation failed
**   v1    0.2 VCL compilation failed (as expected)
***  v1    0.2 Found expected string: ("Name 'first' already defined.")
*    top   0.2 RESETTING after ../../../bin/varnishtest/tests/r01510.vtc
**   v1    0.2 Wait
**** v1    0.2 CLI TX|backend.list
***  v1    0.2 CLI RX  101
**** v1    0.2 CLI RX|Unknown request in manager process (child not running).
**** v1    0.2 CLI RX|Type 'help' for more info.
**   v1    0.2 Stop
**** v1    0.2 CLI TX|stop
***  v1    0.2 CLI RX  300
**** v1    0.2 CLI RX|Child in state stopped
**** v1    0.2 CLI TX|status
***  v1    0.2 CLI RX  200
**** v1    0.2 CLI RX|Child in state stopped
**** v1    0.2 STDOUT poll 0x10
**   v1    0.2 R 33310 Status: 0000 (u 0.012000 s 0.041000)
#    top  TEST ../../../bin/varnishtest/tests/r01510.vtc TIMED OUT (kill -9)
#    top  TEST ../../../bin/varnishtest/tests/r01510.vtc FAILED (60.004) signal=9

1 @ SunOS 5.11 i86pc 1.04 64_gcc4.7 uplex

*    top   0.0 TEST ../../../bin/varnishtest/tests/r01510.vtc starting
[...]
*    top   0.0 TEST Duplicate object names
[...]
**** v1    0.2 CLI TX|
**** v1    0.2 CLI TX|\tsub vcl_init {
**** v1    0.2 CLI TX|\t\tnew first = debug.obj("FOO");
**** v1    0.2 CLI TX|\t}
**** v1    0.2 CLI TX|
**** v1    0.2 CLI TX|%XJEIFLH|)Xspa8P
***  v1    0.2 CLI RX  106
**** v1    0.2 CLI RX|Message from VCC-compiler:
**** v1    0.2 CLI RX|Security: Privilege proc_setid missing, will not change uid/gid
**** v1    0.2 CLI RX|Name 'first' already defined.
**** v1    0.2 CLI RX|('<vcl.inline>' Line 8 Pos 21)
**** v1    0.2 CLI RX|                new first = debug.obj("FOO");
**** v1    0.2 CLI RX|--------------------#####--------------------
**** v1    0.2 CLI RX|
**** v1    0.2 CLI RX|First definition:
**** v1    0.2 CLI RX|('<vcl.inline>' Line 5 Pos 17)
**** v1    0.2 CLI RX|        backend first { .host = "127.0.0.1"; }
**** v1    0.2 CLI RX|----------------#####-------------------------
**** v1    0.2 CLI RX|
**** v1    0.2 CLI RX|Running VCC-compiler failed, exited with 2
**** v1    0.2 CLI RX|VCL compilation failed
**   v1    0.2 VCL compilation failed (as expected)
***  v1    0.2 Found expected string: ("Name 'first' already defined.")
*    top   0.2 RESETTING after ../../../bin/varnishtest/tests/r01510.vtc
**   v1    0.2 Wait
**** v1    0.2 CLI TX|backend.list
***  v1    0.2 CLI RX  101
**** v1    0.2 CLI RX|Unknown request in manager process (child not running).
**** v1    0.2 CLI RX|Type 'help' for more info.
**   v1    0.2 Stop
**** v1    0.2 CLI TX|stop
***  v1    0.2 CLI RX  300
**** v1    0.2 CLI RX|Child in state stopped
**** v1    0.2 CLI TX|status
***  v1    0.2 CLI RX  200
**** v1    0.2 CLI RX|Child in state stopped
**** v1    0.2 STDOUT poll 0x10
**   v1    0.2 R 31732 Status: 0000 (u 0.013000 s 0.039000)
#    top  TEST ../../../bin/varnishtest/tests/r01510.vtc TIMED OUT (kill -9)
#    top  TEST ../../../bin/varnishtest/tests/r01510.vtc FAILED (60.010) signal=9

1 @ SunOS 5.11 i86pc 1.04 64_gcc4.7 uplex

*    top   0.0 TEST ../../../bin/varnishtest/tests/r01510.vtc starting
[...]
*    top   0.0 TEST Duplicate object names
[...]
**** v1    0.1 CLI TX|
**** v1    0.1 CLI TX|\tsub vcl_init {
**** v1    0.1 CLI TX|\t\tnew first = debug.obj("FOO");
**** v1    0.1 CLI TX|\t}
**** v1    0.1 CLI TX|
**** v1    0.1 CLI TX|%XJEIFLH|)Xspa8P
***  v1    0.1 CLI RX  106
**** v1    0.1 CLI RX|Message from VCC-compiler:
**** v1    0.1 CLI RX|Security: Privilege proc_setid missing, will not change uid/gid
**** v1    0.1 CLI RX|Name 'first' already defined.
**** v1    0.1 CLI RX|('<vcl.inline>' Line 8 Pos 21)
**** v1    0.1 CLI RX|                new first = debug.obj("FOO");
**** v1    0.1 CLI RX|--------------------#####--------------------
**** v1    0.1 CLI RX|
**** v1    0.1 CLI RX|First definition:
**** v1    0.1 CLI RX|('<vcl.inline>' Line 5 Pos 17)
**** v1    0.1 CLI RX|        backend first { .host = "127.0.0.1"; }
**** v1    0.1 CLI RX|----------------#####-------------------------
**** v1    0.1 CLI RX|
**** v1    0.1 CLI RX|Running VCC-compiler failed, exited with 2
**** v1    0.1 CLI RX|VCL compilation failed
**   v1    0.1 VCL compilation failed (as expected)
***  v1    0.1 Found expected string: ("Name 'first' already defined.")
*    top   0.1 RESETTING after ../../../bin/varnishtest/tests/r01510.vtc
**   v1    0.1 Wait
**** v1    0.1 CLI TX|backend.list
***  v1    0.1 CLI RX  101
**** v1    0.1 CLI RX|Unknown request in manager process (child not running).
**** v1    0.1 CLI RX|Type 'help' for more info.
**   v1    0.1 Stop
**** v1    0.1 CLI TX|stop
***  v1    0.1 CLI RX  300
**** v1    0.1 CLI RX|Child in state stopped
**** v1    0.1 CLI TX|status
***  v1    0.1 CLI RX  200
**** v1    0.1 CLI RX|Child in state stopped
**** v1    0.1 STDOUT poll 0x10
**   v1    0.1 R 88851 Status: 0000 (u 0.008000 s 0.027000)
#    top  TEST ../../../bin/varnishtest/tests/r01510.vtc TIMED OUT (kill -9)
#    top  TEST ../../../bin/varnishtest/tests/r01510.vtc FAILED (60.003) signal=9

1 @ SunOS 5.11 i86pc 1.04 64_gcc4.7 uplex

*    top   0.0 TEST ../../../bin/varnishtest/tests/r01510.vtc starting
[...]
*    top   0.0 TEST Duplicate object names
[...]
**** v1    0.2 CLI TX|
**** v1    0.2 CLI TX|\tsub vcl_init {
**** v1    0.2 CLI TX|\t\tnew first = debug.obj("FOO");
**** v1    0.2 CLI TX|\t}
**** v1    0.2 CLI TX|
**** v1    0.2 CLI TX|%XJEIFLH|)Xspa8P
***  v1    0.2 CLI RX  106
**** v1    0.2 CLI RX|Message from VCC-compiler:
**** v1    0.2 CLI RX|Security: Privilege proc_setid missing, will not change uid/gid
**** v1    0.2 CLI RX|Name 'first' already defined.
**** v1    0.2 CLI RX|('<vcl.inline>' Line 8 Pos 21)
**** v1    0.2 CLI RX|                new first = debug.obj("FOO");
**** v1    0.2 CLI RX|--------------------#####--------------------
**** v1    0.2 CLI RX|
**** v1    0.2 CLI RX|First definition:
**** v1    0.2 CLI RX|('<vcl.inline>' Line 5 Pos 17)
**** v1    0.2 CLI RX|        backend first { .host = "127.0.0.1"; }
**** v1    0.2 CLI RX|----------------#####-------------------------
**** v1    0.2 CLI RX|
**** v1    0.2 CLI RX|Running VCC-compiler failed, exited with 2
**** v1    0.2 CLI RX|VCL compilation failed
**   v1    0.2 VCL compilation failed (as expected)
***  v1    0.2 Found expected string: ("Name 'first' already defined.")
*    top   0.2 RESETTING after ../../../bin/varnishtest/tests/r01510.vtc
**   v1    0.2 Wait
**** v1    0.2 CLI TX|backend.list
***  v1    0.2 CLI RX  101
**** v1    0.2 CLI RX|Unknown request in manager process (child not running).
**** v1    0.2 CLI RX|Type 'help' for more info.
**   v1    0.2 Stop
**** v1    0.2 CLI TX|stop
***  v1    0.2 CLI RX  300
**** v1    0.2 CLI RX|Child in state stopped
**** v1    0.2 CLI TX|status
***  v1    0.2 CLI RX  200
**** v1    0.2 CLI RX|Child in state stopped
**** v1    0.2 STDOUT poll 0x10
**   v1    0.2 R 32705 Status: 0000 (u 0.014000 s 0.042000)
#    top  TEST ../../../bin/varnishtest/tests/r01510.vtc TIMED OUT (kill -9)
#    top  TEST ../../../bin/varnishtest/tests/r01510.vtc FAILED (60.005) signal=9

1 @ SunOS 5.11 i86pc 1.04 32_sun12.4 uplex

*    top   0.0 TEST ../../../bin/varnishtest/tests/r01510.vtc starting
[...]
*    top   0.0 TEST Duplicate object names
[...]
**** v1    0.1 CLI TX|
**** v1    0.1 CLI TX|\tsub vcl_init {
**** v1    0.1 CLI TX|\t\tnew first = debug.obj("FOO");
**** v1    0.1 CLI TX|\t}
**** v1    0.1 CLI TX|
**** v1    0.1 CLI TX|%XJEIFLH|)Xspa8P
***  v1    0.1 CLI RX  106
**** v1    0.1 CLI RX|Message from VCC-compiler:
**** v1    0.1 CLI RX|Security: Privilege proc_setid missing, will not change uid/gid
**** v1    0.1 CLI RX|Name 'first' already defined.
**** v1    0.1 CLI RX|('<vcl.inline>' Line 8 Pos 21)
**** v1    0.1 CLI RX|                new first = debug.obj("FOO");
**** v1    0.1 CLI RX|--------------------#####--------------------
**** v1    0.1 CLI RX|
**** v1    0.1 CLI RX|First definition:
**** v1    0.1 CLI RX|('<vcl.inline>' Line 5 Pos 17)
**** v1    0.1 CLI RX|        backend first { .host = "127.0.0.1"; }
**** v1    0.1 CLI RX|----------------#####-------------------------
**** v1    0.1 CLI RX|
**** v1    0.1 CLI RX|Running VCC-compiler failed, exited with 2
**** v1    0.1 CLI RX|VCL compilation failed
**   v1    0.1 VCL compilation failed (as expected)
***  v1    0.1 Found expected string: ("Name 'first' already defined.")
*    top   0.1 RESETTING after ../../../bin/varnishtest/tests/r01510.vtc
**   v1    0.1 Wait
**** v1    0.1 CLI TX|backend.list
***  v1    0.1 CLI RX  101
**** v1    0.1 CLI RX|Unknown request in manager process (child not running).
**** v1    0.1 CLI RX|Type 'help' for more info.
**   v1    0.1 Stop
**** v1    0.1 CLI TX|stop
***  v1    0.1 CLI RX  300
**** v1    0.1 CLI RX|Child in state stopped
**** v1    0.1 CLI TX|status
***  v1    0.1 CLI RX  200
**** v1    0.1 CLI RX|Child in state stopped
**** v1    0.1 STDOUT poll 0x10
**   v1    0.1 R 50727 Status: 0000 (u 0.005000 s 0.019000)
#    top  TEST ../../../bin/varnishtest/tests/r01510.vtc TIMED OUT (kill -9)
#    top  TEST ../../../bin/varnishtest/tests/r01510.vtc FAILED (60.002) signal=9

1 @ SunOS 5.11 i86pc 1.04 64_gcc4.7 uplex

*    top   0.0 TEST ../../../bin/varnishtest/tests/r01510.vtc starting
[...]
*    top   0.0 TEST Duplicate object names
[...]
**** v1    0.1 CLI TX|
**** v1    0.1 CLI TX|\tsub vcl_init {
**** v1    0.1 CLI TX|\t\tnew first = debug.obj("FOO");
**** v1    0.1 CLI TX|\t}
**** v1    0.1 CLI TX|
**** v1    0.1 CLI TX|%XJEIFLH|)Xspa8P
***  v1    0.1 CLI RX  106
**** v1    0.1 CLI RX|Message from VCC-compiler:
**** v1    0.1 CLI RX|Security: Privilege proc_setid missing, will not change uid/gid
**** v1    0.1 CLI RX|Name 'first' already defined.
**** v1    0.1 CLI RX|('<vcl.inline>' Line 8 Pos 21)
**** v1    0.1 CLI RX|                new first = debug.obj("FOO");
**** v1    0.1 CLI RX|--------------------#####--------------------
**** v1    0.1 CLI RX|
**** v1    0.1 CLI RX|First definition:
**** v1    0.1 CLI RX|('<vcl.inline>' Line 5 Pos 17)
**** v1    0.1 CLI RX|        backend first { .host = "127.0.0.1"; }
**** v1    0.1 CLI RX|----------------#####-------------------------
**** v1    0.1 CLI RX|
**** v1    0.1 CLI RX|Running VCC-compiler failed, exited with 2
**** v1    0.1 CLI RX|VCL compilation failed
**   v1    0.1 VCL compilation failed (as expected)
***  v1    0.1 Found expected string: ("Name 'first' already defined.")
*    top   0.1 RESETTING after ../../../bin/varnishtest/tests/r01510.vtc
**   v1    0.1 Wait
**** v1    0.1 CLI TX|backend.list
***  v1    0.1 CLI RX  101
**** v1    0.1 CLI RX|Unknown request in manager process (child not running).
**** v1    0.1 CLI RX|Type 'help' for more info.
**   v1    0.1 Stop
**** v1    0.1 CLI TX|stop
***  v1    0.1 CLI RX  300
**** v1    0.1 CLI RX|Child in state stopped
**** v1    0.1 CLI TX|status
***  v1    0.1 CLI RX  200
**** v1    0.1 CLI RX|Child in state stopped
**** v1    0.1 STDOUT poll 0x10
**   v1    0.1 R 80248 Status: 0000 (u 0.009000 s 0.028000)
#    top  TEST ../../../bin/varnishtest/tests/r01510.vtc TIMED OUT (kill -9)
#    top  TEST ../../../bin/varnishtest/tests/r01510.vtc FAILED (60.003) signal=9

1 @ SunOS 5.11 i86pc 1.04 32_sun12.4 uplex

*    top   0.0 TEST ../../../bin/varnishtest/tests/r01510.vtc starting
[...]
*    top   0.0 TEST Duplicate object names
[...]
**** v1    0.1 CLI TX|
**** v1    0.1 CLI TX|\tsub vcl_init {
**** v1    0.1 CLI TX|\t\tnew first = debug.obj("FOO");
**** v1    0.1 CLI TX|\t}
**** v1    0.1 CLI TX|
**** v1    0.1 CLI TX|%XJEIFLH|)Xspa8P
***  v1    0.1 CLI RX  106
**** v1    0.1 CLI RX|Message from VCC-compiler:
**** v1    0.1 CLI RX|Security: Privilege proc_setid missing, will not change uid/gid
**** v1    0.1 CLI RX|Name 'first' already defined.
**** v1    0.1 CLI RX|('<vcl.inline>' Line 8 Pos 21)
**** v1    0.1 CLI RX|                new first = debug.obj("FOO");
**** v1    0.1 CLI RX|--------------------#####--------------------
**** v1    0.1 CLI RX|
**** v1    0.1 CLI RX|First definition:
**** v1    0.1 CLI RX|('<vcl.inline>' Line 5 Pos 17)
**** v1    0.1 CLI RX|        backend first { .host = "127.0.0.1"; }
**** v1    0.1 CLI RX|----------------#####-------------------------
**** v1    0.1 CLI RX|
**** v1    0.1 CLI RX|Running VCC-compiler failed, exited with 2
**** v1    0.1 CLI RX|VCL compilation failed
**   v1    0.1 VCL compilation failed (as expected)
***  v1    0.1 Found expected string: ("Name 'first' already defined.")
*    top   0.1 RESETTING after ../../../bin/varnishtest/tests/r01510.vtc
**   v1    0.1 Wait
**** v1    0.1 CLI TX|backend.list
***  v1    0.1 CLI RX  101
**** v1    0.1 CLI RX|Unknown request in manager process (child not running).
**** v1    0.1 CLI RX|Type 'help' for more info.
**   v1    0.1 Stop
**** v1    0.1 CLI TX|stop
***  v1    0.1 CLI RX  300
**** v1    0.1 CLI RX|Child in state stopped
**** v1    0.1 CLI TX|status
***  v1    0.1 CLI RX  200
**** v1    0.1 CLI RX|Child in state stopped
**** v1    0.1 STDOUT poll 0x10
**   v1    0.1 R 111 Status: 0000 (u 0.006000 s 0.019000)
#    top  TEST ../../../bin/varnishtest/tests/r01510.vtc TIMED OUT (kill -9)
#    top  TEST ../../../bin/varnishtest/tests/r01510.vtc FAILED (60.002) signal=9

1 @ SunOS 5.11 i86pc 1.04 64_gcc4.7 uplex

*    top   0.0 TEST ../../../bin/varnishtest/tests/r01510.vtc starting
[...]
*    top   0.0 TEST Duplicate object names
[...]
**** v1    0.1 CLI TX|
**** v1    0.1 CLI TX|\tsub vcl_init {
**** v1    0.1 CLI TX|\t\tnew first = debug.obj("FOO");
**** v1    0.1 CLI TX|\t}
**** v1    0.1 CLI TX|
**** v1    0.1 CLI TX|%XJEIFLH|)Xspa8P
***  v1    0.1 CLI RX  106
**** v1    0.1 CLI RX|Message from VCC-compiler:
**** v1    0.1 CLI RX|Security: Privilege proc_setid missing, will not change uid/gid
**** v1    0.1 CLI RX|Name 'first' already defined.
**** v1    0.1 CLI RX|('<vcl.inline>' Line 8 Pos 21)
**** v1    0.1 CLI RX|                new first = debug.obj("FOO");
**** v1    0.1 CLI RX|--------------------#####--------------------
**** v1    0.1 CLI RX|
**** v1    0.1 CLI RX|First definition:
**** v1    0.1 CLI RX|('<vcl.inline>' Line 5 Pos 17)
**** v1    0.1 CLI RX|        backend first { .host = "127.0.0.1"; }
**** v1    0.1 CLI RX|----------------#####-------------------------
**** v1    0.1 CLI RX|
**** v1    0.1 CLI RX|Running VCC-compiler failed, exited with 2
**** v1    0.1 CLI RX|VCL compilation failed
**   v1    0.1 VCL compilation failed (as expected)
***  v1    0.1 Found expected string: ("Name 'first' already defined.")
*    top   0.1 RESETTING after ../../../bin/varnishtest/tests/r01510.vtc
**   v1    0.1 Wait
**** v1    0.1 CLI TX|backend.list
***  v1    0.1 CLI RX  101
**** v1    0.1 CLI RX|Unknown request in manager process (child not running).
**** v1    0.1 CLI RX|Type 'help' for more info.
**   v1    0.1 Stop
**** v1    0.1 CLI TX|stop
***  v1    0.1 CLI RX  300
**** v1    0.1 CLI RX|Child in state stopped
**** v1    0.1 CLI TX|status
***  v1    0.1 CLI RX  200
**** v1    0.1 CLI RX|Child in state stopped
**** v1    0.1 STDOUT poll 0x10
**   v1    0.1 R 7381 Status: 0000 (u 0.008000 s 0.028000)
#    top  TEST ../../../bin/varnishtest/tests/r01510.vtc TIMED OUT (kill -9)
#    top  TEST ../../../bin/varnishtest/tests/r01510.vtc FAILED (60.003) signal=9