r01569

8bbbdfa

1 @ SunOS 5.11 i86pc 1.04 64_gcc4.7 uplex

*    top   0.0 TEST ../../../bin/varnishtest/tests/r01569.vtc starting
[...]
*    top   0.0 TEST symbol lookup order issue
[...]
**** v1    0.1 CLI TX|\tsub vcl_recv {
**** v1    0.1 CLI TX|\t\tcall debug;
**** v1    0.1 CLI TX|\t}
**** v1    0.1 CLI TX|
**** v1    0.1 CLI TX|%XJEIFLH|)Xspa8P
***  v1    0.1 CLI RX  106
**** v1    0.1 CLI RX|Message from VCC-compiler:
**** v1    0.1 CLI RX|Security: Privilege proc_setid missing, will not change uid/gid
**** v1    0.1 CLI RX|Name 'debug' already defined.
**** v1    0.1 CLI RX|('<vcl.inline>' Line 6 Pos 17)
**** v1    0.1 CLI RX|        backend debug {
**** v1    0.1 CLI RX|----------------#####--
**** v1    0.1 CLI RX|
**** v1    0.1 CLI RX|First definition:
**** v1    0.1 CLI RX|('<vcl.inline>' Line 4 Pos 9)
**** v1    0.1 CLI RX|        import debug;
**** v1    0.1 CLI RX|--------######-------
**** v1    0.1 CLI RX|
**** v1    0.1 CLI RX|Running VCC-compiler failed, exited with 2
**** v1    0.1 CLI RX|VCL compilation failed
**   v1    0.1 VCL compilation failed (as expected)
***  v1    0.1 Found expected string: ("Name 'debug' already defined.")
*    top   0.1 RESETTING after ../../../bin/varnishtest/tests/r01569.vtc
**   v1    0.1 Wait
**** v1    0.1 CLI TX|backend.list
***  v1    0.1 CLI RX  101
**** v1    0.1 CLI RX|Unknown request in manager process (child not running).
**** v1    0.1 CLI RX|Type 'help' for more info.
**   v1    0.1 Stop
**** v1    0.1 CLI TX|stop
***  v1    0.1 CLI RX  300
**** v1    0.1 CLI RX|Child in state stopped
**** v1    0.1 CLI TX|status
***  v1    0.1 CLI RX  200
**** v1    0.1 CLI RX|Child in state stopped
**** v1    0.1 STDOUT poll 0x10
**   v1    0.1 R 12906 Status: 0000 (u 0.007000 s 0.027000)
*    diag  0.0 ............................................................
#    top  TEST ../../../bin/varnishtest/tests/r01569.vtc TIMED OUT (kill -9)
#    top  TEST ../../../bin/varnishtest/tests/r01569.vtc FAILED (60.006) signal=9

1 @ Ubuntu LTS i686 1.04 fgs

*    top   0.0 TEST ../../../bin/varnishtest/tests/r01569.vtc starting
[...]
*    top   0.0 TEST symbol lookup order issue
[...]
**** v1    0.1 CLI TX|
**** v1    0.1 CLI TX|\tsub vcl_recv {
**** v1    0.1 CLI TX|\t\tcall debug;
**** v1    0.1 CLI TX|\t}
**** v1    0.1 CLI TX|
**** v1    0.1 CLI TX|%XJEIFLH|)Xspa8P
***  v1    0.1 CLI RX  106
**** v1    0.1 CLI RX|Message from VCC-compiler:
**** v1    0.1 CLI RX|Name 'debug' already defined.
**** v1    0.1 CLI RX|('<vcl.inline>' Line 6 Pos 17)
**** v1    0.1 CLI RX|        backend debug {
**** v1    0.1 CLI RX|----------------#####--
**** v1    0.1 CLI RX|
**** v1    0.1 CLI RX|First definition:
**** v1    0.1 CLI RX|('<vcl.inline>' Line 4 Pos 9)
**** v1    0.1 CLI RX|        import debug;
**** v1    0.1 CLI RX|--------######-------
**** v1    0.1 CLI RX|
**** v1    0.1 CLI RX|Running VCC-compiler failed, exited with 2
**** v1    0.1 CLI RX|VCL compilation failed
**   v1    0.1 VCL compilation failed (as expected)
***  v1    0.1 Found expected string: ("Name 'debug' already defined.")
*    top   0.1 RESETTING after ../../../bin/varnishtest/tests/r01569.vtc
**   v1    0.1 Wait
**** v1    0.1 CLI TX|backend.list
***  v1    0.1 CLI RX  101
**** v1    0.1 CLI RX|Unknown request in manager process (child not running).
**** v1    0.1 CLI RX|Type 'help' for more info.
**   v1    0.1 Stop
**** v1    0.1 CLI TX|stop
***  v1    0.2 CLI RX  300
**** v1    0.2 CLI RX|Child in state stopped
**** v1    0.2 CLI TX|status
***  v1    0.2 CLI RX  200
**** v1    0.2 CLI RX|Child in state stopped
**** v1    0.2 STDOUT poll 0x10
**   v1    0.2 R 16190 Status: 0000 (u 0.000000 s 0.004000)
*    diag  0.0 ............................................................
#    top  TEST ../../../bin/varnishtest/tests/r01569.vtc TIMED OUT (kill -9)
#    top  TEST ../../../bin/varnishtest/tests/r01569.vtc FAILED (60.001) signal=9

1 @ SunOS 5.11 i86pc 1.04 64_sun12.4 uplex

*    top   0.0 TEST ../../../bin/varnishtest/tests/r01569.vtc starting
[...]
*    top   0.0 TEST symbol lookup order issue
[...]
**** v1    0.1 CLI TX|\tsub vcl_recv {
**** v1    0.1 CLI TX|\t\tcall debug;
**** v1    0.1 CLI TX|\t}
**** v1    0.1 CLI TX|
**** v1    0.1 CLI TX|%XJEIFLH|)Xspa8P
***  v1    0.1 CLI RX  106
**** v1    0.1 CLI RX|Message from VCC-compiler:
**** v1    0.1 CLI RX|Security: Privilege proc_setid missing, will not change uid/gid
**** v1    0.1 CLI RX|Name 'debug' already defined.
**** v1    0.1 CLI RX|('<vcl.inline>' Line 6 Pos 17)
**** v1    0.1 CLI RX|        backend debug {
**** v1    0.1 CLI RX|----------------#####--
**** v1    0.1 CLI RX|
**** v1    0.1 CLI RX|First definition:
**** v1    0.1 CLI RX|('<vcl.inline>' Line 4 Pos 9)
**** v1    0.1 CLI RX|        import debug;
**** v1    0.1 CLI RX|--------######-------
**** v1    0.1 CLI RX|
**** v1    0.1 CLI RX|Running VCC-compiler failed, exited with 2
**** v1    0.1 CLI RX|VCL compilation failed
**   v1    0.1 VCL compilation failed (as expected)
***  v1    0.1 Found expected string: ("Name 'debug' already defined.")
*    top   0.1 RESETTING after ../../../bin/varnishtest/tests/r01569.vtc
**   v1    0.1 Wait
**** v1    0.1 CLI TX|backend.list
***  v1    0.1 CLI RX  101
**** v1    0.1 CLI RX|Unknown request in manager process (child not running).
**** v1    0.1 CLI RX|Type 'help' for more info.
**   v1    0.1 Stop
**** v1    0.1 CLI TX|stop
***  v1    0.1 CLI RX  300
**** v1    0.1 CLI RX|Child in state stopped
**** v1    0.1 CLI TX|status
***  v1    0.1 CLI RX  200
**** v1    0.1 CLI RX|Child in state stopped
**** v1    0.1 STDOUT poll 0x10
**   v1    0.1 R 98445 Status: 0000 (u 0.007000 s 0.022000)
*    diag  0.0 ............................................................
#    top  TEST ../../../bin/varnishtest/tests/r01569.vtc TIMED OUT (kill -9)
#    top  TEST ../../../bin/varnishtest/tests/r01569.vtc FAILED (60.004) signal=9

1 @ Linux 3.10.0 x86_64 1.02 mblissett

*    top   0.0 TEST ../../../bin/varnishtest/tests/r01569.vtc starting
[...]
*    top   0.0 TEST symbol lookup order issue
[...]
**** v1    0.1 CLI TX|
**** v1    0.1 CLI TX|\tsub vcl_recv {
**** v1    0.1 CLI TX|\t\tcall debug;
**** v1    0.1 CLI TX|\t}
**** v1    0.1 CLI TX|
**** v1    0.1 CLI TX|%XJEIFLH|)Xspa8P
***  v1    0.1 CLI RX  106
**** v1    0.1 CLI RX|Message from VCC-compiler:
**** v1    0.1 CLI RX|Name 'debug' already defined.
**** v1    0.1 CLI RX|('<vcl.inline>' Line 6 Pos 17)
**** v1    0.1 CLI RX|        backend debug {
**** v1    0.1 CLI RX|----------------#####--
**** v1    0.1 CLI RX|
**** v1    0.1 CLI RX|First definition:
**** v1    0.1 CLI RX|('<vcl.inline>' Line 4 Pos 9)
**** v1    0.1 CLI RX|        import debug;
**** v1    0.1 CLI RX|--------######-------
**** v1    0.1 CLI RX|
**** v1    0.1 CLI RX|Running VCC-compiler failed, exited with 2
**** v1    0.1 CLI RX|VCL compilation failed
**   v1    0.1 VCL compilation failed (as expected)
***  v1    0.1 Found expected string: ("Name 'debug' already defined.")
*    top   0.1 RESETTING after ../../../bin/varnishtest/tests/r01569.vtc
**   v1    0.1 Wait
**** v1    0.1 CLI TX|backend.list
***  v1    0.2 CLI RX  101
**** v1    0.2 CLI RX|Unknown request in manager process (child not running).
**** v1    0.2 CLI RX|Type 'help' for more info.
**   v1    0.2 Stop
**** v1    0.2 CLI TX|stop
***  v1    0.2 CLI RX  300
**** v1    0.2 CLI RX|Child in state stopped
**** v1    0.2 CLI TX|status
***  v1    0.2 CLI RX  200
**** v1    0.2 CLI RX|Child in state stopped
**** v1    0.2 STDOUT poll 0x10
**   v1    0.2 R 6127 Status: 0000 (u 0.003886 s 0.010693)
*    diag  0.0 ............................................................
#    top  TEST ../../../bin/varnishtest/tests/r01569.vtc TIMED OUT (kill -9)
#    top  TEST ../../../bin/varnishtest/tests/r01569.vtc FAILED (60.001) signal=9

1 @ Linux 3.10.0 x86_64 1.02 mblissett

*    top   0.0 TEST ../../../bin/varnishtest/tests/r01569.vtc starting
[...]
*    top   0.0 TEST symbol lookup order issue
[...]
**** v1    0.1 CLI TX|
**** v1    0.1 CLI TX|\tsub vcl_recv {
**** v1    0.1 CLI TX|\t\tcall debug;
**** v1    0.1 CLI TX|\t}
**** v1    0.1 CLI TX|
**** v1    0.1 CLI TX|%XJEIFLH|)Xspa8P
***  v1    0.1 CLI RX  106
**** v1    0.1 CLI RX|Message from VCC-compiler:
**** v1    0.1 CLI RX|Name 'debug' already defined.
**** v1    0.1 CLI RX|('<vcl.inline>' Line 6 Pos 17)
**** v1    0.1 CLI RX|        backend debug {
**** v1    0.1 CLI RX|----------------#####--
**** v1    0.1 CLI RX|
**** v1    0.1 CLI RX|First definition:
**** v1    0.1 CLI RX|('<vcl.inline>' Line 4 Pos 9)
**** v1    0.1 CLI RX|        import debug;
**** v1    0.1 CLI RX|--------######-------
**** v1    0.1 CLI RX|
**** v1    0.1 CLI RX|Running VCC-compiler failed, exited with 2
**** v1    0.1 CLI RX|VCL compilation failed
**   v1    0.1 VCL compilation failed (as expected)
***  v1    0.1 Found expected string: ("Name 'debug' already defined.")
*    top   0.1 RESETTING after ../../../bin/varnishtest/tests/r01569.vtc
**   v1    0.1 Wait
**** v1    0.1 CLI TX|backend.list
***  v1    0.2 CLI RX  101
**** v1    0.2 CLI RX|Unknown request in manager process (child not running).
**** v1    0.2 CLI RX|Type 'help' for more info.
**   v1    0.2 Stop
**** v1    0.2 CLI TX|stop
***  v1    0.2 CLI RX  300
**** v1    0.2 CLI RX|Child in state stopped
**** v1    0.2 CLI TX|status
***  v1    0.2 CLI RX  200
**** v1    0.2 CLI RX|Child in state stopped
**** v1    0.2 STDOUT poll 0x10
**   v1    0.2 R 25823 Status: 0000 (u 0.001876 s 0.010820)
*    diag  0.0 ............................................................
#    top  TEST ../../../bin/varnishtest/tests/r01569.vtc TIMED OUT (kill -9)
#    top  TEST ../../../bin/varnishtest/tests/r01569.vtc FAILED (60.001) signal=9

1 @ SunOS 5.11 i86pc 1.04 32_gcc4.7 uplex

*    top   0.0 TEST ../../../bin/varnishtest/tests/r01569.vtc starting
[...]
*    top   0.0 TEST symbol lookup order issue
[...]
**** v1    0.1 CLI TX|\tsub vcl_recv {
**** v1    0.1 CLI TX|\t\tcall debug;
**** v1    0.1 CLI TX|\t}
**** v1    0.1 CLI TX|
**** v1    0.1 CLI TX|%XJEIFLH|)Xspa8P
***  v1    0.1 CLI RX  106
**** v1    0.1 CLI RX|Message from VCC-compiler:
**** v1    0.1 CLI RX|Security: Privilege proc_setid missing, will not change uid/gid
**** v1    0.1 CLI RX|Name 'debug' already defined.
**** v1    0.1 CLI RX|('<vcl.inline>' Line 6 Pos 17)
**** v1    0.1 CLI RX|        backend debug {
**** v1    0.1 CLI RX|----------------#####--
**** v1    0.1 CLI RX|
**** v1    0.1 CLI RX|First definition:
**** v1    0.1 CLI RX|('<vcl.inline>' Line 4 Pos 9)
**** v1    0.1 CLI RX|        import debug;
**** v1    0.1 CLI RX|--------######-------
**** v1    0.1 CLI RX|
**** v1    0.1 CLI RX|Running VCC-compiler failed, exited with 2
**** v1    0.1 CLI RX|VCL compilation failed
**   v1    0.1 VCL compilation failed (as expected)
***  v1    0.1 Found expected string: ("Name 'debug' already defined.")
*    top   0.1 RESETTING after ../../../bin/varnishtest/tests/r01569.vtc
**   v1    0.1 Wait
**** v1    0.1 CLI TX|backend.list
***  v1    0.1 CLI RX  101
**** v1    0.1 CLI RX|Unknown request in manager process (child not running).
**** v1    0.1 CLI RX|Type 'help' for more info.
**   v1    0.1 Stop
**** v1    0.1 CLI TX|stop
***  v1    0.1 CLI RX  300
**** v1    0.1 CLI RX|Child in state stopped
**** v1    0.1 CLI TX|status
***  v1    0.1 CLI RX  200
**** v1    0.1 CLI RX|Child in state stopped
**** v1    0.1 STDOUT poll 0x10
**   v1    0.1 R 90731 Status: 0000 (u 0.005000 s 0.017000)
*    diag  0.0 ............................................................
#    top  TEST ../../../bin/varnishtest/tests/r01569.vtc TIMED OUT (kill -9)
#    top  TEST ../../../bin/varnishtest/tests/r01569.vtc FAILED (60.002) signal=9

1 @ SunOS 5.11 i86pc 1.04 32_gcc4.7 uplex

*    top   0.0 TEST ../../../bin/varnishtest/tests/r01569.vtc starting
[...]
*    top   0.0 TEST symbol lookup order issue
[...]
**** v1    0.1 CLI TX|\tsub vcl_recv {
**** v1    0.1 CLI TX|\t\tcall debug;
**** v1    0.1 CLI TX|\t}
**** v1    0.1 CLI TX|
**** v1    0.1 CLI TX|%XJEIFLH|)Xspa8P
***  v1    0.1 CLI RX  106
**** v1    0.1 CLI RX|Message from VCC-compiler:
**** v1    0.1 CLI RX|Security: Privilege proc_setid missing, will not change uid/gid
**** v1    0.1 CLI RX|Name 'debug' already defined.
**** v1    0.1 CLI RX|('<vcl.inline>' Line 6 Pos 17)
**** v1    0.1 CLI RX|        backend debug {
**** v1    0.1 CLI RX|----------------#####--
**** v1    0.1 CLI RX|
**** v1    0.1 CLI RX|First definition:
**** v1    0.1 CLI RX|('<vcl.inline>' Line 4 Pos 9)
**** v1    0.1 CLI RX|        import debug;
**** v1    0.1 CLI RX|--------######-------
**** v1    0.1 CLI RX|
**** v1    0.1 CLI RX|Running VCC-compiler failed, exited with 2
**** v1    0.1 CLI RX|VCL compilation failed
**   v1    0.1 VCL compilation failed (as expected)
***  v1    0.1 Found expected string: ("Name 'debug' already defined.")
*    top   0.1 RESETTING after ../../../bin/varnishtest/tests/r01569.vtc
**   v1    0.1 Wait
**** v1    0.1 CLI TX|backend.list
***  v1    0.1 CLI RX  101
**** v1    0.1 CLI RX|Unknown request in manager process (child not running).
**** v1    0.1 CLI RX|Type 'help' for more info.
**   v1    0.1 Stop
**** v1    0.1 CLI TX|stop
***  v1    0.1 CLI RX  300
**** v1    0.1 CLI RX|Child in state stopped
**** v1    0.1 CLI TX|status
***  v1    0.1 CLI RX  200
**** v1    0.1 CLI RX|Child in state stopped
**** v1    0.1 STDOUT poll 0x10
**   v1    0.1 R 5825 Status: 0000 (u 0.005000 s 0.021000)
*    diag  0.0 ............................................................
#    top  TEST ../../../bin/varnishtest/tests/r01569.vtc TIMED OUT (kill -9)
#    top  TEST ../../../bin/varnishtest/tests/r01569.vtc FAILED (60.002) signal=9

1 @ SunOS 5.11 i86pc 1.04 32_gcc4.7 uplex

*    top   0.0 TEST ../../../bin/varnishtest/tests/r01569.vtc starting
[...]
*    top   0.0 TEST symbol lookup order issue
[...]
**** v1    0.1 CLI TX|\tsub vcl_recv {
**** v1    0.1 CLI TX|\t\tcall debug;
**** v1    0.1 CLI TX|\t}
**** v1    0.1 CLI TX|
**** v1    0.1 CLI TX|%XJEIFLH|)Xspa8P
***  v1    0.1 CLI RX  106
**** v1    0.1 CLI RX|Message from VCC-compiler:
**** v1    0.1 CLI RX|Security: Privilege proc_setid missing, will not change uid/gid
**** v1    0.1 CLI RX|Name 'debug' already defined.
**** v1    0.1 CLI RX|('<vcl.inline>' Line 6 Pos 17)
**** v1    0.1 CLI RX|        backend debug {
**** v1    0.1 CLI RX|----------------#####--
**** v1    0.1 CLI RX|
**** v1    0.1 CLI RX|First definition:
**** v1    0.1 CLI RX|('<vcl.inline>' Line 4 Pos 9)
**** v1    0.1 CLI RX|        import debug;
**** v1    0.1 CLI RX|--------######-------
**** v1    0.1 CLI RX|
**** v1    0.1 CLI RX|Running VCC-compiler failed, exited with 2
**** v1    0.1 CLI RX|VCL compilation failed
**   v1    0.1 VCL compilation failed (as expected)
***  v1    0.1 Found expected string: ("Name 'debug' already defined.")
*    top   0.1 RESETTING after ../../../bin/varnishtest/tests/r01569.vtc
**   v1    0.1 Wait
**** v1    0.1 CLI TX|backend.list
***  v1    0.1 CLI RX  101
**** v1    0.1 CLI RX|Unknown request in manager process (child not running).
**** v1    0.1 CLI RX|Type 'help' for more info.
**   v1    0.1 Stop
**** v1    0.1 CLI TX|stop
***  v1    0.1 CLI RX  300
**** v1    0.1 CLI RX|Child in state stopped
**** v1    0.1 CLI TX|status
***  v1    0.1 CLI RX  200
**** v1    0.1 CLI RX|Child in state stopped
**** v1    0.1 STDOUT poll 0x10
**   v1    0.1 R 64051 Status: 0000 (u 0.005000 s 0.017000)
*    diag  0.0 ............................................................
#    top  TEST ../../../bin/varnishtest/tests/r01569.vtc TIMED OUT (kill -9)
#    top  TEST ../../../bin/varnishtest/tests/r01569.vtc FAILED (60.002) signal=9

1 @ Linux 3.10.0 x86_64 1.02 mblissett

*    top   0.0 TEST ../../../bin/varnishtest/tests/r01569.vtc starting
[...]
*    top   0.0 TEST symbol lookup order issue
[...]
**** v1    0.1 CLI TX|
**** v1    0.1 CLI TX|\tsub vcl_recv {
**** v1    0.1 CLI TX|\t\tcall debug;
**** v1    0.1 CLI TX|\t}
**** v1    0.1 CLI TX|
**** v1    0.1 CLI TX|%XJEIFLH|)Xspa8P
***  v1    0.1 CLI RX  106
**** v1    0.1 CLI RX|Message from VCC-compiler:
**** v1    0.1 CLI RX|Name 'debug' already defined.
**** v1    0.1 CLI RX|('<vcl.inline>' Line 6 Pos 17)
**** v1    0.1 CLI RX|        backend debug {
**** v1    0.1 CLI RX|----------------#####--
**** v1    0.1 CLI RX|
**** v1    0.1 CLI RX|First definition:
**** v1    0.1 CLI RX|('<vcl.inline>' Line 4 Pos 9)
**** v1    0.1 CLI RX|        import debug;
**** v1    0.1 CLI RX|--------######-------
**** v1    0.1 CLI RX|
**** v1    0.1 CLI RX|Running VCC-compiler failed, exited with 2
**** v1    0.1 CLI RX|VCL compilation failed
**   v1    0.1 VCL compilation failed (as expected)
***  v1    0.1 Found expected string: ("Name 'debug' already defined.")
*    top   0.1 RESETTING after ../../../bin/varnishtest/tests/r01569.vtc
**   v1    0.1 Wait
**** v1    0.1 CLI TX|backend.list
***  v1    0.2 CLI RX  101
**** v1    0.2 CLI RX|Unknown request in manager process (child not running).
**** v1    0.2 CLI RX|Type 'help' for more info.
**   v1    0.2 Stop
**** v1    0.2 CLI TX|stop
***  v1    0.2 CLI RX  300
**** v1    0.2 CLI RX|Child in state stopped
**** v1    0.2 CLI TX|status
***  v1    0.2 CLI RX  200
**** v1    0.2 CLI RX|Child in state stopped
**** v1    0.2 STDOUT poll 0x10
**   v1    0.2 R 15801 Status: 0000 (u 0.004231 s 0.017041)
*    diag  0.0 ............................................................
#    top  TEST ../../../bin/varnishtest/tests/r01569.vtc TIMED OUT (kill -9)
#    top  TEST ../../../bin/varnishtest/tests/r01569.vtc FAILED (60.001) signal=9

1 @ SunOS 5.11 i86pc 1.04 32_gcc4.7 uplex

*    top   0.0 TEST ../../../bin/varnishtest/tests/r01569.vtc starting
[...]
*    top   0.0 TEST symbol lookup order issue
[...]
**** v1    0.1 CLI TX|\tsub vcl_recv {
**** v1    0.1 CLI TX|\t\tcall debug;
**** v1    0.1 CLI TX|\t}
**** v1    0.1 CLI TX|
**** v1    0.1 CLI TX|%XJEIFLH|)Xspa8P
***  v1    0.1 CLI RX  106
**** v1    0.1 CLI RX|Message from VCC-compiler:
**** v1    0.1 CLI RX|Security: Privilege proc_setid missing, will not change uid/gid
**** v1    0.1 CLI RX|Name 'debug' already defined.
**** v1    0.1 CLI RX|('<vcl.inline>' Line 6 Pos 17)
**** v1    0.1 CLI RX|        backend debug {
**** v1    0.1 CLI RX|----------------#####--
**** v1    0.1 CLI RX|
**** v1    0.1 CLI RX|First definition:
**** v1    0.1 CLI RX|('<vcl.inline>' Line 4 Pos 9)
**** v1    0.1 CLI RX|        import debug;
**** v1    0.1 CLI RX|--------######-------
**** v1    0.1 CLI RX|
**** v1    0.1 CLI RX|Running VCC-compiler failed, exited with 2
**** v1    0.1 CLI RX|VCL compilation failed
**   v1    0.1 VCL compilation failed (as expected)
***  v1    0.1 Found expected string: ("Name 'debug' already defined.")
*    top   0.1 RESETTING after ../../../bin/varnishtest/tests/r01569.vtc
**   v1    0.1 Wait
**** v1    0.1 CLI TX|backend.list
***  v1    0.1 CLI RX  101
**** v1    0.1 CLI RX|Unknown request in manager process (child not running).
**** v1    0.1 CLI RX|Type 'help' for more info.
**   v1    0.1 Stop
**** v1    0.1 CLI TX|stop
***  v1    0.1 CLI RX  300
**** v1    0.1 CLI RX|Child in state stopped
**** v1    0.1 CLI TX|status
***  v1    0.1 CLI RX  200
**** v1    0.1 CLI RX|Child in state stopped
**** v1    0.1 STDOUT poll 0x10
**   v1    0.1 R 13121 Status: 0000 (u 0.005000 s 0.017000)
*    diag  0.0 ............................................................
#    top  TEST ../../../bin/varnishtest/tests/r01569.vtc TIMED OUT (kill -9)
#    top  TEST ../../../bin/varnishtest/tests/r01569.vtc FAILED (60.002) signal=9

1 @ SunOS 5.11 i86pc 1.04 32_gcc4.7 uplex

*    top   0.0 TEST ../../../bin/varnishtest/tests/r01569.vtc starting
[...]
*    top   0.0 TEST symbol lookup order issue
[...]
**** v1    0.1 CLI TX|\tsub vcl_recv {
**** v1    0.1 CLI TX|\t\tcall debug;
**** v1    0.1 CLI TX|\t}
**** v1    0.1 CLI TX|
**** v1    0.1 CLI TX|%XJEIFLH|)Xspa8P
***  v1    0.1 CLI RX  106
**** v1    0.1 CLI RX|Message from VCC-compiler:
**** v1    0.1 CLI RX|Security: Privilege proc_setid missing, will not change uid/gid
**** v1    0.1 CLI RX|Name 'debug' already defined.
**** v1    0.1 CLI RX|('<vcl.inline>' Line 6 Pos 17)
**** v1    0.1 CLI RX|        backend debug {
**** v1    0.1 CLI RX|----------------#####--
**** v1    0.1 CLI RX|
**** v1    0.1 CLI RX|First definition:
**** v1    0.1 CLI RX|('<vcl.inline>' Line 4 Pos 9)
**** v1    0.1 CLI RX|        import debug;
**** v1    0.1 CLI RX|--------######-------
**** v1    0.1 CLI RX|
**** v1    0.1 CLI RX|Running VCC-compiler failed, exited with 2
**** v1    0.1 CLI RX|VCL compilation failed
**   v1    0.1 VCL compilation failed (as expected)
***  v1    0.1 Found expected string: ("Name 'debug' already defined.")
*    top   0.1 RESETTING after ../../../bin/varnishtest/tests/r01569.vtc
**   v1    0.1 Wait
**** v1    0.1 CLI TX|backend.list
***  v1    0.1 CLI RX  101
**** v1    0.1 CLI RX|Unknown request in manager process (child not running).
**** v1    0.1 CLI RX|Type 'help' for more info.
**   v1    0.1 Stop
**** v1    0.1 CLI TX|stop
***  v1    0.1 CLI RX  300
**** v1    0.1 CLI RX|Child in state stopped
**** v1    0.1 CLI TX|status
***  v1    0.1 CLI RX  200
**** v1    0.1 CLI RX|Child in state stopped
**** v1    0.1 STDOUT poll 0x10
**   v1    0.1 R 96530 Status: 0000 (u 0.005000 s 0.017000)
*    diag  0.0 ............................................................
#    top  TEST ../../../bin/varnishtest/tests/r01569.vtc TIMED OUT (kill -9)
#    top  TEST ../../../bin/varnishtest/tests/r01569.vtc FAILED (60.002) signal=9

1 @ SunOS 5.11 i86pc 1.04 64_gcc4.7 uplex

*    top   0.0 TEST ../../../bin/varnishtest/tests/r01569.vtc starting
[...]
*    top   0.0 TEST symbol lookup order issue
[...]
**** v1    0.1 CLI TX|\tsub vcl_recv {
**** v1    0.1 CLI TX|\t\tcall debug;
**** v1    0.1 CLI TX|\t}
**** v1    0.1 CLI TX|
**** v1    0.1 CLI TX|%XJEIFLH|)Xspa8P
***  v1    0.1 CLI RX  106
**** v1    0.1 CLI RX|Message from VCC-compiler:
**** v1    0.1 CLI RX|Security: Privilege proc_setid missing, will not change uid/gid
**** v1    0.1 CLI RX|Name 'debug' already defined.
**** v1    0.1 CLI RX|('<vcl.inline>' Line 6 Pos 17)
**** v1    0.1 CLI RX|        backend debug {
**** v1    0.1 CLI RX|----------------#####--
**** v1    0.1 CLI RX|
**** v1    0.1 CLI RX|First definition:
**** v1    0.1 CLI RX|('<vcl.inline>' Line 4 Pos 9)
**** v1    0.1 CLI RX|        import debug;
**** v1    0.1 CLI RX|--------######-------
**** v1    0.1 CLI RX|
**** v1    0.1 CLI RX|Running VCC-compiler failed, exited with 2
**** v1    0.1 CLI RX|VCL compilation failed
**   v1    0.1 VCL compilation failed (as expected)
***  v1    0.1 Found expected string: ("Name 'debug' already defined.")
*    top   0.1 RESETTING after ../../../bin/varnishtest/tests/r01569.vtc
**   v1    0.1 Wait
**** v1    0.1 CLI TX|backend.list
***  v1    0.1 CLI RX  101
**** v1    0.1 CLI RX|Unknown request in manager process (child not running).
**** v1    0.1 CLI RX|Type 'help' for more info.
**   v1    0.1 Stop
**** v1    0.1 CLI TX|stop
***  v1    0.1 CLI RX  300
**** v1    0.1 CLI RX|Child in state stopped
**** v1    0.1 CLI TX|status
***  v1    0.1 CLI RX  200
**** v1    0.1 CLI RX|Child in state stopped
**** v1    0.1 STDOUT poll 0x10
**   v1    0.1 R 35521 Status: 0000 (u 0.006000 s 0.024000)
*    diag  0.0 ............................................................
#    top  TEST ../../../bin/varnishtest/tests/r01569.vtc TIMED OUT (kill -9)
#    top  TEST ../../../bin/varnishtest/tests/r01569.vtc FAILED (60.004) signal=9

1 @ SunOS 5.11 i86pc 1.04 64_sun12.4 uplex

*    top   0.0 TEST ../../../bin/varnishtest/tests/r01569.vtc starting
[...]
*    top   0.0 TEST symbol lookup order issue
[...]
**** v1    0.1 CLI TX|\tsub vcl_recv {
**** v1    0.1 CLI TX|\t\tcall debug;
**** v1    0.1 CLI TX|\t}
**** v1    0.1 CLI TX|
**** v1    0.1 CLI TX|%XJEIFLH|)Xspa8P
***  v1    0.1 CLI RX  106
**** v1    0.1 CLI RX|Message from VCC-compiler:
**** v1    0.1 CLI RX|Security: Privilege proc_setid missing, will not change uid/gid
**** v1    0.1 CLI RX|Name 'debug' already defined.
**** v1    0.1 CLI RX|('<vcl.inline>' Line 6 Pos 17)
**** v1    0.1 CLI RX|        backend debug {
**** v1    0.1 CLI RX|----------------#####--
**** v1    0.1 CLI RX|
**** v1    0.1 CLI RX|First definition:
**** v1    0.1 CLI RX|('<vcl.inline>' Line 4 Pos 9)
**** v1    0.1 CLI RX|        import debug;
**** v1    0.1 CLI RX|--------######-------
**** v1    0.1 CLI RX|
**** v1    0.1 CLI RX|Running VCC-compiler failed, exited with 2
**** v1    0.1 CLI RX|VCL compilation failed
**   v1    0.1 VCL compilation failed (as expected)
***  v1    0.1 Found expected string: ("Name 'debug' already defined.")
*    top   0.1 RESETTING after ../../../bin/varnishtest/tests/r01569.vtc
**   v1    0.1 Wait
**** v1    0.1 CLI TX|backend.list
***  v1    0.1 CLI RX  101
**** v1    0.1 CLI RX|Unknown request in manager process (child not running).
**** v1    0.1 CLI RX|Type 'help' for more info.
**   v1    0.1 Stop
**** v1    0.1 CLI TX|stop
***  v1    0.1 CLI RX  300
**** v1    0.1 CLI RX|Child in state stopped
**** v1    0.1 CLI TX|status
***  v1    0.1 CLI RX  200
**** v1    0.1 CLI RX|Child in state stopped
**** v1    0.1 STDOUT poll 0x10
**   v1    0.1 R 78182 Status: 0000 (u 0.007000 s 0.023000)
*    diag  0.0 ............................................................
#    top  TEST ../../../bin/varnishtest/tests/r01569.vtc TIMED OUT (kill -9)
#    top  TEST ../../../bin/varnishtest/tests/r01569.vtc FAILED (60.004) signal=9

1 @ SunOS 5.11 i86pc 1.04 32_gcc4.7 uplex

*    top   0.0 TEST ../../../bin/varnishtest/tests/r01569.vtc starting
[...]
*    top   0.0 TEST symbol lookup order issue
[...]
**** v1    0.1 CLI TX|\tsub vcl_recv {
**** v1    0.1 CLI TX|\t\tcall debug;
**** v1    0.1 CLI TX|\t}
**** v1    0.1 CLI TX|
**** v1    0.1 CLI TX|%XJEIFLH|)Xspa8P
***  v1    0.1 CLI RX  106
**** v1    0.1 CLI RX|Message from VCC-compiler:
**** v1    0.1 CLI RX|Security: Privilege proc_setid missing, will not change uid/gid
**** v1    0.1 CLI RX|Name 'debug' already defined.
**** v1    0.1 CLI RX|('<vcl.inline>' Line 6 Pos 17)
**** v1    0.1 CLI RX|        backend debug {
**** v1    0.1 CLI RX|----------------#####--
**** v1    0.1 CLI RX|
**** v1    0.1 CLI RX|First definition:
**** v1    0.1 CLI RX|('<vcl.inline>' Line 4 Pos 9)
**** v1    0.1 CLI RX|        import debug;
**** v1    0.1 CLI RX|--------######-------
**** v1    0.1 CLI RX|
**** v1    0.1 CLI RX|Running VCC-compiler failed, exited with 2
**** v1    0.1 CLI RX|VCL compilation failed
**   v1    0.1 VCL compilation failed (as expected)
***  v1    0.1 Found expected string: ("Name 'debug' already defined.")
*    top   0.1 RESETTING after ../../../bin/varnishtest/tests/r01569.vtc
**   v1    0.1 Wait
**** v1    0.1 CLI TX|backend.list
***  v1    0.1 CLI RX  101
**** v1    0.1 CLI RX|Unknown request in manager process (child not running).
**** v1    0.1 CLI RX|Type 'help' for more info.
**   v1    0.1 Stop
**** v1    0.1 CLI TX|stop
***  v1    0.1 CLI RX  300
**** v1    0.1 CLI RX|Child in state stopped
**** v1    0.1 CLI TX|status
***  v1    0.1 CLI RX  200
**** v1    0.1 CLI RX|Child in state stopped
**** v1    0.1 STDOUT poll 0x10
**   v1    0.1 R 28417 Status: 0000 (u 0.005000 s 0.018000)
*    diag  0.0 ............................................................
#    top  TEST ../../../bin/varnishtest/tests/r01569.vtc TIMED OUT (kill -9)
#    top  TEST ../../../bin/varnishtest/tests/r01569.vtc FAILED (60.002) signal=9

1 @ SunOS 5.11 i86pc 1.04 64_gcc4.7 uplex

*    top   0.0 TEST ../../../bin/varnishtest/tests/r01569.vtc starting
[...]
*    top   0.0 TEST symbol lookup order issue
[...]
**** v1    0.1 CLI TX|\tsub vcl_recv {
**** v1    0.1 CLI TX|\t\tcall debug;
**** v1    0.1 CLI TX|\t}
**** v1    0.1 CLI TX|
**** v1    0.1 CLI TX|%XJEIFLH|)Xspa8P
***  v1    0.1 CLI RX  106
**** v1    0.1 CLI RX|Message from VCC-compiler:
**** v1    0.1 CLI RX|Security: Privilege proc_setid missing, will not change uid/gid
**** v1    0.1 CLI RX|Name 'debug' already defined.
**** v1    0.1 CLI RX|('<vcl.inline>' Line 6 Pos 17)
**** v1    0.1 CLI RX|        backend debug {
**** v1    0.1 CLI RX|----------------#####--
**** v1    0.1 CLI RX|
**** v1    0.1 CLI RX|First definition:
**** v1    0.1 CLI RX|('<vcl.inline>' Line 4 Pos 9)
**** v1    0.1 CLI RX|        import debug;
**** v1    0.1 CLI RX|--------######-------
**** v1    0.1 CLI RX|
**** v1    0.1 CLI RX|Running VCC-compiler failed, exited with 2
**** v1    0.1 CLI RX|VCL compilation failed
**   v1    0.1 VCL compilation failed (as expected)
***  v1    0.1 Found expected string: ("Name 'debug' already defined.")
*    top   0.1 RESETTING after ../../../bin/varnishtest/tests/r01569.vtc
**   v1    0.1 Wait
**** v1    0.1 CLI TX|backend.list
***  v1    0.1 CLI RX  101
**** v1    0.1 CLI RX|Unknown request in manager process (child not running).
**** v1    0.1 CLI RX|Type 'help' for more info.
**   v1    0.1 Stop
**** v1    0.1 CLI TX|stop
***  v1    0.1 CLI RX  300
**** v1    0.1 CLI RX|Child in state stopped
**** v1    0.1 CLI TX|status
***  v1    0.1 CLI RX  200
**** v1    0.1 CLI RX|Child in state stopped
**** v1    0.1 STDOUT poll 0x10
**   v1    0.1 R 37913 Status: 0000 (u 0.006000 s 0.022000)
*    diag  0.0 ............................................................
#    top  TEST ../../../bin/varnishtest/tests/r01569.vtc TIMED OUT (kill -9)
#    top  TEST ../../../bin/varnishtest/tests/r01569.vtc FAILED (60.004) signal=9

1 @ SunOS 5.11 i86pc 1.04 64_sun12.4 uplex

*    top   0.0 TEST ../../../bin/varnishtest/tests/r01569.vtc starting
[...]
*    top   0.0 TEST symbol lookup order issue
[...]
**** v1    0.1 CLI TX|\tsub vcl_recv {
**** v1    0.1 CLI TX|\t\tcall debug;
**** v1    0.1 CLI TX|\t}
**** v1    0.1 CLI TX|
**** v1    0.1 CLI TX|%XJEIFLH|)Xspa8P
***  v1    0.1 CLI RX  106
**** v1    0.1 CLI RX|Message from VCC-compiler:
**** v1    0.1 CLI RX|Security: Privilege proc_setid missing, will not change uid/gid
**** v1    0.1 CLI RX|Name 'debug' already defined.
**** v1    0.1 CLI RX|('<vcl.inline>' Line 6 Pos 17)
**** v1    0.1 CLI RX|        backend debug {
**** v1    0.1 CLI RX|----------------#####--
**** v1    0.1 CLI RX|
**** v1    0.1 CLI RX|First definition:
**** v1    0.1 CLI RX|('<vcl.inline>' Line 4 Pos 9)
**** v1    0.1 CLI RX|        import debug;
**** v1    0.1 CLI RX|--------######-------
**** v1    0.1 CLI RX|
**** v1    0.1 CLI RX|Running VCC-compiler failed, exited with 2
**** v1    0.1 CLI RX|VCL compilation failed
**   v1    0.1 VCL compilation failed (as expected)
***  v1    0.1 Found expected string: ("Name 'debug' already defined.")
*    top   0.1 RESETTING after ../../../bin/varnishtest/tests/r01569.vtc
**   v1    0.1 Wait
**** v1    0.1 CLI TX|backend.list
***  v1    0.1 CLI RX  101
**** v1    0.1 CLI RX|Unknown request in manager process (child not running).
**** v1    0.1 CLI RX|Type 'help' for more info.
**   v1    0.1 Stop
**** v1    0.1 CLI TX|stop
***  v1    0.1 CLI RX  300
**** v1    0.1 CLI RX|Child in state stopped
**** v1    0.1 CLI TX|status
***  v1    0.1 CLI RX  200
**** v1    0.1 CLI RX|Child in state stopped
**** v1    0.1 STDOUT poll 0x10
**   v1    0.1 R 73358 Status: 0000 (u 0.007000 s 0.023000)
*    diag  0.0 ............................................................
#    top  TEST ../../../bin/varnishtest/tests/r01569.vtc TIMED OUT (kill -9)
#    top  TEST ../../../bin/varnishtest/tests/r01569.vtc FAILED (60.004) signal=9

1 @ SunOS 5.11 i86pc 1.04 64_gcc4.7 uplex

*    top   0.0 TEST ../../../bin/varnishtest/tests/r01569.vtc starting
[...]
*    top   0.0 TEST symbol lookup order issue
[...]
**** v1    0.1 CLI TX|\tsub vcl_recv {
**** v1    0.1 CLI TX|\t\tcall debug;
**** v1    0.1 CLI TX|\t}
**** v1    0.1 CLI TX|
**** v1    0.1 CLI TX|%XJEIFLH|)Xspa8P
***  v1    0.1 CLI RX  106
**** v1    0.1 CLI RX|Message from VCC-compiler:
**** v1    0.1 CLI RX|Security: Privilege proc_setid missing, will not change uid/gid
**** v1    0.1 CLI RX|Name 'debug' already defined.
**** v1    0.1 CLI RX|('<vcl.inline>' Line 6 Pos 17)
**** v1    0.1 CLI RX|        backend debug {
**** v1    0.1 CLI RX|----------------#####--
**** v1    0.1 CLI RX|
**** v1    0.1 CLI RX|First definition:
**** v1    0.1 CLI RX|('<vcl.inline>' Line 4 Pos 9)
**** v1    0.1 CLI RX|        import debug;
**** v1    0.1 CLI RX|--------######-------
**** v1    0.1 CLI RX|
**** v1    0.1 CLI RX|Running VCC-compiler failed, exited with 2
**** v1    0.1 CLI RX|VCL compilation failed
**   v1    0.1 VCL compilation failed (as expected)
***  v1    0.1 Found expected string: ("Name 'debug' already defined.")
*    top   0.1 RESETTING after ../../../bin/varnishtest/tests/r01569.vtc
**   v1    0.1 Wait
**** v1    0.1 CLI TX|backend.list
***  v1    0.1 CLI RX  101
**** v1    0.1 CLI RX|Unknown request in manager process (child not running).
**** v1    0.1 CLI RX|Type 'help' for more info.
**   v1    0.1 Stop
**** v1    0.1 CLI TX|stop
***  v1    0.1 CLI RX  300
**** v1    0.1 CLI RX|Child in state stopped
**** v1    0.1 CLI TX|status
***  v1    0.1 CLI RX  200
**** v1    0.1 CLI RX|Child in state stopped
**** v1    0.1 STDOUT poll 0x10
**   v1    0.1 R 75820 Status: 0000 (u 0.008000 s 0.027000)
*    diag  0.0 ............................................................
#    top  TEST ../../../bin/varnishtest/tests/r01569.vtc TIMED OUT (kill -9)
#    top  TEST ../../../bin/varnishtest/tests/r01569.vtc FAILED (60.004) signal=9

1 @ SunOS 5.11 i86pc 1.04 64_sun12.4 uplex

*    top   0.0 TEST ../../../bin/varnishtest/tests/r01569.vtc starting
[...]
*    top   0.0 TEST symbol lookup order issue
[...]
**** v1    0.1 CLI TX|\tsub vcl_recv {
**** v1    0.1 CLI TX|\t\tcall debug;
**** v1    0.1 CLI TX|\t}
**** v1    0.1 CLI TX|
**** v1    0.1 CLI TX|%XJEIFLH|)Xspa8P
***  v1    0.1 CLI RX  106
**** v1    0.1 CLI RX|Message from VCC-compiler:
**** v1    0.1 CLI RX|Security: Privilege proc_setid missing, will not change uid/gid
**** v1    0.1 CLI RX|Name 'debug' already defined.
**** v1    0.1 CLI RX|('<vcl.inline>' Line 6 Pos 17)
**** v1    0.1 CLI RX|        backend debug {
**** v1    0.1 CLI RX|----------------#####--
**** v1    0.1 CLI RX|
**** v1    0.1 CLI RX|First definition:
**** v1    0.1 CLI RX|('<vcl.inline>' Line 4 Pos 9)
**** v1    0.1 CLI RX|        import debug;
**** v1    0.1 CLI RX|--------######-------
**** v1    0.1 CLI RX|
**** v1    0.1 CLI RX|Running VCC-compiler failed, exited with 2
**** v1    0.1 CLI RX|VCL compilation failed
**   v1    0.1 VCL compilation failed (as expected)
***  v1    0.1 Found expected string: ("Name 'debug' already defined.")
*    top   0.1 RESETTING after ../../../bin/varnishtest/tests/r01569.vtc
**   v1    0.1 Wait
**** v1    0.1 CLI TX|backend.list
***  v1    0.1 CLI RX  101
**** v1    0.1 CLI RX|Unknown request in manager process (child not running).
**** v1    0.1 CLI RX|Type 'help' for more info.
**   v1    0.1 Stop
**** v1    0.1 CLI TX|stop
***  v1    0.1 CLI RX  300
**** v1    0.1 CLI RX|Child in state stopped
**** v1    0.1 CLI TX|status
***  v1    0.1 CLI RX  200
**** v1    0.1 CLI RX|Child in state stopped
**** v1    0.1 STDOUT poll 0x10
**   v1    0.1 R 77418 Status: 0000 (u 0.007000 s 0.026000)
*    diag  0.0 ............................................................
#    top  TEST ../../../bin/varnishtest/tests/r01569.vtc TIMED OUT (kill -9)
#    top  TEST ../../../bin/varnishtest/tests/r01569.vtc FAILED (60.004) signal=9

1 @ SunOS 5.11 i86pc 1.04 32_gcc4.7 uplex

*    top   0.0 TEST ../../../bin/varnishtest/tests/r01569.vtc starting
[...]
*    top   0.0 TEST symbol lookup order issue
[...]
**** v1    0.1 CLI TX|\tsub vcl_recv {
**** v1    0.1 CLI TX|\t\tcall debug;
**** v1    0.1 CLI TX|\t}
**** v1    0.1 CLI TX|
**** v1    0.1 CLI TX|%XJEIFLH|)Xspa8P
***  v1    0.1 CLI RX  106
**** v1    0.1 CLI RX|Message from VCC-compiler:
**** v1    0.1 CLI RX|Security: Privilege proc_setid missing, will not change uid/gid
**** v1    0.1 CLI RX|Name 'debug' already defined.
**** v1    0.1 CLI RX|('<vcl.inline>' Line 6 Pos 17)
**** v1    0.1 CLI RX|        backend debug {
**** v1    0.1 CLI RX|----------------#####--
**** v1    0.1 CLI RX|
**** v1    0.1 CLI RX|First definition:
**** v1    0.1 CLI RX|('<vcl.inline>' Line 4 Pos 9)
**** v1    0.1 CLI RX|        import debug;
**** v1    0.1 CLI RX|--------######-------
**** v1    0.1 CLI RX|
**** v1    0.1 CLI RX|Running VCC-compiler failed, exited with 2
**** v1    0.1 CLI RX|VCL compilation failed
**   v1    0.1 VCL compilation failed (as expected)
***  v1    0.1 Found expected string: ("Name 'debug' already defined.")
*    top   0.1 RESETTING after ../../../bin/varnishtest/tests/r01569.vtc
**   v1    0.1 Wait
**** v1    0.1 CLI TX|backend.list
***  v1    0.1 CLI RX  101
**** v1    0.1 CLI RX|Unknown request in manager process (child not running).
**** v1    0.1 CLI RX|Type 'help' for more info.
**   v1    0.1 Stop
**** v1    0.1 CLI TX|stop
***  v1    0.1 CLI RX  300
**** v1    0.1 CLI RX|Child in state stopped
**** v1    0.1 CLI TX|status
***  v1    0.1 CLI RX  200
**** v1    0.1 CLI RX|Child in state stopped
**** v1    0.1 STDOUT poll 0x10
**   v1    0.1 R 5913 Status: 0000 (u 0.004000 s 0.018000)
*    diag  0.0 ............................................................
#    top  TEST ../../../bin/varnishtest/tests/r01569.vtc TIMED OUT (kill -9)
#    top  TEST ../../../bin/varnishtest/tests/r01569.vtc FAILED (60.002) signal=9

1 @ SunOS 5.11 i86pc 1.04 64_sun12.4 uplex

*    top   0.0 TEST ../../../bin/varnishtest/tests/r01569.vtc starting
[...]
*    top   0.0 TEST symbol lookup order issue
[...]
**** v1    0.2 CLI TX|\tsub vcl_recv {
**** v1    0.2 CLI TX|\t\tcall debug;
**** v1    0.2 CLI TX|\t}
**** v1    0.2 CLI TX|
**** v1    0.2 CLI TX|%XJEIFLH|)Xspa8P
***  v1    0.2 CLI RX  106
**** v1    0.2 CLI RX|Message from VCC-compiler:
**** v1    0.2 CLI RX|Security: Privilege proc_setid missing, will not change uid/gid
**** v1    0.2 CLI RX|Name 'debug' already defined.
**** v1    0.2 CLI RX|('<vcl.inline>' Line 6 Pos 17)
**** v1    0.2 CLI RX|        backend debug {
**** v1    0.2 CLI RX|----------------#####--
**** v1    0.2 CLI RX|
**** v1    0.2 CLI RX|First definition:
**** v1    0.2 CLI RX|('<vcl.inline>' Line 4 Pos 9)
**** v1    0.2 CLI RX|        import debug;
**** v1    0.2 CLI RX|--------######-------
**** v1    0.2 CLI RX|
**** v1    0.2 CLI RX|Running VCC-compiler failed, exited with 2
**** v1    0.2 CLI RX|VCL compilation failed
**   v1    0.2 VCL compilation failed (as expected)
***  v1    0.2 Found expected string: ("Name 'debug' already defined.")
*    top   0.2 RESETTING after ../../../bin/varnishtest/tests/r01569.vtc
**   v1    0.2 Wait
**** v1    0.2 CLI TX|backend.list
***  v1    0.2 CLI RX  101
**** v1    0.2 CLI RX|Unknown request in manager process (child not running).
**** v1    0.2 CLI RX|Type 'help' for more info.
**   v1    0.2 Stop
**** v1    0.2 CLI TX|stop
***  v1    0.2 CLI RX  300
**** v1    0.2 CLI RX|Child in state stopped
**** v1    0.2 CLI TX|status
***  v1    0.2 CLI RX  200
**** v1    0.2 CLI RX|Child in state stopped
**** v1    0.2 STDOUT poll 0x10
**   v1    0.2 R 4042 Status: 0000 (u 0.011000 s 0.035000)
*    diag  0.0 ............................................................
#    top  TEST ../../../bin/varnishtest/tests/r01569.vtc TIMED OUT (kill -9)
#    top  TEST ../../../bin/varnishtest/tests/r01569.vtc FAILED (60.007) signal=9

1 @ SunOS 5.11 i86pc 1.04 32_gcc4.7 uplex

*    top   0.0 TEST ../../../bin/varnishtest/tests/r01569.vtc starting
[...]
*    top   0.0 TEST symbol lookup order issue
[...]
**** v1    0.1 CLI TX|\tsub vcl_recv {
**** v1    0.1 CLI TX|\t\tcall debug;
**** v1    0.1 CLI TX|\t}
**** v1    0.1 CLI TX|
**** v1    0.1 CLI TX|%XJEIFLH|)Xspa8P
***  v1    0.1 CLI RX  106
**** v1    0.1 CLI RX|Message from VCC-compiler:
**** v1    0.1 CLI RX|Security: Privilege proc_setid missing, will not change uid/gid
**** v1    0.1 CLI RX|Name 'debug' already defined.
**** v1    0.1 CLI RX|('<vcl.inline>' Line 6 Pos 17)
**** v1    0.1 CLI RX|        backend debug {
**** v1    0.1 CLI RX|----------------#####--
**** v1    0.1 CLI RX|
**** v1    0.1 CLI RX|First definition:
**** v1    0.1 CLI RX|('<vcl.inline>' Line 4 Pos 9)
**** v1    0.1 CLI RX|        import debug;
**** v1    0.1 CLI RX|--------######-------
**** v1    0.1 CLI RX|
**** v1    0.1 CLI RX|Running VCC-compiler failed, exited with 2
**** v1    0.1 CLI RX|VCL compilation failed
**   v1    0.1 VCL compilation failed (as expected)
***  v1    0.1 Found expected string: ("Name 'debug' already defined.")
*    top   0.1 RESETTING after ../../../bin/varnishtest/tests/r01569.vtc
**   v1    0.1 Wait
**** v1    0.1 CLI TX|backend.list
***  v1    0.1 CLI RX  101
**** v1    0.1 CLI RX|Unknown request in manager process (child not running).
**** v1    0.1 CLI RX|Type 'help' for more info.
**   v1    0.1 Stop
**** v1    0.1 CLI TX|stop
***  v1    0.1 CLI RX  300
**** v1    0.1 CLI RX|Child in state stopped
**** v1    0.1 CLI TX|status
***  v1    0.1 CLI RX  200
**** v1    0.1 CLI RX|Child in state stopped
**** v1    0.1 STDOUT poll 0x10
**   v1    0.1 R 8481 Status: 0000 (u 0.005000 s 0.017000)
*    diag  0.0 ............................................................
#    top  TEST ../../../bin/varnishtest/tests/r01569.vtc TIMED OUT (kill -9)
#    top  TEST ../../../bin/varnishtest/tests/r01569.vtc FAILED (60.002) signal=9

1 @ SunOS 5.11 i86pc 1.04 32_gcc4.7 uplex

*    top   0.0 TEST ../../../bin/varnishtest/tests/r01569.vtc starting
[...]
*    top   0.0 TEST symbol lookup order issue
[...]
**** v1    0.1 CLI TX|\tsub vcl_recv {
**** v1    0.1 CLI TX|\t\tcall debug;
**** v1    0.1 CLI TX|\t}
**** v1    0.1 CLI TX|
**** v1    0.1 CLI TX|%XJEIFLH|)Xspa8P
***  v1    0.1 CLI RX  106
**** v1    0.1 CLI RX|Message from VCC-compiler:
**** v1    0.1 CLI RX|Security: Privilege proc_setid missing, will not change uid/gid
**** v1    0.1 CLI RX|Name 'debug' already defined.
**** v1    0.1 CLI RX|('<vcl.inline>' Line 6 Pos 17)
**** v1    0.1 CLI RX|        backend debug {
**** v1    0.1 CLI RX|----------------#####--
**** v1    0.1 CLI RX|
**** v1    0.1 CLI RX|First definition:
**** v1    0.1 CLI RX|('<vcl.inline>' Line 4 Pos 9)
**** v1    0.1 CLI RX|        import debug;
**** v1    0.1 CLI RX|--------######-------
**** v1    0.1 CLI RX|
**** v1    0.1 CLI RX|Running VCC-compiler failed, exited with 2
**** v1    0.1 CLI RX|VCL compilation failed
**   v1    0.1 VCL compilation failed (as expected)
***  v1    0.1 Found expected string: ("Name 'debug' already defined.")
*    top   0.1 RESETTING after ../../../bin/varnishtest/tests/r01569.vtc
**   v1    0.1 Wait
**** v1    0.1 CLI TX|backend.list
***  v1    0.1 CLI RX  101
**** v1    0.1 CLI RX|Unknown request in manager process (child not running).
**** v1    0.1 CLI RX|Type 'help' for more info.
**   v1    0.1 Stop
**** v1    0.1 CLI TX|stop
***  v1    0.1 CLI RX  300
**** v1    0.1 CLI RX|Child in state stopped
**** v1    0.1 CLI TX|status
***  v1    0.1 CLI RX  200
**** v1    0.1 CLI RX|Child in state stopped
**** v1    0.1 STDOUT poll 0x10
**   v1    0.1 R 3980 Status: 0000 (u 0.005000 s 0.019000)
*    diag  0.0 ............................................................
#    top  TEST ../../../bin/varnishtest/tests/r01569.vtc TIMED OUT (kill -9)
#    top  TEST ../../../bin/varnishtest/tests/r01569.vtc FAILED (60.002) signal=9

1 @ Ubuntu LTS i686 1.04 fgs

*    top   0.0 TEST ../../../bin/varnishtest/tests/r01569.vtc starting
[...]
*    top   0.0 TEST symbol lookup order issue
[...]
**** v1    0.1 CLI TX|
**** v1    0.1 CLI TX|\tsub vcl_recv {
**** v1    0.1 CLI TX|\t\tcall debug;
**** v1    0.1 CLI TX|\t}
**** v1    0.1 CLI TX|
**** v1    0.1 CLI TX|%XJEIFLH|)Xspa8P
***  v1    0.1 CLI RX  106
**** v1    0.1 CLI RX|Message from VCC-compiler:
**** v1    0.1 CLI RX|Name 'debug' already defined.
**** v1    0.1 CLI RX|('<vcl.inline>' Line 6 Pos 17)
**** v1    0.1 CLI RX|        backend debug {
**** v1    0.1 CLI RX|----------------#####--
**** v1    0.1 CLI RX|
**** v1    0.1 CLI RX|First definition:
**** v1    0.1 CLI RX|('<vcl.inline>' Line 4 Pos 9)
**** v1    0.1 CLI RX|        import debug;
**** v1    0.1 CLI RX|--------######-------
**** v1    0.1 CLI RX|
**** v1    0.1 CLI RX|Running VCC-compiler failed, exited with 2
**** v1    0.1 CLI RX|VCL compilation failed
**   v1    0.1 VCL compilation failed (as expected)
***  v1    0.1 Found expected string: ("Name 'debug' already defined.")
*    top   0.1 RESETTING after ../../../bin/varnishtest/tests/r01569.vtc
**   v1    0.1 Wait
**** v1    0.1 CLI TX|backend.list
***  v1    0.2 CLI RX  101
**** v1    0.2 CLI RX|Unknown request in manager process (child not running).
**** v1    0.2 CLI RX|Type 'help' for more info.
**   v1    0.2 Stop
**** v1    0.2 CLI TX|stop
***  v1    0.2 CLI RX  300
**** v1    0.2 CLI RX|Child in state stopped
**** v1    0.2 CLI TX|status
***  v1    0.2 CLI RX  200
**** v1    0.2 CLI RX|Child in state stopped
**** v1    0.2 STDOUT poll 0x10
**   v1    0.2 R 601 Status: 0000 (u 0.004000 s 0.000000)
*    diag  0.0 ............................................................
#    top  TEST ../../../bin/varnishtest/tests/r01569.vtc TIMED OUT (kill -9)
#    top  TEST ../../../bin/varnishtest/tests/r01569.vtc FAILED (60.001) signal=9

1 @ SunOS 5.11 i86pc 1.04 64_gcc4.7 uplex

*    top   0.0 TEST ../../../bin/varnishtest/tests/r01569.vtc starting
[...]
*    top   0.0 TEST symbol lookup order issue
[...]
**** v1    0.1 CLI TX|\tsub vcl_recv {
**** v1    0.1 CLI TX|\t\tcall debug;
**** v1    0.1 CLI TX|\t}
**** v1    0.1 CLI TX|
**** v1    0.1 CLI TX|%XJEIFLH|)Xspa8P
***  v1    0.1 CLI RX  106
**** v1    0.1 CLI RX|Message from VCC-compiler:
**** v1    0.1 CLI RX|Security: Privilege proc_setid missing, will not change uid/gid
**** v1    0.1 CLI RX|Name 'debug' already defined.
**** v1    0.1 CLI RX|('<vcl.inline>' Line 6 Pos 17)
**** v1    0.1 CLI RX|        backend debug {
**** v1    0.1 CLI RX|----------------#####--
**** v1    0.1 CLI RX|
**** v1    0.1 CLI RX|First definition:
**** v1    0.1 CLI RX|('<vcl.inline>' Line 4 Pos 9)
**** v1    0.1 CLI RX|        import debug;
**** v1    0.1 CLI RX|--------######-------
**** v1    0.1 CLI RX|
**** v1    0.1 CLI RX|Running VCC-compiler failed, exited with 2
**** v1    0.1 CLI RX|VCL compilation failed
**   v1    0.1 VCL compilation failed (as expected)
***  v1    0.1 Found expected string: ("Name 'debug' already defined.")
*    top   0.1 RESETTING after ../../../bin/varnishtest/tests/r01569.vtc
**   v1    0.1 Wait
**** v1    0.1 CLI TX|backend.list
***  v1    0.1 CLI RX  101
**** v1    0.1 CLI RX|Unknown request in manager process (child not running).
**** v1    0.1 CLI RX|Type 'help' for more info.
**   v1    0.1 Stop
**** v1    0.1 CLI TX|stop
***  v1    0.1 CLI RX  300
**** v1    0.1 CLI RX|Child in state stopped
**** v1    0.1 CLI TX|status
***  v1    0.1 CLI RX  200
**** v1    0.1 CLI RX|Child in state stopped
**** v1    0.1 STDOUT poll 0x10
**   v1    0.1 R 17416 Status: 0000 (u 0.007000 s 0.023000)
*    diag  0.0 ............................................................
#    top  TEST ../../../bin/varnishtest/tests/r01569.vtc TIMED OUT (kill -9)
#    top  TEST ../../../bin/varnishtest/tests/r01569.vtc FAILED (60.004) signal=9

1 @ SunOS 5.11 i86pc 1.04 64_sun12.4 uplex

*    top   0.0 TEST ../../../bin/varnishtest/tests/r01569.vtc starting
[...]
*    top   0.0 TEST symbol lookup order issue
[...]
**** v1    0.1 CLI TX|\tsub vcl_recv {
**** v1    0.1 CLI TX|\t\tcall debug;
**** v1    0.1 CLI TX|\t}
**** v1    0.1 CLI TX|
**** v1    0.1 CLI TX|%XJEIFLH|)Xspa8P
***  v1    0.1 CLI RX  106
**** v1    0.1 CLI RX|Message from VCC-compiler:
**** v1    0.1 CLI RX|Security: Privilege proc_setid missing, will not change uid/gid
**** v1    0.1 CLI RX|Name 'debug' already defined.
**** v1    0.1 CLI RX|('<vcl.inline>' Line 6 Pos 17)
**** v1    0.1 CLI RX|        backend debug {
**** v1    0.1 CLI RX|----------------#####--
**** v1    0.1 CLI RX|
**** v1    0.1 CLI RX|First definition:
**** v1    0.1 CLI RX|('<vcl.inline>' Line 4 Pos 9)
**** v1    0.1 CLI RX|        import debug;
**** v1    0.1 CLI RX|--------######-------
**** v1    0.1 CLI RX|
**** v1    0.1 CLI RX|Running VCC-compiler failed, exited with 2
**** v1    0.1 CLI RX|VCL compilation failed
**   v1    0.1 VCL compilation failed (as expected)
***  v1    0.1 Found expected string: ("Name 'debug' already defined.")
*    top   0.1 RESETTING after ../../../bin/varnishtest/tests/r01569.vtc
**   v1    0.1 Wait
**** v1    0.1 CLI TX|backend.list
***  v1    0.1 CLI RX  101
**** v1    0.1 CLI RX|Unknown request in manager process (child not running).
**** v1    0.1 CLI RX|Type 'help' for more info.
**   v1    0.1 Stop
**** v1    0.1 CLI TX|stop
***  v1    0.1 CLI RX  300
**** v1    0.1 CLI RX|Child in state stopped
**** v1    0.1 CLI TX|status
***  v1    0.1 CLI RX  200
**** v1    0.1 CLI RX|Child in state stopped
**** v1    0.1 STDOUT poll 0x10
**   v1    0.1 R 72935 Status: 0000 (u 0.007000 s 0.024000)
*    diag  0.0 ............................................................
#    top  TEST ../../../bin/varnishtest/tests/r01569.vtc TIMED OUT (kill -9)
#    top  TEST ../../../bin/varnishtest/tests/r01569.vtc FAILED (60.004) signal=9

1 @ SunOS 5.11 i86pc 1.04 32_sun12.4 uplex

*    top   0.0 TEST ../../../bin/varnishtest/tests/r01569.vtc starting
[...]
*    top   0.0 TEST symbol lookup order issue
[...]
**** v1    0.1 CLI TX|\tsub vcl_recv {
**** v1    0.1 CLI TX|\t\tcall debug;
**** v1    0.1 CLI TX|\t}
**** v1    0.1 CLI TX|
**** v1    0.1 CLI TX|%XJEIFLH|)Xspa8P
***  v1    0.2 CLI RX  106
**** v1    0.2 CLI RX|Message from VCC-compiler:
**** v1    0.2 CLI RX|Security: Privilege proc_setid missing, will not change uid/gid
**** v1    0.2 CLI RX|Name 'debug' already defined.
**** v1    0.2 CLI RX|('<vcl.inline>' Line 6 Pos 17)
**** v1    0.2 CLI RX|        backend debug {
**** v1    0.2 CLI RX|----------------#####--
**** v1    0.2 CLI RX|
**** v1    0.2 CLI RX|First definition:
**** v1    0.2 CLI RX|('<vcl.inline>' Line 4 Pos 9)
**** v1    0.2 CLI RX|        import debug;
**** v1    0.2 CLI RX|--------######-------
**** v1    0.2 CLI RX|
**** v1    0.2 CLI RX|Running VCC-compiler failed, exited with 2
**** v1    0.2 CLI RX|VCL compilation failed
**   v1    0.2 VCL compilation failed (as expected)
***  v1    0.2 Found expected string: ("Name 'debug' already defined.")
*    top   0.2 RESETTING after ../../../bin/varnishtest/tests/r01569.vtc
**   v1    0.2 Wait
**** v1    0.2 CLI TX|backend.list
***  v1    0.2 CLI RX  101
**** v1    0.2 CLI RX|Unknown request in manager process (child not running).
**** v1    0.2 CLI RX|Type 'help' for more info.
**   v1    0.2 Stop
**** v1    0.2 CLI TX|stop
***  v1    0.2 CLI RX  300
**** v1    0.2 CLI RX|Child in state stopped
**** v1    0.2 CLI TX|status
***  v1    0.2 CLI RX  200
**** v1    0.2 CLI RX|Child in state stopped
**** v1    0.2 STDOUT poll 0x10
**   v1    0.2 R 24865 Status: 0000 (u 0.008000 s 0.029000)
*    diag  0.0 ............................................................
#    top  TEST ../../../bin/varnishtest/tests/r01569.vtc TIMED OUT (kill -9)
#    top  TEST ../../../bin/varnishtest/tests/r01569.vtc FAILED (60.002) signal=9

1 @ SunOS 5.11 i86pc 1.04 64_gcc4.7 uplex

*    top   0.0 TEST ../../../bin/varnishtest/tests/r01569.vtc starting
[...]
*    top   0.0 TEST symbol lookup order issue
[...]
**** v1    0.1 CLI TX|\tsub vcl_recv {
**** v1    0.1 CLI TX|\t\tcall debug;
**** v1    0.1 CLI TX|\t}
**** v1    0.1 CLI TX|
**** v1    0.1 CLI TX|%XJEIFLH|)Xspa8P
***  v1    0.1 CLI RX  106
**** v1    0.1 CLI RX|Message from VCC-compiler:
**** v1    0.1 CLI RX|Security: Privilege proc_setid missing, will not change uid/gid
**** v1    0.1 CLI RX|Name 'debug' already defined.
**** v1    0.1 CLI RX|('<vcl.inline>' Line 6 Pos 17)
**** v1    0.1 CLI RX|        backend debug {
**** v1    0.1 CLI RX|----------------#####--
**** v1    0.1 CLI RX|
**** v1    0.1 CLI RX|First definition:
**** v1    0.1 CLI RX|('<vcl.inline>' Line 4 Pos 9)
**** v1    0.1 CLI RX|        import debug;
**** v1    0.1 CLI RX|--------######-------
**** v1    0.1 CLI RX|
**** v1    0.1 CLI RX|Running VCC-compiler failed, exited with 2
**** v1    0.1 CLI RX|VCL compilation failed
**   v1    0.1 VCL compilation failed (as expected)
***  v1    0.1 Found expected string: ("Name 'debug' already defined.")
*    top   0.1 RESETTING after ../../../bin/varnishtest/tests/r01569.vtc
**   v1    0.1 Wait
**** v1    0.1 CLI TX|backend.list
***  v1    0.1 CLI RX  101
**** v1    0.1 CLI RX|Unknown request in manager process (child not running).
**** v1    0.1 CLI RX|Type 'help' for more info.
**   v1    0.1 Stop
**** v1    0.1 CLI TX|stop
***  v1    0.1 CLI RX  300
**** v1    0.1 CLI RX|Child in state stopped
**** v1    0.1 CLI TX|status
***  v1    0.1 CLI RX  200
**** v1    0.1 CLI RX|Child in state stopped
**** v1    0.1 STDOUT poll 0x10
**   v1    0.1 R 87639 Status: 0000 (u 0.007000 s 0.022000)
*    diag  0.0 ............................................................
#    top  TEST ../../../bin/varnishtest/tests/r01569.vtc TIMED OUT (kill -9)
#    top  TEST ../../../bin/varnishtest/tests/r01569.vtc FAILED (60.004) signal=9

1 @ SunOS 5.11 i86pc 1.04 32_gcc4.7 uplex

*    top   0.0 TEST ../../../bin/varnishtest/tests/r01569.vtc starting
[...]
*    top   0.0 TEST symbol lookup order issue
[...]
**** v1    0.1 CLI TX|\tsub vcl_recv {
**** v1    0.1 CLI TX|\t\tcall debug;
**** v1    0.1 CLI TX|\t}
**** v1    0.1 CLI TX|
**** v1    0.1 CLI TX|%XJEIFLH|)Xspa8P
***  v1    0.1 CLI RX  106
**** v1    0.1 CLI RX|Message from VCC-compiler:
**** v1    0.1 CLI RX|Security: Privilege proc_setid missing, will not change uid/gid
**** v1    0.1 CLI RX|Name 'debug' already defined.
**** v1    0.1 CLI RX|('<vcl.inline>' Line 6 Pos 17)
**** v1    0.1 CLI RX|        backend debug {
**** v1    0.1 CLI RX|----------------#####--
**** v1    0.1 CLI RX|
**** v1    0.1 CLI RX|First definition:
**** v1    0.1 CLI RX|('<vcl.inline>' Line 4 Pos 9)
**** v1    0.1 CLI RX|        import debug;
**** v1    0.1 CLI RX|--------######-------
**** v1    0.1 CLI RX|
**** v1    0.1 CLI RX|Running VCC-compiler failed, exited with 2
**** v1    0.1 CLI RX|VCL compilation failed
**   v1    0.1 VCL compilation failed (as expected)
***  v1    0.1 Found expected string: ("Name 'debug' already defined.")
*    top   0.1 RESETTING after ../../../bin/varnishtest/tests/r01569.vtc
**   v1    0.1 Wait
**** v1    0.1 CLI TX|backend.list
***  v1    0.1 CLI RX  101
**** v1    0.1 CLI RX|Unknown request in manager process (child not running).
**** v1    0.1 CLI RX|Type 'help' for more info.
**   v1    0.1 Stop
**** v1    0.1 CLI TX|stop
***  v1    0.1 CLI RX  300
**** v1    0.1 CLI RX|Child in state stopped
**** v1    0.1 CLI TX|status
***  v1    0.1 CLI RX  200
**** v1    0.1 CLI RX|Child in state stopped
**** v1    0.1 STDOUT poll 0x10
**   v1    0.1 R 38709 Status: 0000 (u 0.004000 s 0.019000)
*    diag  0.0 ............................................................
#    top  TEST ../../../bin/varnishtest/tests/r01569.vtc TIMED OUT (kill -9)
#    top  TEST ../../../bin/varnishtest/tests/r01569.vtc FAILED (60.002) signal=9

1 @ Ubuntu LTS i686 1.04 fgs

*    top   0.0 TEST ../../../bin/varnishtest/tests/r01569.vtc starting
[...]
*    top   0.0 TEST symbol lookup order issue
[...]
**** v1    0.1 CLI TX|
**** v1    0.1 CLI TX|\tsub vcl_recv {
**** v1    0.1 CLI TX|\t\tcall debug;
**** v1    0.1 CLI TX|\t}
**** v1    0.1 CLI TX|
**** v1    0.1 CLI TX|%XJEIFLH|)Xspa8P
***  v1    0.1 CLI RX  106
**** v1    0.1 CLI RX|Message from VCC-compiler:
**** v1    0.1 CLI RX|Name 'debug' already defined.
**** v1    0.1 CLI RX|('<vcl.inline>' Line 6 Pos 17)
**** v1    0.1 CLI RX|        backend debug {
**** v1    0.1 CLI RX|----------------#####--
**** v1    0.1 CLI RX|
**** v1    0.1 CLI RX|First definition:
**** v1    0.1 CLI RX|('<vcl.inline>' Line 4 Pos 9)
**** v1    0.1 CLI RX|        import debug;
**** v1    0.1 CLI RX|--------######-------
**** v1    0.1 CLI RX|
**** v1    0.1 CLI RX|Running VCC-compiler failed, exited with 2
**** v1    0.1 CLI RX|VCL compilation failed
**   v1    0.1 VCL compilation failed (as expected)
***  v1    0.1 Found expected string: ("Name 'debug' already defined.")
*    top   0.1 RESETTING after ../../../bin/varnishtest/tests/r01569.vtc
**   v1    0.1 Wait
**** v1    0.1 CLI TX|backend.list
***  v1    0.1 CLI RX  101
**** v1    0.1 CLI RX|Unknown request in manager process (child not running).
**** v1    0.1 CLI RX|Type 'help' for more info.
**   v1    0.1 Stop
**** v1    0.1 CLI TX|stop
***  v1    0.2 CLI RX  300
**** v1    0.2 CLI RX|Child in state stopped
**** v1    0.2 CLI TX|status
***  v1    0.2 CLI RX  200
**** v1    0.2 CLI RX|Child in state stopped
**** v1    0.2 STDOUT poll 0x10
**   v1    0.2 R 26983 Status: 0000 (u 0.000000 s 0.004000)
*    diag  0.0 ............................................................
#    top  TEST ../../../bin/varnishtest/tests/r01569.vtc TIMED OUT (kill -9)
#    top  TEST ../../../bin/varnishtest/tests/r01569.vtc FAILED (60.000) signal=9

1 @ SunOS 5.11 i86pc 1.04 64_sun12.4 uplex

*    top   0.0 TEST ../../../bin/varnishtest/tests/r01569.vtc starting
[...]
*    top   0.0 TEST symbol lookup order issue
[...]
**** v1    0.1 CLI TX|\tsub vcl_recv {
**** v1    0.1 CLI TX|\t\tcall debug;
**** v1    0.1 CLI TX|\t}
**** v1    0.1 CLI TX|
**** v1    0.1 CLI TX|%XJEIFLH|)Xspa8P
***  v1    0.1 CLI RX  106
**** v1    0.1 CLI RX|Message from VCC-compiler:
**** v1    0.1 CLI RX|Security: Privilege proc_setid missing, will not change uid/gid
**** v1    0.1 CLI RX|Name 'debug' already defined.
**** v1    0.1 CLI RX|('<vcl.inline>' Line 6 Pos 17)
**** v1    0.1 CLI RX|        backend debug {
**** v1    0.1 CLI RX|----------------#####--
**** v1    0.1 CLI RX|
**** v1    0.1 CLI RX|First definition:
**** v1    0.1 CLI RX|('<vcl.inline>' Line 4 Pos 9)
**** v1    0.1 CLI RX|        import debug;
**** v1    0.1 CLI RX|--------######-------
**** v1    0.1 CLI RX|
**** v1    0.1 CLI RX|Running VCC-compiler failed, exited with 2
**** v1    0.1 CLI RX|VCL compilation failed
**   v1    0.1 VCL compilation failed (as expected)
***  v1    0.1 Found expected string: ("Name 'debug' already defined.")
*    top   0.1 RESETTING after ../../../bin/varnishtest/tests/r01569.vtc
**   v1    0.1 Wait
**** v1    0.1 CLI TX|backend.list
***  v1    0.1 CLI RX  101
**** v1    0.1 CLI RX|Unknown request in manager process (child not running).
**** v1    0.1 CLI RX|Type 'help' for more info.
**   v1    0.1 Stop
**** v1    0.1 CLI TX|stop
***  v1    0.1 CLI RX  300
**** v1    0.1 CLI RX|Child in state stopped
**** v1    0.1 CLI TX|status
***  v1    0.1 CLI RX  200
**** v1    0.1 CLI RX|Child in state stopped
**** v1    0.1 STDOUT poll 0x10
**   v1    0.1 R 1287 Status: 0000 (u 0.007000 s 0.022000)
*    diag  0.0 ............................................................
#    top  TEST ../../../bin/varnishtest/tests/r01569.vtc TIMED OUT (kill -9)
#    top  TEST ../../../bin/varnishtest/tests/r01569.vtc FAILED (60.004) signal=9

1 @ SunOS 5.11 i86pc 1.04 64_gcc4.7 uplex

*    top   0.0 TEST ../../../bin/varnishtest/tests/r01569.vtc starting
[...]
*    top   0.0 TEST symbol lookup order issue
[...]
**** v1    0.1 CLI TX|\tsub vcl_recv {
**** v1    0.1 CLI TX|\t\tcall debug;
**** v1    0.1 CLI TX|\t}
**** v1    0.1 CLI TX|
**** v1    0.1 CLI TX|%XJEIFLH|)Xspa8P
***  v1    0.1 CLI RX  106
**** v1    0.1 CLI RX|Message from VCC-compiler:
**** v1    0.1 CLI RX|Security: Privilege proc_setid missing, will not change uid/gid
**** v1    0.1 CLI RX|Name 'debug' already defined.
**** v1    0.1 CLI RX|('<vcl.inline>' Line 6 Pos 17)
**** v1    0.1 CLI RX|        backend debug {
**** v1    0.1 CLI RX|----------------#####--
**** v1    0.1 CLI RX|
**** v1    0.1 CLI RX|First definition:
**** v1    0.1 CLI RX|('<vcl.inline>' Line 4 Pos 9)
**** v1    0.1 CLI RX|        import debug;
**** v1    0.1 CLI RX|--------######-------
**** v1    0.1 CLI RX|
**** v1    0.1 CLI RX|Running VCC-compiler failed, exited with 2
**** v1    0.1 CLI RX|VCL compilation failed
**   v1    0.1 VCL compilation failed (as expected)
***  v1    0.1 Found expected string: ("Name 'debug' already defined.")
*    top   0.1 RESETTING after ../../../bin/varnishtest/tests/r01569.vtc
**   v1    0.1 Wait
**** v1    0.1 CLI TX|backend.list
***  v1    0.1 CLI RX  101
**** v1    0.1 CLI RX|Unknown request in manager process (child not running).
**** v1    0.1 CLI RX|Type 'help' for more info.
**   v1    0.1 Stop
**** v1    0.1 CLI TX|stop
***  v1    0.1 CLI RX  300
**** v1    0.1 CLI RX|Child in state stopped
**** v1    0.1 CLI TX|status
***  v1    0.1 CLI RX  200
**** v1    0.1 CLI RX|Child in state stopped
**** v1    0.1 STDOUT poll 0x10
**   v1    0.1 R 3292 Status: 0000 (u 0.007000 s 0.022000)
*    diag  0.0 ............................................................
#    top  TEST ../../../bin/varnishtest/tests/r01569.vtc TIMED OUT (kill -9)
#    top  TEST ../../../bin/varnishtest/tests/r01569.vtc FAILED (60.003) signal=9

1 @ SunOS 5.11 i86pc 1.04 64_gcc4.7 uplex

*    top   0.0 TEST ../../../bin/varnishtest/tests/r01569.vtc starting
[...]
*    top   0.0 TEST symbol lookup order issue
[...]
**** v1    0.1 CLI TX|\tsub vcl_recv {
**** v1    0.1 CLI TX|\t\tcall debug;
**** v1    0.1 CLI TX|\t}
**** v1    0.1 CLI TX|
**** v1    0.1 CLI TX|%XJEIFLH|)Xspa8P
***  v1    0.1 CLI RX  106
**** v1    0.1 CLI RX|Message from VCC-compiler:
**** v1    0.1 CLI RX|Security: Privilege proc_setid missing, will not change uid/gid
**** v1    0.1 CLI RX|Name 'debug' already defined.
**** v1    0.1 CLI RX|('<vcl.inline>' Line 6 Pos 17)
**** v1    0.1 CLI RX|        backend debug {
**** v1    0.1 CLI RX|----------------#####--
**** v1    0.1 CLI RX|
**** v1    0.1 CLI RX|First definition:
**** v1    0.1 CLI RX|('<vcl.inline>' Line 4 Pos 9)
**** v1    0.1 CLI RX|        import debug;
**** v1    0.1 CLI RX|--------######-------
**** v1    0.1 CLI RX|
**** v1    0.1 CLI RX|Running VCC-compiler failed, exited with 2
**** v1    0.1 CLI RX|VCL compilation failed
**   v1    0.1 VCL compilation failed (as expected)
***  v1    0.1 Found expected string: ("Name 'debug' already defined.")
*    top   0.1 RESETTING after ../../../bin/varnishtest/tests/r01569.vtc
**   v1    0.1 Wait
**** v1    0.1 CLI TX|backend.list
***  v1    0.1 CLI RX  101
**** v1    0.1 CLI RX|Unknown request in manager process (child not running).
**** v1    0.1 CLI RX|Type 'help' for more info.
**   v1    0.1 Stop
**** v1    0.1 CLI TX|stop
***  v1    0.1 CLI RX  300
**** v1    0.1 CLI RX|Child in state stopped
**** v1    0.1 CLI TX|status
***  v1    0.1 CLI RX  200
**** v1    0.1 CLI RX|Child in state stopped
**** v1    0.1 STDOUT poll 0x10
**   v1    0.1 R 30703 Status: 0000 (u 0.007000 s 0.026000)
*    diag  0.0 ............................................................
#    top  TEST ../../../bin/varnishtest/tests/r01569.vtc TIMED OUT (kill -9)
#    top  TEST ../../../bin/varnishtest/tests/r01569.vtc FAILED (60.004) signal=9

1 @ Ubuntu LTS i686 1.04 fgs

*    top   0.0 TEST ../../../bin/varnishtest/tests/r01569.vtc starting
[...]
*    top   0.0 TEST symbol lookup order issue
[...]
**** v1    0.1 CLI TX|
**** v1    0.1 CLI TX|\tsub vcl_recv {
**** v1    0.1 CLI TX|\t\tcall debug;
**** v1    0.1 CLI TX|\t}
**** v1    0.1 CLI TX|
**** v1    0.1 CLI TX|%XJEIFLH|)Xspa8P
***  v1    0.1 CLI RX  106
**** v1    0.1 CLI RX|Message from VCC-compiler:
**** v1    0.1 CLI RX|Name 'debug' already defined.
**** v1    0.1 CLI RX|('<vcl.inline>' Line 6 Pos 17)
**** v1    0.1 CLI RX|        backend debug {
**** v1    0.1 CLI RX|----------------#####--
**** v1    0.1 CLI RX|
**** v1    0.1 CLI RX|First definition:
**** v1    0.1 CLI RX|('<vcl.inline>' Line 4 Pos 9)
**** v1    0.1 CLI RX|        import debug;
**** v1    0.1 CLI RX|--------######-------
**** v1    0.1 CLI RX|
**** v1    0.1 CLI RX|Running VCC-compiler failed, exited with 2
**** v1    0.1 CLI RX|VCL compilation failed
**   v1    0.1 VCL compilation failed (as expected)
***  v1    0.1 Found expected string: ("Name 'debug' already defined.")
*    top   0.1 RESETTING after ../../../bin/varnishtest/tests/r01569.vtc
**   v1    0.1 Wait
**** v1    0.1 CLI TX|backend.list
***  v1    0.2 CLI RX  101
**** v1    0.2 CLI RX|Unknown request in manager process (child not running).
**** v1    0.2 CLI RX|Type 'help' for more info.
**   v1    0.2 Stop
**** v1    0.2 CLI TX|stop
***  v1    0.2 CLI RX  300
**** v1    0.2 CLI RX|Child in state stopped
**** v1    0.2 CLI TX|status
***  v1    0.2 CLI RX  200
**** v1    0.2 CLI RX|Child in state stopped
**** v1    0.2 STDOUT poll 0x10
**   v1    0.2 R 29943 Status: 0000 (u 0.000000 s 0.012000)
*    diag  0.0 ............................................................
#    top  TEST ../../../bin/varnishtest/tests/r01569.vtc TIMED OUT (kill -9)
#    top  TEST ../../../bin/varnishtest/tests/r01569.vtc FAILED (60.004) signal=9

1 @ Linux 3.10.0 x86_64 1.02 mblissett

*    top   0.0 TEST ../../../bin/varnishtest/tests/r01569.vtc starting
[...]
*    top   0.0 TEST symbol lookup order issue
[...]
**** v1    0.1 CLI TX|
**** v1    0.1 CLI TX|\tsub vcl_recv {
**** v1    0.1 CLI TX|\t\tcall debug;
**** v1    0.1 CLI TX|\t}
**** v1    0.1 CLI TX|
**** v1    0.1 CLI TX|%XJEIFLH|)Xspa8P
***  v1    0.1 CLI RX  106
**** v1    0.1 CLI RX|Message from VCC-compiler:
**** v1    0.1 CLI RX|Name 'debug' already defined.
**** v1    0.1 CLI RX|('<vcl.inline>' Line 6 Pos 17)
**** v1    0.1 CLI RX|        backend debug {
**** v1    0.1 CLI RX|----------------#####--
**** v1    0.1 CLI RX|
**** v1    0.1 CLI RX|First definition:
**** v1    0.1 CLI RX|('<vcl.inline>' Line 4 Pos 9)
**** v1    0.1 CLI RX|        import debug;
**** v1    0.1 CLI RX|--------######-------
**** v1    0.1 CLI RX|
**** v1    0.1 CLI RX|Running VCC-compiler failed, exited with 2
**** v1    0.1 CLI RX|VCL compilation failed
**   v1    0.1 VCL compilation failed (as expected)
***  v1    0.1 Found expected string: ("Name 'debug' already defined.")
*    top   0.1 RESETTING after ../../../bin/varnishtest/tests/r01569.vtc
**   v1    0.1 Wait
**** v1    0.1 CLI TX|backend.list
***  v1    0.2 CLI RX  101
**** v1    0.2 CLI RX|Unknown request in manager process (child not running).
**** v1    0.2 CLI RX|Type 'help' for more info.
**   v1    0.2 Stop
**** v1    0.2 CLI TX|stop
***  v1    0.2 CLI RX  300
**** v1    0.2 CLI RX|Child in state stopped
**** v1    0.2 CLI TX|status
***  v1    0.2 CLI RX  200
**** v1    0.2 CLI RX|Child in state stopped
**** v1    0.2 STDOUT poll 0x10
**   v1    0.2 R 22021 Status: 0000 (u 0.008048 s 0.014090)
*    diag  0.0 ............................................................
#    top  TEST ../../../bin/varnishtest/tests/r01569.vtc TIMED OUT (kill -9)
#    top  TEST ../../../bin/varnishtest/tests/r01569.vtc FAILED (60.002) signal=9

1 @ Ubuntu LTS i686 1.04 fgs

*    top   0.0 TEST ../../../bin/varnishtest/tests/r01569.vtc starting
[...]
*    top   0.0 TEST symbol lookup order issue
[...]
**** v1    0.1 CLI TX|
**** v1    0.1 CLI TX|\tsub vcl_recv {
**** v1    0.1 CLI TX|\t\tcall debug;
**** v1    0.1 CLI TX|\t}
**** v1    0.1 CLI TX|
**** v1    0.1 CLI TX|%XJEIFLH|)Xspa8P
***  v1    0.1 CLI RX  106
**** v1    0.1 CLI RX|Message from VCC-compiler:
**** v1    0.1 CLI RX|Name 'debug' already defined.
**** v1    0.1 CLI RX|('<vcl.inline>' Line 6 Pos 17)
**** v1    0.1 CLI RX|        backend debug {
**** v1    0.1 CLI RX|----------------#####--
**** v1    0.1 CLI RX|
**** v1    0.1 CLI RX|First definition:
**** v1    0.1 CLI RX|('<vcl.inline>' Line 4 Pos 9)
**** v1    0.1 CLI RX|        import debug;
**** v1    0.1 CLI RX|--------######-------
**** v1    0.1 CLI RX|
**** v1    0.1 CLI RX|Running VCC-compiler failed, exited with 2
**** v1    0.1 CLI RX|VCL compilation failed
**   v1    0.1 VCL compilation failed (as expected)
***  v1    0.1 Found expected string: ("Name 'debug' already defined.")
*    top   0.1 RESETTING after ../../../bin/varnishtest/tests/r01569.vtc
**   v1    0.1 Wait
**** v1    0.1 CLI TX|backend.list
***  v1    0.1 CLI RX  101
**** v1    0.1 CLI RX|Unknown request in manager process (child not running).
**** v1    0.1 CLI RX|Type 'help' for more info.
**   v1    0.1 Stop
**** v1    0.1 CLI TX|stop
***  v1    0.2 CLI RX  300
**** v1    0.2 CLI RX|Child in state stopped
**** v1    0.2 CLI TX|status
***  v1    0.2 CLI RX  200
**** v1    0.2 CLI RX|Child in state stopped
**** v1    0.2 STDOUT poll 0x10
**   v1    0.2 R 24045 Status: 0000 (u 0.004000 s 0.000000)
*    diag  0.0 ............................................................
#    top  TEST ../../../bin/varnishtest/tests/r01569.vtc TIMED OUT (kill -9)
#    top  TEST ../../../bin/varnishtest/tests/r01569.vtc FAILED (60.001) signal=9

1 @ SunOS 5.11 i86pc 1.04 64_gcc4.7 uplex

*    top   0.0 TEST ../../../bin/varnishtest/tests/r01569.vtc starting
[...]
*    top   0.0 TEST symbol lookup order issue
[...]
**** v1    0.1 CLI TX|\tsub vcl_recv {
**** v1    0.1 CLI TX|\t\tcall debug;
**** v1    0.1 CLI TX|\t}
**** v1    0.1 CLI TX|
**** v1    0.1 CLI TX|%XJEIFLH|)Xspa8P
***  v1    0.1 CLI RX  106
**** v1    0.1 CLI RX|Message from VCC-compiler:
**** v1    0.1 CLI RX|Security: Privilege proc_setid missing, will not change uid/gid
**** v1    0.1 CLI RX|Name 'debug' already defined.
**** v1    0.1 CLI RX|('<vcl.inline>' Line 6 Pos 17)
**** v1    0.1 CLI RX|        backend debug {
**** v1    0.1 CLI RX|----------------#####--
**** v1    0.1 CLI RX|
**** v1    0.1 CLI RX|First definition:
**** v1    0.1 CLI RX|('<vcl.inline>' Line 4 Pos 9)
**** v1    0.1 CLI RX|        import debug;
**** v1    0.1 CLI RX|--------######-------
**** v1    0.1 CLI RX|
**** v1    0.1 CLI RX|Running VCC-compiler failed, exited with 2
**** v1    0.1 CLI RX|VCL compilation failed
**   v1    0.1 VCL compilation failed (as expected)
***  v1    0.1 Found expected string: ("Name 'debug' already defined.")
*    top   0.1 RESETTING after ../../../bin/varnishtest/tests/r01569.vtc
**   v1    0.1 Wait
**** v1    0.1 CLI TX|backend.list
***  v1    0.1 CLI RX  101
**** v1    0.1 CLI RX|Unknown request in manager process (child not running).
**** v1    0.1 CLI RX|Type 'help' for more info.
**   v1    0.1 Stop
**** v1    0.1 CLI TX|stop
***  v1    0.1 CLI RX  300
**** v1    0.1 CLI RX|Child in state stopped
**** v1    0.1 CLI TX|status
***  v1    0.1 CLI RX  200
**** v1    0.1 CLI RX|Child in state stopped
**** v1    0.1 STDOUT poll 0x10
**   v1    0.1 R 67010 Status: 0000 (u 0.006000 s 0.022000)
*    diag  0.0 ............................................................
#    top  TEST ../../../bin/varnishtest/tests/r01569.vtc TIMED OUT (kill -9)
#    top  TEST ../../../bin/varnishtest/tests/r01569.vtc FAILED (60.004) signal=9

1 @ SunOS 5.11 i86pc 1.04 64_gcc4.7 uplex

*    top   0.0 TEST ../../../bin/varnishtest/tests/r01569.vtc starting
[...]
*    top   0.0 TEST symbol lookup order issue
[...]
**** v1    0.1 CLI TX|\tsub vcl_recv {
**** v1    0.1 CLI TX|\t\tcall debug;
**** v1    0.1 CLI TX|\t}
**** v1    0.1 CLI TX|
**** v1    0.1 CLI TX|%XJEIFLH|)Xspa8P
***  v1    0.1 CLI RX  106
**** v1    0.1 CLI RX|Message from VCC-compiler:
**** v1    0.1 CLI RX|Security: Privilege proc_setid missing, will not change uid/gid
**** v1    0.1 CLI RX|Name 'debug' already defined.
**** v1    0.1 CLI RX|('<vcl.inline>' Line 6 Pos 17)
**** v1    0.1 CLI RX|        backend debug {
**** v1    0.1 CLI RX|----------------#####--
**** v1    0.1 CLI RX|
**** v1    0.1 CLI RX|First definition:
**** v1    0.1 CLI RX|('<vcl.inline>' Line 4 Pos 9)
**** v1    0.1 CLI RX|        import debug;
**** v1    0.1 CLI RX|--------######-------
**** v1    0.1 CLI RX|
**** v1    0.1 CLI RX|Running VCC-compiler failed, exited with 2
**** v1    0.1 CLI RX|VCL compilation failed
**   v1    0.1 VCL compilation failed (as expected)
***  v1    0.1 Found expected string: ("Name 'debug' already defined.")
*    top   0.1 RESETTING after ../../../bin/varnishtest/tests/r01569.vtc
**   v1    0.1 Wait
**** v1    0.1 CLI TX|backend.list
***  v1    0.1 CLI RX  101
**** v1    0.1 CLI RX|Unknown request in manager process (child not running).
**** v1    0.1 CLI RX|Type 'help' for more info.
**   v1    0.1 Stop
**** v1    0.1 CLI TX|stop
***  v1    0.1 CLI RX  300
**** v1    0.1 CLI RX|Child in state stopped
**** v1    0.1 CLI TX|status
***  v1    0.1 CLI RX  200
**** v1    0.1 CLI RX|Child in state stopped
**** v1    0.1 STDOUT poll 0x10
**   v1    0.1 R 62370 Status: 0000 (u 0.007000 s 0.022000)
*    diag  0.0 ............................................................
#    top  TEST ../../../bin/varnishtest/tests/r01569.vtc TIMED OUT (kill -9)
#    top  TEST ../../../bin/varnishtest/tests/r01569.vtc FAILED (60.004) signal=9

1 @ Linux 3.10.0 x86_64 1.02 mblissett

*    top   0.0 TEST ../../../bin/varnishtest/tests/r01569.vtc starting
[...]
*    top   0.0 TEST symbol lookup order issue
[...]
**** v1    0.1 CLI TX|
**** v1    0.1 CLI TX|\tsub vcl_recv {
**** v1    0.1 CLI TX|\t\tcall debug;
**** v1    0.1 CLI TX|\t}
**** v1    0.1 CLI TX|
**** v1    0.1 CLI TX|%XJEIFLH|)Xspa8P
***  v1    0.1 CLI RX  106
**** v1    0.1 CLI RX|Message from VCC-compiler:
**** v1    0.1 CLI RX|Name 'debug' already defined.
**** v1    0.1 CLI RX|('<vcl.inline>' Line 6 Pos 17)
**** v1    0.1 CLI RX|        backend debug {
**** v1    0.1 CLI RX|----------------#####--
**** v1    0.1 CLI RX|
**** v1    0.1 CLI RX|First definition:
**** v1    0.1 CLI RX|('<vcl.inline>' Line 4 Pos 9)
**** v1    0.1 CLI RX|        import debug;
**** v1    0.1 CLI RX|--------######-------
**** v1    0.1 CLI RX|
**** v1    0.1 CLI RX|Running VCC-compiler failed, exited with 2
**** v1    0.1 CLI RX|VCL compilation failed
**   v1    0.1 VCL compilation failed (as expected)
***  v1    0.1 Found expected string: ("Name 'debug' already defined.")
*    top   0.1 RESETTING after ../../../bin/varnishtest/tests/r01569.vtc
**   v1    0.1 Wait
**** v1    0.1 CLI TX|backend.list
***  v1    0.2 CLI RX  101
**** v1    0.2 CLI RX|Unknown request in manager process (child not running).
**** v1    0.2 CLI RX|Type 'help' for more info.
**   v1    0.2 Stop
**** v1    0.2 CLI TX|stop
***  v1    0.2 CLI RX  300
**** v1    0.2 CLI RX|Child in state stopped
**** v1    0.2 CLI TX|status
***  v1    0.2 CLI RX  200
**** v1    0.2 CLI RX|Child in state stopped
**** v1    0.2 STDOUT poll 0x10
**   v1    0.2 R 22711 Status: 0000 (u 0.007571 s 0.016338)
*    diag  0.0 ............................................................
#    top  TEST ../../../bin/varnishtest/tests/r01569.vtc TIMED OUT (kill -9)
#    top  TEST ../../../bin/varnishtest/tests/r01569.vtc FAILED (60.001) signal=9

1 @ Linux 3.10.0 x86_64 1.02 mblissett

*    top   0.0 TEST ../../../bin/varnishtest/tests/r01569.vtc starting
[...]
*    top   0.0 TEST symbol lookup order issue
[...]
**** v1    0.1 CLI TX|
**** v1    0.1 CLI TX|\tsub vcl_recv {
**** v1    0.1 CLI TX|\t\tcall debug;
**** v1    0.1 CLI TX|\t}
**** v1    0.1 CLI TX|
**** v1    0.1 CLI TX|%XJEIFLH|)Xspa8P
***  v1    0.1 CLI RX  106
**** v1    0.1 CLI RX|Message from VCC-compiler:
**** v1    0.1 CLI RX|Name 'debug' already defined.
**** v1    0.1 CLI RX|('<vcl.inline>' Line 6 Pos 17)
**** v1    0.1 CLI RX|        backend debug {
**** v1    0.1 CLI RX|----------------#####--
**** v1    0.1 CLI RX|
**** v1    0.1 CLI RX|First definition:
**** v1    0.1 CLI RX|('<vcl.inline>' Line 4 Pos 9)
**** v1    0.1 CLI RX|        import debug;
**** v1    0.1 CLI RX|--------######-------
**** v1    0.1 CLI RX|
**** v1    0.1 CLI RX|Running VCC-compiler failed, exited with 2
**** v1    0.1 CLI RX|VCL compilation failed
**   v1    0.1 VCL compilation failed (as expected)
***  v1    0.1 Found expected string: ("Name 'debug' already defined.")
*    top   0.1 RESETTING after ../../../bin/varnishtest/tests/r01569.vtc
**   v1    0.1 Wait
**** v1    0.1 CLI TX|backend.list
***  v1    0.2 CLI RX  101
**** v1    0.2 CLI RX|Unknown request in manager process (child not running).
**** v1    0.2 CLI RX|Type 'help' for more info.
**   v1    0.2 Stop
**** v1    0.2 CLI TX|stop
***  v1    0.2 CLI RX  300
**** v1    0.2 CLI RX|Child in state stopped
**** v1    0.2 CLI TX|status
***  v1    0.2 CLI RX  200
**** v1    0.2 CLI RX|Child in state stopped
**** v1    0.2 STDOUT poll 0x10
**   v1    0.2 R 12634 Status: 0000 (u 0.004174 s 0.012133)
*    diag  0.0 ............................................................
#    top  TEST ../../../bin/varnishtest/tests/r01569.vtc TIMED OUT (kill -9)
#    top  TEST ../../../bin/varnishtest/tests/r01569.vtc FAILED (60.001) signal=9

1 @ SunOS 5.11 i86pc 1.04 32_sun12.4 uplex

*    top   0.0 TEST ../../../bin/varnishtest/tests/r01569.vtc starting
[...]
*    top   0.0 TEST symbol lookup order issue
[...]
**** v1    0.1 CLI TX|\tsub vcl_recv {
**** v1    0.1 CLI TX|\t\tcall debug;
**** v1    0.1 CLI TX|\t}
**** v1    0.1 CLI TX|
**** v1    0.1 CLI TX|%XJEIFLH|)Xspa8P
***  v1    0.1 CLI RX  106
**** v1    0.1 CLI RX|Message from VCC-compiler:
**** v1    0.1 CLI RX|Security: Privilege proc_setid missing, will not change uid/gid
**** v1    0.1 CLI RX|Name 'debug' already defined.
**** v1    0.1 CLI RX|('<vcl.inline>' Line 6 Pos 17)
**** v1    0.1 CLI RX|        backend debug {
**** v1    0.1 CLI RX|----------------#####--
**** v1    0.1 CLI RX|
**** v1    0.1 CLI RX|First definition:
**** v1    0.1 CLI RX|('<vcl.inline>' Line 4 Pos 9)
**** v1    0.1 CLI RX|        import debug;
**** v1    0.1 CLI RX|--------######-------
**** v1    0.1 CLI RX|
**** v1    0.1 CLI RX|Running VCC-compiler failed, exited with 2
**** v1    0.1 CLI RX|VCL compilation failed
**   v1    0.1 VCL compilation failed (as expected)
***  v1    0.1 Found expected string: ("Name 'debug' already defined.")
*    top   0.1 RESETTING after ../../../bin/varnishtest/tests/r01569.vtc
**   v1    0.1 Wait
**** v1    0.1 CLI TX|backend.list
***  v1    0.1 CLI RX  101
**** v1    0.1 CLI RX|Unknown request in manager process (child not running).
**** v1    0.1 CLI RX|Type 'help' for more info.
**   v1    0.1 Stop
**** v1    0.1 CLI TX|stop
***  v1    0.1 CLI RX  300
**** v1    0.1 CLI RX|Child in state stopped
**** v1    0.1 CLI TX|status
***  v1    0.1 CLI RX  200
**** v1    0.1 CLI RX|Child in state stopped
**** v1    0.1 STDOUT poll 0x10
**   v1    0.1 R 27570 Status: 0000 (u 0.005000 s 0.020000)
*    diag  0.0 ............................................................
#    top  TEST ../../../bin/varnishtest/tests/r01569.vtc TIMED OUT (kill -9)
#    top  TEST ../../../bin/varnishtest/tests/r01569.vtc FAILED (60.002) signal=9

1 @ SunOS 5.11 i86pc 1.04 64_sun12.4 uplex

*    top   0.0 TEST ../../../bin/varnishtest/tests/r01569.vtc starting
[...]
*    top   0.0 TEST symbol lookup order issue
[...]
**** v1    0.1 CLI TX|\tsub vcl_recv {
**** v1    0.1 CLI TX|\t\tcall debug;
**** v1    0.1 CLI TX|\t}
**** v1    0.1 CLI TX|
**** v1    0.1 CLI TX|%XJEIFLH|)Xspa8P
***  v1    0.1 CLI RX  106
**** v1    0.1 CLI RX|Message from VCC-compiler:
**** v1    0.1 CLI RX|Security: Privilege proc_setid missing, will not change uid/gid
**** v1    0.1 CLI RX|Name 'debug' already defined.
**** v1    0.1 CLI RX|('<vcl.inline>' Line 6 Pos 17)
**** v1    0.1 CLI RX|        backend debug {
**** v1    0.1 CLI RX|----------------#####--
**** v1    0.1 CLI RX|
**** v1    0.1 CLI RX|First definition:
**** v1    0.1 CLI RX|('<vcl.inline>' Line 4 Pos 9)
**** v1    0.1 CLI RX|        import debug;
**** v1    0.1 CLI RX|--------######-------
**** v1    0.1 CLI RX|
**** v1    0.1 CLI RX|Running VCC-compiler failed, exited with 2
**** v1    0.1 CLI RX|VCL compilation failed
**   v1    0.1 VCL compilation failed (as expected)
***  v1    0.1 Found expected string: ("Name 'debug' already defined.")
*    top   0.1 RESETTING after ../../../bin/varnishtest/tests/r01569.vtc
**   v1    0.1 Wait
**** v1    0.1 CLI TX|backend.list
***  v1    0.1 CLI RX  101
**** v1    0.1 CLI RX|Unknown request in manager process (child not running).
**** v1    0.1 CLI RX|Type 'help' for more info.
**   v1    0.1 Stop
**** v1    0.1 CLI TX|stop
***  v1    0.1 CLI RX  300
**** v1    0.1 CLI RX|Child in state stopped
**** v1    0.1 CLI TX|status
***  v1    0.1 CLI RX  200
**** v1    0.1 CLI RX|Child in state stopped
**** v1    0.1 STDOUT poll 0x10
**   v1    0.1 R 88252 Status: 0000 (u 0.007000 s 0.022000)
*    diag  0.0 ............................................................
#    top  TEST ../../../bin/varnishtest/tests/r01569.vtc TIMED OUT (kill -9)
#    top  TEST ../../../bin/varnishtest/tests/r01569.vtc FAILED (60.004) signal=9

1 @ Linux 3.10.0 x86_64 1.02 mblissett

*    top   0.0 TEST ../../../bin/varnishtest/tests/r01569.vtc starting
[...]
*    top   0.0 TEST symbol lookup order issue
[...]
**** v1    0.1 CLI TX|
**** v1    0.1 CLI TX|\tsub vcl_recv {
**** v1    0.1 CLI TX|\t\tcall debug;
**** v1    0.1 CLI TX|\t}
**** v1    0.1 CLI TX|
**** v1    0.1 CLI TX|%XJEIFLH|)Xspa8P
***  v1    0.1 CLI RX  106
**** v1    0.1 CLI RX|Message from VCC-compiler:
**** v1    0.1 CLI RX|Name 'debug' already defined.
**** v1    0.1 CLI RX|('<vcl.inline>' Line 6 Pos 17)
**** v1    0.1 CLI RX|        backend debug {
**** v1    0.1 CLI RX|----------------#####--
**** v1    0.1 CLI RX|
**** v1    0.1 CLI RX|First definition:
**** v1    0.1 CLI RX|('<vcl.inline>' Line 4 Pos 9)
**** v1    0.1 CLI RX|        import debug;
**** v1    0.1 CLI RX|--------######-------
**** v1    0.1 CLI RX|
**** v1    0.1 CLI RX|Running VCC-compiler failed, exited with 2
**** v1    0.1 CLI RX|VCL compilation failed
**   v1    0.1 VCL compilation failed (as expected)
***  v1    0.1 Found expected string: ("Name 'debug' already defined.")
*    top   0.1 RESETTING after ../../../bin/varnishtest/tests/r01569.vtc
**   v1    0.1 Wait
**** v1    0.1 CLI TX|backend.list
***  v1    0.2 CLI RX  101
**** v1    0.2 CLI RX|Unknown request in manager process (child not running).
**** v1    0.2 CLI RX|Type 'help' for more info.
**   v1    0.2 Stop
**** v1    0.2 CLI TX|stop
***  v1    0.2 CLI RX  300
**** v1    0.2 CLI RX|Child in state stopped
**** v1    0.2 CLI TX|status
***  v1    0.2 CLI RX  200
**** v1    0.2 CLI RX|Child in state stopped
**** v1    0.2 STDOUT poll 0x10
**   v1    0.2 R 19529 Status: 0000 (u 0.002981 s 0.011913)
*    diag  0.0 ............................................................
#    top  TEST ../../../bin/varnishtest/tests/r01569.vtc TIMED OUT (kill -9)
#    top  TEST ../../../bin/varnishtest/tests/r01569.vtc FAILED (60.001) signal=9

1 @ SunOS 5.11 i86pc 1.04 64_sun12.4 uplex

*    top   0.0 TEST ../../../bin/varnishtest/tests/r01569.vtc starting
[...]
*    top   0.0 TEST symbol lookup order issue
[...]
**** v1    0.1 CLI TX|\tsub vcl_recv {
**** v1    0.1 CLI TX|\t\tcall debug;
**** v1    0.1 CLI TX|\t}
**** v1    0.1 CLI TX|
**** v1    0.1 CLI TX|%XJEIFLH|)Xspa8P
***  v1    0.1 CLI RX  106
**** v1    0.1 CLI RX|Message from VCC-compiler:
**** v1    0.1 CLI RX|Security: Privilege proc_setid missing, will not change uid/gid
**** v1    0.1 CLI RX|Name 'debug' already defined.
**** v1    0.1 CLI RX|('<vcl.inline>' Line 6 Pos 17)
**** v1    0.1 CLI RX|        backend debug {
**** v1    0.1 CLI RX|----------------#####--
**** v1    0.1 CLI RX|
**** v1    0.1 CLI RX|First definition:
**** v1    0.1 CLI RX|('<vcl.inline>' Line 4 Pos 9)
**** v1    0.1 CLI RX|        import debug;
**** v1    0.1 CLI RX|--------######-------
**** v1    0.1 CLI RX|
**** v1    0.1 CLI RX|Running VCC-compiler failed, exited with 2
**** v1    0.1 CLI RX|VCL compilation failed
**   v1    0.1 VCL compilation failed (as expected)
***  v1    0.1 Found expected string: ("Name 'debug' already defined.")
*    top   0.1 RESETTING after ../../../bin/varnishtest/tests/r01569.vtc
**   v1    0.1 Wait
**** v1    0.1 CLI TX|backend.list
***  v1    0.1 CLI RX  101
**** v1    0.1 CLI RX|Unknown request in manager process (child not running).
**** v1    0.1 CLI RX|Type 'help' for more info.
**   v1    0.1 Stop
**** v1    0.1 CLI TX|stop
***  v1    0.1 CLI RX  300
**** v1    0.1 CLI RX|Child in state stopped
**** v1    0.1 CLI TX|status
***  v1    0.1 CLI RX  200
**** v1    0.1 CLI RX|Child in state stopped
**** v1    0.1 STDOUT poll 0x10
**   v1    0.1 R 69099 Status: 0000 (u 0.007000 s 0.024000)
*    diag  0.0 ............................................................
#    top  TEST ../../../bin/varnishtest/tests/r01569.vtc TIMED OUT (kill -9)
#    top  TEST ../../../bin/varnishtest/tests/r01569.vtc FAILED (60.003) signal=9

1 @ SunOS 5.11 i86pc 1.04 32_gcc4.7 uplex

*    top   0.0 TEST ../../../bin/varnishtest/tests/r01569.vtc starting
[...]
*    top   0.0 TEST symbol lookup order issue
[...]
**** v1    0.1 CLI TX|\tsub vcl_recv {
**** v1    0.1 CLI TX|\t\tcall debug;
**** v1    0.1 CLI TX|\t}
**** v1    0.1 CLI TX|
**** v1    0.1 CLI TX|%XJEIFLH|)Xspa8P
***  v1    0.1 CLI RX  106
**** v1    0.1 CLI RX|Message from VCC-compiler:
**** v1    0.1 CLI RX|Security: Privilege proc_setid missing, will not change uid/gid
**** v1    0.1 CLI RX|Name 'debug' already defined.
**** v1    0.1 CLI RX|('<vcl.inline>' Line 6 Pos 17)
**** v1    0.1 CLI RX|        backend debug {
**** v1    0.1 CLI RX|----------------#####--
**** v1    0.1 CLI RX|
**** v1    0.1 CLI RX|First definition:
**** v1    0.1 CLI RX|('<vcl.inline>' Line 4 Pos 9)
**** v1    0.1 CLI RX|        import debug;
**** v1    0.1 CLI RX|--------######-------
**** v1    0.1 CLI RX|
**** v1    0.1 CLI RX|Running VCC-compiler failed, exited with 2
**** v1    0.1 CLI RX|VCL compilation failed
**   v1    0.1 VCL compilation failed (as expected)
***  v1    0.1 Found expected string: ("Name 'debug' already defined.")
*    top   0.1 RESETTING after ../../../bin/varnishtest/tests/r01569.vtc
**   v1    0.1 Wait
**** v1    0.1 CLI TX|backend.list
***  v1    0.1 CLI RX  101
**** v1    0.1 CLI RX|Unknown request in manager process (child not running).
**** v1    0.1 CLI RX|Type 'help' for more info.
**   v1    0.1 Stop
**** v1    0.1 CLI TX|stop
***  v1    0.1 CLI RX  300
**** v1    0.1 CLI RX|Child in state stopped
**** v1    0.1 CLI TX|status
***  v1    0.1 CLI RX  200
**** v1    0.1 CLI RX|Child in state stopped
**** v1    0.1 STDOUT poll 0x10
**   v1    0.1 R 82344 Status: 0000 (u 0.007000 s 0.027000)
*    diag  0.0 ............................................................
#    top  TEST ../../../bin/varnishtest/tests/r01569.vtc TIMED OUT (kill -9)
#    top  TEST ../../../bin/varnishtest/tests/r01569.vtc FAILED (60.003) signal=9

1 @ Ubuntu LTS i686 1.04 fgs

*    top   0.0 TEST ../../../bin/varnishtest/tests/r01569.vtc starting
[...]
*    top   0.0 TEST symbol lookup order issue
[...]
**** v1    0.1 CLI TX|
**** v1    0.1 CLI TX|\tsub vcl_recv {
**** v1    0.1 CLI TX|\t\tcall debug;
**** v1    0.1 CLI TX|\t}
**** v1    0.1 CLI TX|
**** v1    0.1 CLI TX|%XJEIFLH|)Xspa8P
***  v1    0.1 CLI RX  106
**** v1    0.1 CLI RX|Message from VCC-compiler:
**** v1    0.1 CLI RX|Name 'debug' already defined.
**** v1    0.1 CLI RX|('<vcl.inline>' Line 6 Pos 17)
**** v1    0.1 CLI RX|        backend debug {
**** v1    0.1 CLI RX|----------------#####--
**** v1    0.1 CLI RX|
**** v1    0.1 CLI RX|First definition:
**** v1    0.1 CLI RX|('<vcl.inline>' Line 4 Pos 9)
**** v1    0.1 CLI RX|        import debug;
**** v1    0.1 CLI RX|--------######-------
**** v1    0.1 CLI RX|
**** v1    0.1 CLI RX|Running VCC-compiler failed, exited with 2
**** v1    0.1 CLI RX|VCL compilation failed
**   v1    0.1 VCL compilation failed (as expected)
***  v1    0.1 Found expected string: ("Name 'debug' already defined.")
*    top   0.1 RESETTING after ../../../bin/varnishtest/tests/r01569.vtc
**   v1    0.1 Wait
**** v1    0.1 CLI TX|backend.list
***  v1    0.2 CLI RX  101
**** v1    0.2 CLI RX|Unknown request in manager process (child not running).
**** v1    0.2 CLI RX|Type 'help' for more info.
**   v1    0.2 Stop
**** v1    0.2 CLI TX|stop
***  v1    0.2 CLI RX  300
**** v1    0.2 CLI RX|Child in state stopped
**** v1    0.2 CLI TX|status
***  v1    0.2 CLI RX  200
**** v1    0.2 CLI RX|Child in state stopped
**** v1    0.2 STDOUT poll 0x10
**   v1    0.2 R 12977 Status: 0000 (u 0.004000 s 0.000000)
*    diag  0.0 ............................................................
#    top  TEST ../../../bin/varnishtest/tests/r01569.vtc TIMED OUT (kill -9)
#    top  TEST ../../../bin/varnishtest/tests/r01569.vtc FAILED (60.001) signal=9

1 @ Ubuntu LTS i686 1.04 fgs

*    top   0.0 TEST ../../../bin/varnishtest/tests/r01569.vtc starting
[...]
*    top   0.0 TEST symbol lookup order issue
[...]
**** v1    0.1 CLI TX|
**** v1    0.1 CLI TX|\tsub vcl_recv {
**** v1    0.1 CLI TX|\t\tcall debug;
**** v1    0.1 CLI TX|\t}
**** v1    0.1 CLI TX|
**** v1    0.1 CLI TX|%XJEIFLH|)Xspa8P
***  v1    0.1 CLI RX  106
**** v1    0.1 CLI RX|Message from VCC-compiler:
**** v1    0.1 CLI RX|Name 'debug' already defined.
**** v1    0.1 CLI RX|('<vcl.inline>' Line 6 Pos 17)
**** v1    0.1 CLI RX|        backend debug {
**** v1    0.1 CLI RX|----------------#####--
**** v1    0.1 CLI RX|
**** v1    0.1 CLI RX|First definition:
**** v1    0.1 CLI RX|('<vcl.inline>' Line 4 Pos 9)
**** v1    0.1 CLI RX|        import debug;
**** v1    0.1 CLI RX|--------######-------
**** v1    0.1 CLI RX|
**** v1    0.1 CLI RX|Running VCC-compiler failed, exited with 2
**** v1    0.1 CLI RX|VCL compilation failed
**   v1    0.1 VCL compilation failed (as expected)
***  v1    0.1 Found expected string: ("Name 'debug' already defined.")
*    top   0.1 RESETTING after ../../../bin/varnishtest/tests/r01569.vtc
**   v1    0.1 Wait
**** v1    0.1 CLI TX|backend.list
***  v1    0.2 CLI RX  101
**** v1    0.2 CLI RX|Unknown request in manager process (child not running).
**** v1    0.2 CLI RX|Type 'help' for more info.
**   v1    0.2 Stop
**** v1    0.2 CLI TX|stop
***  v1    0.2 CLI RX  300
**** v1    0.2 CLI RX|Child in state stopped
**** v1    0.2 CLI TX|status
***  v1    0.2 CLI RX  200
**** v1    0.2 CLI RX|Child in state stopped
**** v1    0.2 STDOUT poll 0x10
**   v1    0.2 R 15127 Status: 0000 (u 0.004000 s 0.000000)
*    diag  0.0 ............................................................
#    top  TEST ../../../bin/varnishtest/tests/r01569.vtc TIMED OUT (kill -9)
#    top  TEST ../../../bin/varnishtest/tests/r01569.vtc FAILED (60.001) signal=9

1 @ SunOS 5.11 i86pc 1.04 64_gcc4.7 uplex

*    top   0.0 TEST ../../../bin/varnishtest/tests/r01569.vtc starting
[...]
*    top   0.0 TEST symbol lookup order issue
[...]
**** v1    0.1 CLI TX|\tsub vcl_recv {
**** v1    0.1 CLI TX|\t\tcall debug;
**** v1    0.1 CLI TX|\t}
**** v1    0.1 CLI TX|
**** v1    0.1 CLI TX|%XJEIFLH|)Xspa8P
***  v1    0.1 CLI RX  106
**** v1    0.1 CLI RX|Message from VCC-compiler:
**** v1    0.1 CLI RX|Security: Privilege proc_setid missing, will not change uid/gid
**** v1    0.1 CLI RX|Name 'debug' already defined.
**** v1    0.1 CLI RX|('<vcl.inline>' Line 6 Pos 17)
**** v1    0.1 CLI RX|        backend debug {
**** v1    0.1 CLI RX|----------------#####--
**** v1    0.1 CLI RX|
**** v1    0.1 CLI RX|First definition:
**** v1    0.1 CLI RX|('<vcl.inline>' Line 4 Pos 9)
**** v1    0.1 CLI RX|        import debug;
**** v1    0.1 CLI RX|--------######-------
**** v1    0.1 CLI RX|
**** v1    0.1 CLI RX|Running VCC-compiler failed, exited with 2
**** v1    0.1 CLI RX|VCL compilation failed
**   v1    0.1 VCL compilation failed (as expected)
***  v1    0.1 Found expected string: ("Name 'debug' already defined.")
*    top   0.1 RESETTING after ../../../bin/varnishtest/tests/r01569.vtc
**   v1    0.1 Wait
**** v1    0.1 CLI TX|backend.list
***  v1    0.1 CLI RX  101
**** v1    0.1 CLI RX|Unknown request in manager process (child not running).
**** v1    0.1 CLI RX|Type 'help' for more info.
**   v1    0.1 Stop
**** v1    0.1 CLI TX|stop
***  v1    0.1 CLI RX  300
**** v1    0.1 CLI RX|Child in state stopped
**** v1    0.1 CLI TX|status
***  v1    0.1 CLI RX  200
**** v1    0.1 CLI RX|Child in state stopped
**** v1    0.1 STDOUT poll 0x10
**   v1    0.1 R 73674 Status: 0000 (u 0.007000 s 0.022000)
*    diag  0.0 ............................................................
#    top  TEST ../../../bin/varnishtest/tests/r01569.vtc TIMED OUT (kill -9)
#    top  TEST ../../../bin/varnishtest/tests/r01569.vtc FAILED (60.005) signal=9

1 @ Ubuntu LTS i686 1.04 fgs

*    top   0.0 TEST ../../../bin/varnishtest/tests/r01569.vtc starting
[...]
*    top   0.0 TEST symbol lookup order issue
[...]
**** v1    0.1 CLI TX|
**** v1    0.1 CLI TX|\tsub vcl_recv {
**** v1    0.1 CLI TX|\t\tcall debug;
**** v1    0.1 CLI TX|\t}
**** v1    0.1 CLI TX|
**** v1    0.1 CLI TX|%XJEIFLH|)Xspa8P
***  v1    0.1 CLI RX  106
**** v1    0.1 CLI RX|Message from VCC-compiler:
**** v1    0.1 CLI RX|Name 'debug' already defined.
**** v1    0.1 CLI RX|('<vcl.inline>' Line 6 Pos 17)
**** v1    0.1 CLI RX|        backend debug {
**** v1    0.1 CLI RX|----------------#####--
**** v1    0.1 CLI RX|
**** v1    0.1 CLI RX|First definition:
**** v1    0.1 CLI RX|('<vcl.inline>' Line 4 Pos 9)
**** v1    0.1 CLI RX|        import debug;
**** v1    0.1 CLI RX|--------######-------
**** v1    0.1 CLI RX|
**** v1    0.1 CLI RX|Running VCC-compiler failed, exited with 2
**** v1    0.1 CLI RX|VCL compilation failed
**   v1    0.1 VCL compilation failed (as expected)
***  v1    0.1 Found expected string: ("Name 'debug' already defined.")
*    top   0.1 RESETTING after ../../../bin/varnishtest/tests/r01569.vtc
**   v1    0.1 Wait
**** v1    0.1 CLI TX|backend.list
***  v1    0.1 CLI RX  101
**** v1    0.1 CLI RX|Unknown request in manager process (child not running).
**** v1    0.1 CLI RX|Type 'help' for more info.
**   v1    0.1 Stop
**** v1    0.1 CLI TX|stop
***  v1    0.2 CLI RX  300
**** v1    0.2 CLI RX|Child in state stopped
**** v1    0.2 CLI TX|status
***  v1    0.2 CLI RX  200
**** v1    0.2 CLI RX|Child in state stopped
**** v1    0.2 STDOUT poll 0x10
**   v1    0.2 R 3841 Status: 0000 (u 0.000000 s 0.004000)
*    diag  0.0 ............................................................
#    top  TEST ../../../bin/varnishtest/tests/r01569.vtc TIMED OUT (kill -9)
#    top  TEST ../../../bin/varnishtest/tests/r01569.vtc FAILED (60.001) signal=9

1 @ SunOS 5.11 i86pc 1.04 64_sun12.4 uplex

*    top   0.0 TEST ../../../bin/varnishtest/tests/r01569.vtc starting
[...]
*    top   0.0 TEST symbol lookup order issue
[...]
**** v1    0.1 CLI TX|\tsub vcl_recv {
**** v1    0.1 CLI TX|\t\tcall debug;
**** v1    0.1 CLI TX|\t}
**** v1    0.1 CLI TX|
**** v1    0.1 CLI TX|%XJEIFLH|)Xspa8P
***  v1    0.1 CLI RX  106
**** v1    0.1 CLI RX|Message from VCC-compiler:
**** v1    0.1 CLI RX|Security: Privilege proc_setid missing, will not change uid/gid
**** v1    0.1 CLI RX|Name 'debug' already defined.
**** v1    0.1 CLI RX|('<vcl.inline>' Line 6 Pos 17)
**** v1    0.1 CLI RX|        backend debug {
**** v1    0.1 CLI RX|----------------#####--
**** v1    0.1 CLI RX|
**** v1    0.1 CLI RX|First definition:
**** v1    0.1 CLI RX|('<vcl.inline>' Line 4 Pos 9)
**** v1    0.1 CLI RX|        import debug;
**** v1    0.1 CLI RX|--------######-------
**** v1    0.1 CLI RX|
**** v1    0.1 CLI RX|Running VCC-compiler failed, exited with 2
**** v1    0.1 CLI RX|VCL compilation failed
**   v1    0.1 VCL compilation failed (as expected)
***  v1    0.1 Found expected string: ("Name 'debug' already defined.")
*    top   0.1 RESETTING after ../../../bin/varnishtest/tests/r01569.vtc
**   v1    0.1 Wait
**** v1    0.1 CLI TX|backend.list
***  v1    0.1 CLI RX  101
**** v1    0.1 CLI RX|Unknown request in manager process (child not running).
**** v1    0.1 CLI RX|Type 'help' for more info.
**   v1    0.1 Stop
**** v1    0.1 CLI TX|stop
***  v1    0.1 CLI RX  300
**** v1    0.1 CLI RX|Child in state stopped
**** v1    0.1 CLI TX|status
***  v1    0.1 CLI RX  200
**** v1    0.1 CLI RX|Child in state stopped
**** v1    0.1 STDOUT poll 0x10
**   v1    0.1 R 13437 Status: 0000 (u 0.007000 s 0.024000)
*    diag  0.0 ............................................................
#    top  TEST ../../../bin/varnishtest/tests/r01569.vtc TIMED OUT (kill -9)
#    top  TEST ../../../bin/varnishtest/tests/r01569.vtc FAILED (60.004) signal=9

1 @ Linux 3.10.0 x86_64 1.02 mblissett

*    top   0.0 TEST ../../../bin/varnishtest/tests/r01569.vtc starting
[...]
*    top   0.0 TEST symbol lookup order issue
[...]
**** v1    0.1 CLI TX|
**** v1    0.1 CLI TX|\tsub vcl_recv {
**** v1    0.1 CLI TX|\t\tcall debug;
**** v1    0.1 CLI TX|\t}
**** v1    0.1 CLI TX|
**** v1    0.1 CLI TX|%XJEIFLH|)Xspa8P
***  v1    0.1 CLI RX  106
**** v1    0.1 CLI RX|Message from VCC-compiler:
**** v1    0.1 CLI RX|Name 'debug' already defined.
**** v1    0.1 CLI RX|('<vcl.inline>' Line 6 Pos 17)
**** v1    0.1 CLI RX|        backend debug {
**** v1    0.1 CLI RX|----------------#####--
**** v1    0.1 CLI RX|
**** v1    0.1 CLI RX|First definition:
**** v1    0.1 CLI RX|('<vcl.inline>' Line 4 Pos 9)
**** v1    0.1 CLI RX|        import debug;
**** v1    0.1 CLI RX|--------######-------
**** v1    0.1 CLI RX|
**** v1    0.1 CLI RX|Running VCC-compiler failed, exited with 2
**** v1    0.1 CLI RX|VCL compilation failed
**   v1    0.1 VCL compilation failed (as expected)
***  v1    0.1 Found expected string: ("Name 'debug' already defined.")
*    top   0.1 RESETTING after ../../../bin/varnishtest/tests/r01569.vtc
**   v1    0.1 Wait
**** v1    0.1 CLI TX|backend.list
***  v1    0.2 CLI RX  101
**** v1    0.2 CLI RX|Unknown request in manager process (child not running).
**** v1    0.2 CLI RX|Type 'help' for more info.
**   v1    0.2 Stop
**** v1    0.2 CLI TX|stop
***  v1    0.2 CLI RX  300
**** v1    0.2 CLI RX|Child in state stopped
**** v1    0.2 CLI TX|status
***  v1    0.2 CLI RX  200
**** v1    0.2 CLI RX|Child in state stopped
**** v1    0.2 STDOUT poll 0x10
**   v1    0.2 R 32192 Status: 0000 (u 0.005562 s 0.013888)
*    diag  0.0 ............................................................
#    top  TEST ../../../bin/varnishtest/tests/r01569.vtc TIMED OUT (kill -9)
#    top  TEST ../../../bin/varnishtest/tests/r01569.vtc FAILED (60.001) signal=9

1 @ SunOS 5.11 i86pc 1.04 32_gcc4.7 uplex

*    top   0.0 TEST ../../../bin/varnishtest/tests/r01569.vtc starting
[...]
*    top   0.0 TEST symbol lookup order issue
[...]
**** v1    0.1 CLI TX|\tsub vcl_recv {
**** v1    0.1 CLI TX|\t\tcall debug;
**** v1    0.1 CLI TX|\t}
**** v1    0.1 CLI TX|
**** v1    0.1 CLI TX|%XJEIFLH|)Xspa8P
***  v1    0.1 CLI RX  106
**** v1    0.1 CLI RX|Message from VCC-compiler:
**** v1    0.1 CLI RX|Security: Privilege proc_setid missing, will not change uid/gid
**** v1    0.1 CLI RX|Name 'debug' already defined.
**** v1    0.1 CLI RX|('<vcl.inline>' Line 6 Pos 17)
**** v1    0.1 CLI RX|        backend debug {
**** v1    0.1 CLI RX|----------------#####--
**** v1    0.1 CLI RX|
**** v1    0.1 CLI RX|First definition:
**** v1    0.1 CLI RX|('<vcl.inline>' Line 4 Pos 9)
**** v1    0.1 CLI RX|        import debug;
**** v1    0.1 CLI RX|--------######-------
**** v1    0.1 CLI RX|
**** v1    0.1 CLI RX|Running VCC-compiler failed, exited with 2
**** v1    0.1 CLI RX|VCL compilation failed
**   v1    0.1 VCL compilation failed (as expected)
***  v1    0.1 Found expected string: ("Name 'debug' already defined.")
*    top   0.1 RESETTING after ../../../bin/varnishtest/tests/r01569.vtc
**   v1    0.1 Wait
**** v1    0.1 CLI TX|backend.list
***  v1    0.1 CLI RX  101
**** v1    0.1 CLI RX|Unknown request in manager process (child not running).
**** v1    0.1 CLI RX|Type 'help' for more info.
**   v1    0.1 Stop
**** v1    0.1 CLI TX|stop
***  v1    0.1 CLI RX  300
**** v1    0.1 CLI RX|Child in state stopped
**** v1    0.1 CLI TX|status
***  v1    0.1 CLI RX  200
**** v1    0.1 CLI RX|Child in state stopped
**** v1    0.1 STDOUT poll 0x10
**   v1    0.1 R 51261 Status: 0000 (u 0.005000 s 0.022000)
*    diag  0.0 ............................................................
#    top  TEST ../../../bin/varnishtest/tests/r01569.vtc TIMED OUT (kill -9)
#    top  TEST ../../../bin/varnishtest/tests/r01569.vtc FAILED (60.002) signal=9

1 @ SunOS 5.11 i86pc 1.04 64_gcc4.7 uplex

*    top   0.0 TEST ../../../bin/varnishtest/tests/r01569.vtc starting
[...]
*    top   0.0 TEST symbol lookup order issue
[...]
**** v1    0.2 CLI TX|\tsub vcl_recv {
**** v1    0.2 CLI TX|\t\tcall debug;
**** v1    0.2 CLI TX|\t}
**** v1    0.2 CLI TX|
**** v1    0.2 CLI TX|%XJEIFLH|)Xspa8P
***  v1    0.2 CLI RX  106
**** v1    0.2 CLI RX|Message from VCC-compiler:
**** v1    0.2 CLI RX|Security: Privilege proc_setid missing, will not change uid/gid
**** v1    0.2 CLI RX|Name 'debug' already defined.
**** v1    0.2 CLI RX|('<vcl.inline>' Line 6 Pos 17)
**** v1    0.2 CLI RX|        backend debug {
**** v1    0.2 CLI RX|----------------#####--
**** v1    0.2 CLI RX|
**** v1    0.2 CLI RX|First definition:
**** v1    0.2 CLI RX|('<vcl.inline>' Line 4 Pos 9)
**** v1    0.2 CLI RX|        import debug;
**** v1    0.2 CLI RX|--------######-------
**** v1    0.2 CLI RX|
**** v1    0.2 CLI RX|Running VCC-compiler failed, exited with 2
**** v1    0.2 CLI RX|VCL compilation failed
**   v1    0.2 VCL compilation failed (as expected)
***  v1    0.2 Found expected string: ("Name 'debug' already defined.")
*    top   0.2 RESETTING after ../../../bin/varnishtest/tests/r01569.vtc
**   v1    0.2 Wait
**** v1    0.2 CLI TX|backend.list
***  v1    0.2 CLI RX  101
**** v1    0.2 CLI RX|Unknown request in manager process (child not running).
**** v1    0.2 CLI RX|Type 'help' for more info.
**   v1    0.2 Stop
**** v1    0.2 CLI TX|stop
***  v1    0.2 CLI RX  300
**** v1    0.2 CLI RX|Child in state stopped
**** v1    0.2 CLI TX|status
***  v1    0.2 CLI RX  200
**** v1    0.2 CLI RX|Child in state stopped
**** v1    0.2 STDOUT poll 0x10
**   v1    0.2 R 93332 Status: 0000 (u 0.011000 s 0.039000)
*    diag  0.0 ............................................................
#    top  TEST ../../../bin/varnishtest/tests/r01569.vtc TIMED OUT (kill -9)
#    top  TEST ../../../bin/varnishtest/tests/r01569.vtc FAILED (60.005) signal=9

1 @ SunOS 5.11 i86pc 1.04 64_gcc4.7 uplex

*    top   0.0 TEST ../../../bin/varnishtest/tests/r01569.vtc starting
[...]
*    top   0.0 TEST symbol lookup order issue
[...]
**** v1    0.1 CLI TX|\tsub vcl_recv {
**** v1    0.1 CLI TX|\t\tcall debug;
**** v1    0.1 CLI TX|\t}
**** v1    0.1 CLI TX|
**** v1    0.1 CLI TX|%XJEIFLH|)Xspa8P
***  v1    0.2 CLI RX  106
**** v1    0.2 CLI RX|Message from VCC-compiler:
**** v1    0.2 CLI RX|Security: Privilege proc_setid missing, will not change uid/gid
**** v1    0.2 CLI RX|Name 'debug' already defined.
**** v1    0.2 CLI RX|('<vcl.inline>' Line 6 Pos 17)
**** v1    0.2 CLI RX|        backend debug {
**** v1    0.2 CLI RX|----------------#####--
**** v1    0.2 CLI RX|
**** v1    0.2 CLI RX|First definition:
**** v1    0.2 CLI RX|('<vcl.inline>' Line 4 Pos 9)
**** v1    0.2 CLI RX|        import debug;
**** v1    0.2 CLI RX|--------######-------
**** v1    0.2 CLI RX|
**** v1    0.2 CLI RX|Running VCC-compiler failed, exited with 2
**** v1    0.2 CLI RX|VCL compilation failed
**   v1    0.2 VCL compilation failed (as expected)
***  v1    0.2 Found expected string: ("Name 'debug' already defined.")
*    top   0.2 RESETTING after ../../../bin/varnishtest/tests/r01569.vtc
**   v1    0.2 Wait
**** v1    0.2 CLI TX|backend.list
***  v1    0.2 CLI RX  101
**** v1    0.2 CLI RX|Unknown request in manager process (child not running).
**** v1    0.2 CLI RX|Type 'help' for more info.
**   v1    0.2 Stop
**** v1    0.2 CLI TX|stop
***  v1    0.2 CLI RX  300
**** v1    0.2 CLI RX|Child in state stopped
**** v1    0.2 CLI TX|status
***  v1    0.2 CLI RX  200
**** v1    0.2 CLI RX|Child in state stopped
**** v1    0.2 STDOUT poll 0x10
**   v1    0.2 R 25882 Status: 0000 (u 0.010000 s 0.032000)
*    diag  0.0 ............................................................
#    top  TEST ../../../bin/varnishtest/tests/r01569.vtc TIMED OUT (kill -9)
#    top  TEST ../../../bin/varnishtest/tests/r01569.vtc FAILED (60.004) signal=9

1 @ SunOS 5.11 i86pc 1.04 64_gcc4.7 uplex

*    top   0.0 TEST ../../../bin/varnishtest/tests/r01569.vtc starting
[...]
*    top   0.0 TEST symbol lookup order issue
[...]
**** v1    0.1 CLI TX|\tsub vcl_recv {
**** v1    0.1 CLI TX|\t\tcall debug;
**** v1    0.1 CLI TX|\t}
**** v1    0.1 CLI TX|
**** v1    0.1 CLI TX|%XJEIFLH|)Xspa8P
***  v1    0.1 CLI RX  106
**** v1    0.1 CLI RX|Message from VCC-compiler:
**** v1    0.1 CLI RX|Security: Privilege proc_setid missing, will not change uid/gid
**** v1    0.1 CLI RX|Name 'debug' already defined.
**** v1    0.1 CLI RX|('<vcl.inline>' Line 6 Pos 17)
**** v1    0.1 CLI RX|        backend debug {
**** v1    0.1 CLI RX|----------------#####--
**** v1    0.1 CLI RX|
**** v1    0.1 CLI RX|First definition:
**** v1    0.1 CLI RX|('<vcl.inline>' Line 4 Pos 9)
**** v1    0.1 CLI RX|        import debug;
**** v1    0.1 CLI RX|--------######-------
**** v1    0.1 CLI RX|
**** v1    0.1 CLI RX|Running VCC-compiler failed, exited with 2
**** v1    0.1 CLI RX|VCL compilation failed
**   v1    0.1 VCL compilation failed (as expected)
***  v1    0.1 Found expected string: ("Name 'debug' already defined.")
*    top   0.1 RESETTING after ../../../bin/varnishtest/tests/r01569.vtc
**   v1    0.1 Wait
**** v1    0.1 CLI TX|backend.list
***  v1    0.1 CLI RX  101
**** v1    0.1 CLI RX|Unknown request in manager process (child not running).
**** v1    0.1 CLI RX|Type 'help' for more info.
**   v1    0.1 Stop
**** v1    0.1 CLI TX|stop
***  v1    0.1 CLI RX  300
**** v1    0.1 CLI RX|Child in state stopped
**** v1    0.1 CLI TX|status
***  v1    0.1 CLI RX  200
**** v1    0.1 CLI RX|Child in state stopped
**** v1    0.1 STDOUT poll 0x10
**   v1    0.1 R 91258 Status: 0000 (u 0.007000 s 0.025000)
*    diag  0.0 ............................................................
#    top  TEST ../../../bin/varnishtest/tests/r01569.vtc TIMED OUT (kill -9)
#    top  TEST ../../../bin/varnishtest/tests/r01569.vtc FAILED (60.004) signal=9

1 @ Linux 3.10.0 x86_64 1.02 mblissett

*    top   0.0 TEST ../../../bin/varnishtest/tests/r01569.vtc starting
[...]
*    top   0.0 TEST symbol lookup order issue
[...]
**** v1    0.1 CLI TX|
**** v1    0.1 CLI TX|\tsub vcl_recv {
**** v1    0.1 CLI TX|\t\tcall debug;
**** v1    0.1 CLI TX|\t}
**** v1    0.1 CLI TX|
**** v1    0.1 CLI TX|%XJEIFLH|)Xspa8P
***  v1    0.1 CLI RX  106
**** v1    0.1 CLI RX|Message from VCC-compiler:
**** v1    0.1 CLI RX|Name 'debug' already defined.
**** v1    0.1 CLI RX|('<vcl.inline>' Line 6 Pos 17)
**** v1    0.1 CLI RX|        backend debug {
**** v1    0.1 CLI RX|----------------#####--
**** v1    0.1 CLI RX|
**** v1    0.1 CLI RX|First definition:
**** v1    0.1 CLI RX|('<vcl.inline>' Line 4 Pos 9)
**** v1    0.1 CLI RX|        import debug;
**** v1    0.1 CLI RX|--------######-------
**** v1    0.1 CLI RX|
**** v1    0.1 CLI RX|Running VCC-compiler failed, exited with 2
**** v1    0.1 CLI RX|VCL compilation failed
**   v1    0.1 VCL compilation failed (as expected)
***  v1    0.1 Found expected string: ("Name 'debug' already defined.")
*    top   0.1 RESETTING after ../../../bin/varnishtest/tests/r01569.vtc
**   v1    0.1 Wait
**** v1    0.1 CLI TX|backend.list
***  v1    0.2 CLI RX  101
**** v1    0.2 CLI RX|Unknown request in manager process (child not running).
**** v1    0.2 CLI RX|Type 'help' for more info.
**   v1    0.2 Stop
**** v1    0.2 CLI TX|stop
***  v1    0.2 CLI RX  300
**** v1    0.2 CLI RX|Child in state stopped
**** v1    0.2 CLI TX|status
***  v1    0.2 CLI RX  200
**** v1    0.2 CLI RX|Child in state stopped
**** v1    0.2 STDOUT poll 0x10
**   v1    0.2 R 9264 Status: 0000 (u 0.004766 s 0.014392)
*    diag  0.0 ............................................................
#    top  TEST ../../../bin/varnishtest/tests/r01569.vtc TIMED OUT (kill -9)
#    top  TEST ../../../bin/varnishtest/tests/r01569.vtc FAILED (60.001) signal=9

1 @ SunOS 5.11 i86pc 1.04 64_gcc4.7 uplex

*    top   0.0 TEST ../../../bin/varnishtest/tests/r01569.vtc starting
[...]
*    top   0.0 TEST symbol lookup order issue
[...]
**** v1    0.1 CLI TX|\tsub vcl_recv {
**** v1    0.1 CLI TX|\t\tcall debug;
**** v1    0.1 CLI TX|\t}
**** v1    0.1 CLI TX|
**** v1    0.1 CLI TX|%XJEIFLH|)Xspa8P
***  v1    0.1 CLI RX  106
**** v1    0.1 CLI RX|Message from VCC-compiler:
**** v1    0.1 CLI RX|Security: Privilege proc_setid missing, will not change uid/gid
**** v1    0.1 CLI RX|Name 'debug' already defined.
**** v1    0.1 CLI RX|('<vcl.inline>' Line 6 Pos 17)
**** v1    0.1 CLI RX|        backend debug {
**** v1    0.1 CLI RX|----------------#####--
**** v1    0.1 CLI RX|
**** v1    0.1 CLI RX|First definition:
**** v1    0.1 CLI RX|('<vcl.inline>' Line 4 Pos 9)
**** v1    0.1 CLI RX|        import debug;
**** v1    0.1 CLI RX|--------######-------
**** v1    0.1 CLI RX|
**** v1    0.1 CLI RX|Running VCC-compiler failed, exited with 2
**** v1    0.1 CLI RX|VCL compilation failed
**   v1    0.1 VCL compilation failed (as expected)
***  v1    0.1 Found expected string: ("Name 'debug' already defined.")
*    top   0.1 RESETTING after ../../../bin/varnishtest/tests/r01569.vtc
**   v1    0.1 Wait
**** v1    0.1 CLI TX|backend.list
***  v1    0.1 CLI RX  101
**** v1    0.1 CLI RX|Unknown request in manager process (child not running).
**** v1    0.1 CLI RX|Type 'help' for more info.
**   v1    0.1 Stop
**** v1    0.1 CLI TX|stop
***  v1    0.1 CLI RX  300
**** v1    0.1 CLI RX|Child in state stopped
**** v1    0.1 CLI TX|status
***  v1    0.1 CLI RX  200
**** v1    0.1 CLI RX|Child in state stopped
**** v1    0.1 STDOUT poll 0x10
**   v1    0.1 R 84803 Status: 0000 (u 0.007000 s 0.027000)
*    diag  0.0 ............................................................
#    top  TEST ../../../bin/varnishtest/tests/r01569.vtc TIMED OUT (kill -9)
#    top  TEST ../../../bin/varnishtest/tests/r01569.vtc FAILED (60.003) signal=9

1 @ Linux 3.10.0 x86_64 1.02 mblissett

*    top   0.0 TEST ../../../bin/varnishtest/tests/r01569.vtc starting
[...]
*    top   0.0 TEST symbol lookup order issue
[...]
**** v1    0.1 CLI TX|
**** v1    0.1 CLI TX|\tsub vcl_recv {
**** v1    0.1 CLI TX|\t\tcall debug;
**** v1    0.1 CLI TX|\t}
**** v1    0.1 CLI TX|
**** v1    0.1 CLI TX|%XJEIFLH|)Xspa8P
***  v1    0.1 CLI RX  106
**** v1    0.1 CLI RX|Message from VCC-compiler:
**** v1    0.1 CLI RX|Name 'debug' already defined.
**** v1    0.1 CLI RX|('<vcl.inline>' Line 6 Pos 17)
**** v1    0.1 CLI RX|        backend debug {
**** v1    0.1 CLI RX|----------------#####--
**** v1    0.1 CLI RX|
**** v1    0.1 CLI RX|First definition:
**** v1    0.1 CLI RX|('<vcl.inline>' Line 4 Pos 9)
**** v1    0.1 CLI RX|        import debug;
**** v1    0.1 CLI RX|--------######-------
**** v1    0.1 CLI RX|
**** v1    0.1 CLI RX|Running VCC-compiler failed, exited with 2
**** v1    0.1 CLI RX|VCL compilation failed
**   v1    0.1 VCL compilation failed (as expected)
***  v1    0.1 Found expected string: ("Name 'debug' already defined.")
*    top   0.1 RESETTING after ../../../bin/varnishtest/tests/r01569.vtc
**   v1    0.1 Wait
**** v1    0.1 CLI TX|backend.list
***  v1    0.2 CLI RX  101
**** v1    0.2 CLI RX|Unknown request in manager process (child not running).
**** v1    0.2 CLI RX|Type 'help' for more info.
**   v1    0.2 Stop
**** v1    0.2 CLI TX|stop
***  v1    0.2 CLI RX  300
**** v1    0.2 CLI RX|Child in state stopped
**** v1    0.2 CLI TX|status
***  v1    0.2 CLI RX  200
**** v1    0.2 CLI RX|Child in state stopped
**** v1    0.2 STDOUT poll 0x10
**   v1    0.2 R 2959 Status: 0000 (u 0.002732 s 0.012348)
*    diag  0.0 ............................................................
#    top  TEST ../../../bin/varnishtest/tests/r01569.vtc TIMED OUT (kill -9)
#    top  TEST ../../../bin/varnishtest/tests/r01569.vtc FAILED (60.002) signal=9

1 @ SunOS 5.11 i86pc 1.04 32_gcc4.7 uplex

*    top   0.0 TEST ../../../bin/varnishtest/tests/r01569.vtc starting
[...]
*    top   0.0 TEST symbol lookup order issue
[...]
**** v1    0.1 CLI TX|\tsub vcl_recv {
**** v1    0.1 CLI TX|\t\tcall debug;
**** v1    0.1 CLI TX|\t}
**** v1    0.1 CLI TX|
**** v1    0.1 CLI TX|%XJEIFLH|)Xspa8P
***  v1    0.1 CLI RX  106
**** v1    0.1 CLI RX|Message from VCC-compiler:
**** v1    0.1 CLI RX|Security: Privilege proc_setid missing, will not change uid/gid
**** v1    0.1 CLI RX|Name 'debug' already defined.
**** v1    0.1 CLI RX|('<vcl.inline>' Line 6 Pos 17)
**** v1    0.1 CLI RX|        backend debug {
**** v1    0.1 CLI RX|----------------#####--
**** v1    0.1 CLI RX|
**** v1    0.1 CLI RX|First definition:
**** v1    0.1 CLI RX|('<vcl.inline>' Line 4 Pos 9)
**** v1    0.1 CLI RX|        import debug;
**** v1    0.1 CLI RX|--------######-------
**** v1    0.1 CLI RX|
**** v1    0.1 CLI RX|Running VCC-compiler failed, exited with 2
**** v1    0.1 CLI RX|VCL compilation failed
**   v1    0.1 VCL compilation failed (as expected)
***  v1    0.1 Found expected string: ("Name 'debug' already defined.")
*    top   0.1 RESETTING after ../../../bin/varnishtest/tests/r01569.vtc
**   v1    0.1 Wait
**** v1    0.1 CLI TX|backend.list
***  v1    0.1 CLI RX  101
**** v1    0.1 CLI RX|Unknown request in manager process (child not running).
**** v1    0.1 CLI RX|Type 'help' for more info.
**   v1    0.1 Stop
**** v1    0.1 CLI TX|stop
***  v1    0.1 CLI RX  300
**** v1    0.1 CLI RX|Child in state stopped
**** v1    0.1 CLI TX|status
***  v1    0.1 CLI RX  200
**** v1    0.1 CLI RX|Child in state stopped
**** v1    0.1 STDOUT poll 0x10
**   v1    0.1 R 67036 Status: 0000 (u 0.005000 s 0.018000)
*    diag  0.0 ............................................................
#    top  TEST ../../../bin/varnishtest/tests/r01569.vtc TIMED OUT (kill -9)
#    top  TEST ../../../bin/varnishtest/tests/r01569.vtc FAILED (60.002) signal=9

1 @ SunOS 5.11 i86pc 1.04 64_gcc4.7 uplex

*    top   0.0 TEST ../../../bin/varnishtest/tests/r01569.vtc starting
[...]
*    top   0.0 TEST symbol lookup order issue
[...]
**** v1    0.2 CLI TX|\tsub vcl_recv {
**** v1    0.2 CLI TX|\t\tcall debug;
**** v1    0.2 CLI TX|\t}
**** v1    0.2 CLI TX|
**** v1    0.2 CLI TX|%XJEIFLH|)Xspa8P
***  v1    0.2 CLI RX  106
**** v1    0.2 CLI RX|Message from VCC-compiler:
**** v1    0.2 CLI RX|Security: Privilege proc_setid missing, will not change uid/gid
**** v1    0.2 CLI RX|Name 'debug' already defined.
**** v1    0.2 CLI RX|('<vcl.inline>' Line 6 Pos 17)
**** v1    0.2 CLI RX|        backend debug {
**** v1    0.2 CLI RX|----------------#####--
**** v1    0.2 CLI RX|
**** v1    0.2 CLI RX|First definition:
**** v1    0.2 CLI RX|('<vcl.inline>' Line 4 Pos 9)
**** v1    0.2 CLI RX|        import debug;
**** v1    0.2 CLI RX|--------######-------
**** v1    0.2 CLI RX|
**** v1    0.2 CLI RX|Running VCC-compiler failed, exited with 2
**** v1    0.2 CLI RX|VCL compilation failed
**   v1    0.2 VCL compilation failed (as expected)
***  v1    0.2 Found expected string: ("Name 'debug' already defined.")
*    top   0.2 RESETTING after ../../../bin/varnishtest/tests/r01569.vtc
**   v1    0.2 Wait
**** v1    0.2 CLI TX|backend.list
***  v1    0.2 CLI RX  101
**** v1    0.2 CLI RX|Unknown request in manager process (child not running).
**** v1    0.2 CLI RX|Type 'help' for more info.
**   v1    0.2 Stop
**** v1    0.2 CLI TX|stop
***  v1    0.2 CLI RX  300
**** v1    0.2 CLI RX|Child in state stopped
**** v1    0.2 CLI TX|status
***  v1    0.2 CLI RX  200
**** v1    0.2 CLI RX|Child in state stopped
**** v1    0.2 STDOUT poll 0x10
**   v1    0.2 R 7942 Status: 0000 (u 0.011000 s 0.038000)
*    diag  0.0 ............................................................
#    top  TEST ../../../bin/varnishtest/tests/r01569.vtc TIMED OUT (kill -9)
#    top  TEST ../../../bin/varnishtest/tests/r01569.vtc FAILED (60.005) signal=9

1 @ SunOS 5.11 i86pc 1.04 64_gcc4.7 uplex

*    top   0.0 TEST ../../../bin/varnishtest/tests/r01569.vtc starting
[...]
*    top   0.0 TEST symbol lookup order issue
[...]
**** v1    0.1 CLI TX|\tsub vcl_recv {
**** v1    0.1 CLI TX|\t\tcall debug;
**** v1    0.1 CLI TX|\t}
**** v1    0.1 CLI TX|
**** v1    0.1 CLI TX|%XJEIFLH|)Xspa8P
***  v1    0.1 CLI RX  106
**** v1    0.1 CLI RX|Message from VCC-compiler:
**** v1    0.1 CLI RX|Security: Privilege proc_setid missing, will not change uid/gid
**** v1    0.1 CLI RX|Name 'debug' already defined.
**** v1    0.1 CLI RX|('<vcl.inline>' Line 6 Pos 17)
**** v1    0.1 CLI RX|        backend debug {
**** v1    0.1 CLI RX|----------------#####--
**** v1    0.1 CLI RX|
**** v1    0.1 CLI RX|First definition:
**** v1    0.1 CLI RX|('<vcl.inline>' Line 4 Pos 9)
**** v1    0.1 CLI RX|        import debug;
**** v1    0.1 CLI RX|--------######-------
**** v1    0.1 CLI RX|
**** v1    0.1 CLI RX|Running VCC-compiler failed, exited with 2
**** v1    0.1 CLI RX|VCL compilation failed
**   v1    0.1 VCL compilation failed (as expected)
***  v1    0.1 Found expected string: ("Name 'debug' already defined.")
*    top   0.1 RESETTING after ../../../bin/varnishtest/tests/r01569.vtc
**   v1    0.1 Wait
**** v1    0.1 CLI TX|backend.list
***  v1    0.1 CLI RX  101
**** v1    0.1 CLI RX|Unknown request in manager process (child not running).
**** v1    0.1 CLI RX|Type 'help' for more info.
**   v1    0.1 Stop
**** v1    0.1 CLI TX|stop
***  v1    0.1 CLI RX  300
**** v1    0.1 CLI RX|Child in state stopped
**** v1    0.1 CLI TX|status
***  v1    0.1 CLI RX  200
**** v1    0.1 CLI RX|Child in state stopped
**** v1    0.1 STDOUT poll 0x10
**   v1    0.1 R 45887 Status: 0000 (u 0.007000 s 0.024000)
*    diag  0.0 ............................................................
#    top  TEST ../../../bin/varnishtest/tests/r01569.vtc TIMED OUT (kill -9)
#    top  TEST ../../../bin/varnishtest/tests/r01569.vtc FAILED (60.004) signal=9

1 @ SunOS 5.11 i86pc 1.04 64_gcc4.7 uplex

*    top   0.0 TEST ../../../bin/varnishtest/tests/r01569.vtc starting
[...]
*    top   0.0 TEST symbol lookup order issue
[...]
**** v1    0.1 CLI TX|\tsub vcl_recv {
**** v1    0.1 CLI TX|\t\tcall debug;
**** v1    0.1 CLI TX|\t}
**** v1    0.1 CLI TX|
**** v1    0.1 CLI TX|%XJEIFLH|)Xspa8P
***  v1    0.1 CLI RX  106
**** v1    0.1 CLI RX|Message from VCC-compiler:
**** v1    0.1 CLI RX|Security: Privilege proc_setid missing, will not change uid/gid
**** v1    0.1 CLI RX|Name 'debug' already defined.
**** v1    0.1 CLI RX|('<vcl.inline>' Line 6 Pos 17)
**** v1    0.1 CLI RX|        backend debug {
**** v1    0.1 CLI RX|----------------#####--
**** v1    0.1 CLI RX|
**** v1    0.1 CLI RX|First definition:
**** v1    0.1 CLI RX|('<vcl.inline>' Line 4 Pos 9)
**** v1    0.1 CLI RX|        import debug;
**** v1    0.1 CLI RX|--------######-------
**** v1    0.1 CLI RX|
**** v1    0.1 CLI RX|Running VCC-compiler failed, exited with 2
**** v1    0.1 CLI RX|VCL compilation failed
**   v1    0.1 VCL compilation failed (as expected)
***  v1    0.1 Found expected string: ("Name 'debug' already defined.")
*    top   0.1 RESETTING after ../../../bin/varnishtest/tests/r01569.vtc
**   v1    0.1 Wait
**** v1    0.1 CLI TX|backend.list
***  v1    0.1 CLI RX  101
**** v1    0.1 CLI RX|Unknown request in manager process (child not running).
**** v1    0.1 CLI RX|Type 'help' for more info.
**   v1    0.1 Stop
**** v1    0.1 CLI TX|stop
***  v1    0.1 CLI RX  300
**** v1    0.1 CLI RX|Child in state stopped
**** v1    0.1 CLI TX|status
***  v1    0.1 CLI RX  200
**** v1    0.1 CLI RX|Child in state stopped
**** v1    0.1 STDOUT poll 0x10
**   v1    0.1 R 32142 Status: 0000 (u 0.007000 s 0.023000)
*    diag  0.0 ............................................................
#    top  TEST ../../../bin/varnishtest/tests/r01569.vtc TIMED OUT (kill -9)
#    top  TEST ../../../bin/varnishtest/tests/r01569.vtc FAILED (60.004) signal=9

1 @ SunOS 5.11 i86pc 1.04 32_gcc4.7 uplex

*    top   0.0 TEST ../../../bin/varnishtest/tests/r01569.vtc starting
[...]
*    top   0.0 TEST symbol lookup order issue
[...]
**** v1    0.1 CLI TX|\tsub vcl_recv {
**** v1    0.1 CLI TX|\t\tcall debug;
**** v1    0.1 CLI TX|\t}
**** v1    0.1 CLI TX|
**** v1    0.1 CLI TX|%XJEIFLH|)Xspa8P
***  v1    0.1 CLI RX  106
**** v1    0.1 CLI RX|Message from VCC-compiler:
**** v1    0.1 CLI RX|Security: Privilege proc_setid missing, will not change uid/gid
**** v1    0.1 CLI RX|Name 'debug' already defined.
**** v1    0.1 CLI RX|('<vcl.inline>' Line 6 Pos 17)
**** v1    0.1 CLI RX|        backend debug {
**** v1    0.1 CLI RX|----------------#####--
**** v1    0.1 CLI RX|
**** v1    0.1 CLI RX|First definition:
**** v1    0.1 CLI RX|('<vcl.inline>' Line 4 Pos 9)
**** v1    0.1 CLI RX|        import debug;
**** v1    0.1 CLI RX|--------######-------
**** v1    0.1 CLI RX|
**** v1    0.1 CLI RX|Running VCC-compiler failed, exited with 2
**** v1    0.1 CLI RX|VCL compilation failed
**   v1    0.1 VCL compilation failed (as expected)
***  v1    0.1 Found expected string: ("Name 'debug' already defined.")
*    top   0.1 RESETTING after ../../../bin/varnishtest/tests/r01569.vtc
**   v1    0.1 Wait
**** v1    0.1 CLI TX|backend.list
***  v1    0.1 CLI RX  101
**** v1    0.1 CLI RX|Unknown request in manager process (child not running).
**** v1    0.1 CLI RX|Type 'help' for more info.
**   v1    0.1 Stop
**** v1    0.1 CLI TX|stop
***  v1    0.1 CLI RX  300
**** v1    0.1 CLI RX|Child in state stopped
**** v1    0.1 CLI TX|status
***  v1    0.1 CLI RX  200
**** v1    0.1 CLI RX|Child in state stopped
**** v1    0.1 STDOUT poll 0x10
**   v1    0.1 R 62018 Status: 0000 (u 0.004000 s 0.017000)
*    diag  0.0 ............................................................
#    top  TEST ../../../bin/varnishtest/tests/r01569.vtc TIMED OUT (kill -9)
#    top  TEST ../../../bin/varnishtest/tests/r01569.vtc FAILED (60.002) signal=9

1 @ SunOS 5.11 i86pc 1.04 64_sun12.4 uplex

*    top   0.0 TEST ../../../bin/varnishtest/tests/r01569.vtc starting
[...]
*    top   0.0 TEST symbol lookup order issue
[...]
**** v1    0.1 CLI TX|\tsub vcl_recv {
**** v1    0.1 CLI TX|\t\tcall debug;
**** v1    0.1 CLI TX|\t}
**** v1    0.1 CLI TX|
**** v1    0.1 CLI TX|%XJEIFLH|)Xspa8P
***  v1    0.2 CLI RX  106
**** v1    0.2 CLI RX|Message from VCC-compiler:
**** v1    0.2 CLI RX|Security: Privilege proc_setid missing, will not change uid/gid
**** v1    0.2 CLI RX|Name 'debug' already defined.
**** v1    0.2 CLI RX|('<vcl.inline>' Line 6 Pos 17)
**** v1    0.2 CLI RX|        backend debug {
**** v1    0.2 CLI RX|----------------#####--
**** v1    0.2 CLI RX|
**** v1    0.2 CLI RX|First definition:
**** v1    0.2 CLI RX|('<vcl.inline>' Line 4 Pos 9)
**** v1    0.2 CLI RX|        import debug;
**** v1    0.2 CLI RX|--------######-------
**** v1    0.2 CLI RX|
**** v1    0.2 CLI RX|Running VCC-compiler failed, exited with 2
**** v1    0.2 CLI RX|VCL compilation failed
**   v1    0.2 VCL compilation failed (as expected)
***  v1    0.2 Found expected string: ("Name 'debug' already defined.")
*    top   0.2 RESETTING after ../../../bin/varnishtest/tests/r01569.vtc
**   v1    0.2 Wait
**** v1    0.2 CLI TX|backend.list
***  v1    0.2 CLI RX  101
**** v1    0.2 CLI RX|Unknown request in manager process (child not running).
**** v1    0.2 CLI RX|Type 'help' for more info.
**   v1    0.2 Stop
**** v1    0.2 CLI TX|stop
***  v1    0.2 CLI RX  300
**** v1    0.2 CLI RX|Child in state stopped
**** v1    0.2 CLI TX|status
***  v1    0.2 CLI RX  200
**** v1    0.2 CLI RX|Child in state stopped
**** v1    0.2 STDOUT poll 0x10
**   v1    0.2 R 60376 Status: 0000 (u 0.010000 s 0.032000)
*    diag  0.0 ............................................................
#    top  TEST ../../../bin/varnishtest/tests/r01569.vtc TIMED OUT (kill -9)
#    top  TEST ../../../bin/varnishtest/tests/r01569.vtc FAILED (60.005) signal=9

1 @ SunOS 5.11 i86pc 1.04 32_gcc4.7 uplex

*    top   0.0 TEST ../../../bin/varnishtest/tests/r01569.vtc starting
[...]
*    top   0.0 TEST symbol lookup order issue
[...]
**** v1    0.1 CLI TX|\tsub vcl_recv {
**** v1    0.1 CLI TX|\t\tcall debug;
**** v1    0.1 CLI TX|\t}
**** v1    0.1 CLI TX|
**** v1    0.1 CLI TX|%XJEIFLH|)Xspa8P
***  v1    0.1 CLI RX  106
**** v1    0.1 CLI RX|Message from VCC-compiler:
**** v1    0.1 CLI RX|Security: Privilege proc_setid missing, will not change uid/gid
**** v1    0.1 CLI RX|Name 'debug' already defined.
**** v1    0.1 CLI RX|('<vcl.inline>' Line 6 Pos 17)
**** v1    0.1 CLI RX|        backend debug {
**** v1    0.1 CLI RX|----------------#####--
**** v1    0.1 CLI RX|
**** v1    0.1 CLI RX|First definition:
**** v1    0.1 CLI RX|('<vcl.inline>' Line 4 Pos 9)
**** v1    0.1 CLI RX|        import debug;
**** v1    0.1 CLI RX|--------######-------
**** v1    0.1 CLI RX|
**** v1    0.1 CLI RX|Running VCC-compiler failed, exited with 2
**** v1    0.1 CLI RX|VCL compilation failed
**   v1    0.1 VCL compilation failed (as expected)
***  v1    0.1 Found expected string: ("Name 'debug' already defined.")
*    top   0.1 RESETTING after ../../../bin/varnishtest/tests/r01569.vtc
**   v1    0.1 Wait
**** v1    0.1 CLI TX|backend.list
***  v1    0.1 CLI RX  101
**** v1    0.1 CLI RX|Unknown request in manager process (child not running).
**** v1    0.1 CLI RX|Type 'help' for more info.
**   v1    0.1 Stop
**** v1    0.1 CLI TX|stop
***  v1    0.1 CLI RX  300
**** v1    0.1 CLI RX|Child in state stopped
**** v1    0.1 CLI TX|status
***  v1    0.1 CLI RX  200
**** v1    0.1 CLI RX|Child in state stopped
**** v1    0.1 STDOUT poll 0x10
**   v1    0.1 R 15068 Status: 0000 (u 0.005000 s 0.018000)
*    diag  0.0 ............................................................
#    top  TEST ../../../bin/varnishtest/tests/r01569.vtc TIMED OUT (kill -9)
#    top  TEST ../../../bin/varnishtest/tests/r01569.vtc FAILED (60.001) signal=9

1 @ Linux 3.10.0 x86_64 1.02 mblissett

*    top   0.0 TEST ../../../bin/varnishtest/tests/r01569.vtc starting
[...]
*    top   0.0 TEST symbol lookup order issue
[...]
**** v1    0.1 CLI TX|
**** v1    0.1 CLI TX|\tsub vcl_recv {
**** v1    0.1 CLI TX|\t\tcall debug;
**** v1    0.1 CLI TX|\t}
**** v1    0.1 CLI TX|
**** v1    0.1 CLI TX|%XJEIFLH|)Xspa8P
***  v1    0.1 CLI RX  106
**** v1    0.1 CLI RX|Message from VCC-compiler:
**** v1    0.1 CLI RX|Name 'debug' already defined.
**** v1    0.1 CLI RX|('<vcl.inline>' Line 6 Pos 17)
**** v1    0.1 CLI RX|        backend debug {
**** v1    0.1 CLI RX|----------------#####--
**** v1    0.1 CLI RX|
**** v1    0.1 CLI RX|First definition:
**** v1    0.1 CLI RX|('<vcl.inline>' Line 4 Pos 9)
**** v1    0.1 CLI RX|        import debug;
**** v1    0.1 CLI RX|--------######-------
**** v1    0.1 CLI RX|
**** v1    0.1 CLI RX|Running VCC-compiler failed, exited with 2
**** v1    0.1 CLI RX|VCL compilation failed
**   v1    0.1 VCL compilation failed (as expected)
***  v1    0.1 Found expected string: ("Name 'debug' already defined.")
*    top   0.1 RESETTING after ../../../bin/varnishtest/tests/r01569.vtc
**   v1    0.1 Wait
**** v1    0.1 CLI TX|backend.list
***  v1    0.2 CLI RX  101
**** v1    0.2 CLI RX|Unknown request in manager process (child not running).
**** v1    0.2 CLI RX|Type 'help' for more info.
**   v1    0.2 Stop
**** v1    0.2 CLI TX|stop
***  v1    0.2 CLI RX  300
**** v1    0.2 CLI RX|Child in state stopped
**** v1    0.2 CLI TX|status
***  v1    0.2 CLI RX  200
**** v1    0.2 CLI RX|Child in state stopped
**** v1    0.2 STDOUT poll 0x10
**   v1    0.2 R 18913 Status: 0000 (u 0.003374 s 0.010497)
*    diag  0.0 ............................................................
#    top  TEST ../../../bin/varnishtest/tests/r01569.vtc TIMED OUT (kill -9)
#    top  TEST ../../../bin/varnishtest/tests/r01569.vtc FAILED (60.001) signal=9

1 @ Linux 3.10.0 x86_64 1.02 mblissett

*    top   0.0 TEST ../../../bin/varnishtest/tests/r01569.vtc starting
[...]
*    top   0.0 TEST symbol lookup order issue
[...]
**** v1    0.1 CLI TX|
**** v1    0.1 CLI TX|\tsub vcl_recv {
**** v1    0.1 CLI TX|\t\tcall debug;
**** v1    0.1 CLI TX|\t}
**** v1    0.1 CLI TX|
**** v1    0.1 CLI TX|%XJEIFLH|)Xspa8P
***  v1    0.1 CLI RX  106
**** v1    0.1 CLI RX|Message from VCC-compiler:
**** v1    0.1 CLI RX|Name 'debug' already defined.
**** v1    0.1 CLI RX|('<vcl.inline>' Line 6 Pos 17)
**** v1    0.1 CLI RX|        backend debug {
**** v1    0.1 CLI RX|----------------#####--
**** v1    0.1 CLI RX|
**** v1    0.1 CLI RX|First definition:
**** v1    0.1 CLI RX|('<vcl.inline>' Line 4 Pos 9)
**** v1    0.1 CLI RX|        import debug;
**** v1    0.1 CLI RX|--------######-------
**** v1    0.1 CLI RX|
**** v1    0.1 CLI RX|Running VCC-compiler failed, exited with 2
**** v1    0.1 CLI RX|VCL compilation failed
**   v1    0.1 VCL compilation failed (as expected)
***  v1    0.1 Found expected string: ("Name 'debug' already defined.")
*    top   0.1 RESETTING after ../../../bin/varnishtest/tests/r01569.vtc
**   v1    0.1 Wait
**** v1    0.1 CLI TX|backend.list
***  v1    0.2 CLI RX  101
**** v1    0.2 CLI RX|Unknown request in manager process (child not running).
**** v1    0.2 CLI RX|Type 'help' for more info.
**   v1    0.2 Stop
**** v1    0.2 CLI TX|stop
***  v1    0.2 CLI RX  300
**** v1    0.2 CLI RX|Child in state stopped
**** v1    0.2 CLI TX|status
***  v1    0.2 CLI RX  200
**** v1    0.2 CLI RX|Child in state stopped
**** v1    0.2 STDOUT poll 0x10
**   v1    0.2 R 29013 Status: 0000 (u 0.001185 s 0.010011)
*    diag  0.0 ............................................................
#    top  TEST ../../../bin/varnishtest/tests/r01569.vtc TIMED OUT (kill -9)
#    top  TEST ../../../bin/varnishtest/tests/r01569.vtc FAILED (60.001) signal=9

1 @ Ubuntu LTS i686 1.04 fgs

*    top   0.0 TEST ../../../bin/varnishtest/tests/r01569.vtc starting
[...]
*    top   0.0 TEST symbol lookup order issue
[...]
**** v1    0.1 CLI TX|
**** v1    0.1 CLI TX|\tsub vcl_recv {
**** v1    0.1 CLI TX|\t\tcall debug;
**** v1    0.1 CLI TX|\t}
**** v1    0.1 CLI TX|
**** v1    0.1 CLI TX|%XJEIFLH|)Xspa8P
***  v1    0.1 CLI RX  106
**** v1    0.1 CLI RX|Message from VCC-compiler:
**** v1    0.1 CLI RX|Name 'debug' already defined.
**** v1    0.1 CLI RX|('<vcl.inline>' Line 6 Pos 17)
**** v1    0.1 CLI RX|        backend debug {
**** v1    0.1 CLI RX|----------------#####--
**** v1    0.1 CLI RX|
**** v1    0.1 CLI RX|First definition:
**** v1    0.1 CLI RX|('<vcl.inline>' Line 4 Pos 9)
**** v1    0.1 CLI RX|        import debug;
**** v1    0.1 CLI RX|--------######-------
**** v1    0.1 CLI RX|
**** v1    0.1 CLI RX|Running VCC-compiler failed, exited with 2
**** v1    0.1 CLI RX|VCL compilation failed
**   v1    0.1 VCL compilation failed (as expected)
***  v1    0.1 Found expected string: ("Name 'debug' already defined.")
*    top   0.1 RESETTING after ../../../bin/varnishtest/tests/r01569.vtc
**   v1    0.1 Wait
**** v1    0.1 CLI TX|backend.list
***  v1    0.2 CLI RX  101
**** v1    0.2 CLI RX|Unknown request in manager process (child not running).
**** v1    0.2 CLI RX|Type 'help' for more info.
**   v1    0.2 Stop
**** v1    0.2 CLI TX|stop
***  v1    0.2 CLI RX  300
**** v1    0.2 CLI RX|Child in state stopped
**** v1    0.2 CLI TX|status
***  v1    0.2 CLI RX  200
**** v1    0.2 CLI RX|Child in state stopped
**** v1    0.2 STDOUT poll 0x10
**   v1    0.2 R 9993 Status: 0000 (u 0.004000 s 0.000000)
*    diag  0.0 ............................................................
#    top  TEST ../../../bin/varnishtest/tests/r01569.vtc TIMED OUT (kill -9)
#    top  TEST ../../../bin/varnishtest/tests/r01569.vtc FAILED (60.001) signal=9

1 @ SunOS 5.11 i86pc 1.04 32_sun12.4 uplex

*    top   0.0 TEST ../../../bin/varnishtest/tests/r01569.vtc starting
[...]
*    top   0.0 TEST symbol lookup order issue
[...]
**** v1    0.1 CLI TX|\tsub vcl_recv {
**** v1    0.1 CLI TX|\t\tcall debug;
**** v1    0.1 CLI TX|\t}
**** v1    0.1 CLI TX|
**** v1    0.1 CLI TX|%XJEIFLH|)Xspa8P
***  v1    0.1 CLI RX  106
**** v1    0.1 CLI RX|Message from VCC-compiler:
**** v1    0.1 CLI RX|Security: Privilege proc_setid missing, will not change uid/gid
**** v1    0.1 CLI RX|Name 'debug' already defined.
**** v1    0.1 CLI RX|('<vcl.inline>' Line 6 Pos 17)
**** v1    0.1 CLI RX|        backend debug {
**** v1    0.1 CLI RX|----------------#####--
**** v1    0.1 CLI RX|
**** v1    0.1 CLI RX|First definition:
**** v1    0.1 CLI RX|('<vcl.inline>' Line 4 Pos 9)
**** v1    0.1 CLI RX|        import debug;
**** v1    0.1 CLI RX|--------######-------
**** v1    0.1 CLI RX|
**** v1    0.1 CLI RX|Running VCC-compiler failed, exited with 2
**** v1    0.1 CLI RX|VCL compilation failed
**   v1    0.1 VCL compilation failed (as expected)
***  v1    0.1 Found expected string: ("Name 'debug' already defined.")
*    top   0.1 RESETTING after ../../../bin/varnishtest/tests/r01569.vtc
**   v1    0.1 Wait
**** v1    0.1 CLI TX|backend.list
***  v1    0.1 CLI RX  101
**** v1    0.1 CLI RX|Unknown request in manager process (child not running).
**** v1    0.1 CLI RX|Type 'help' for more info.
**   v1    0.1 Stop
**** v1    0.1 CLI TX|stop
***  v1    0.1 CLI RX  300
**** v1    0.1 CLI RX|Child in state stopped
**** v1    0.1 CLI TX|status
***  v1    0.1 CLI RX  200
**** v1    0.1 CLI RX|Child in state stopped
**** v1    0.1 STDOUT poll 0x10
**   v1    0.1 R 22300 Status: 0000 (u 0.005000 s 0.017000)
*    diag  0.0 ............................................................
#    top  TEST ../../../bin/varnishtest/tests/r01569.vtc TIMED OUT (kill -9)
#    top  TEST ../../../bin/varnishtest/tests/r01569.vtc FAILED (60.002) signal=9

1 @ SunOS 5.11 i86pc 1.04 64_gcc4.7 uplex

*    top   0.0 TEST ../../../bin/varnishtest/tests/r01569.vtc starting
[...]
*    top   0.0 TEST symbol lookup order issue
[...]
**** v1    0.1 CLI TX|\tsub vcl_recv {
**** v1    0.1 CLI TX|\t\tcall debug;
**** v1    0.1 CLI TX|\t}
**** v1    0.1 CLI TX|
**** v1    0.1 CLI TX|%XJEIFLH|)Xspa8P
***  v1    0.1 CLI RX  106
**** v1    0.1 CLI RX|Message from VCC-compiler:
**** v1    0.1 CLI RX|Security: Privilege proc_setid missing, will not change uid/gid
**** v1    0.1 CLI RX|Name 'debug' already defined.
**** v1    0.1 CLI RX|('<vcl.inline>' Line 6 Pos 17)
**** v1    0.1 CLI RX|        backend debug {
**** v1    0.1 CLI RX|----------------#####--
**** v1    0.1 CLI RX|
**** v1    0.1 CLI RX|First definition:
**** v1    0.1 CLI RX|('<vcl.inline>' Line 4 Pos 9)
**** v1    0.1 CLI RX|        import debug;
**** v1    0.1 CLI RX|--------######-------
**** v1    0.1 CLI RX|
**** v1    0.1 CLI RX|Running VCC-compiler failed, exited with 2
**** v1    0.1 CLI RX|VCL compilation failed
**   v1    0.1 VCL compilation failed (as expected)
***  v1    0.1 Found expected string: ("Name 'debug' already defined.")
*    top   0.1 RESETTING after ../../../bin/varnishtest/tests/r01569.vtc
**   v1    0.1 Wait
**** v1    0.1 CLI TX|backend.list
***  v1    0.1 CLI RX  101
**** v1    0.1 CLI RX|Unknown request in manager process (child not running).
**** v1    0.1 CLI RX|Type 'help' for more info.
**   v1    0.1 Stop
**** v1    0.1 CLI TX|stop
***  v1    0.1 CLI RX  300
**** v1    0.1 CLI RX|Child in state stopped
**** v1    0.1 CLI TX|status
***  v1    0.1 CLI RX  200
**** v1    0.1 CLI RX|Child in state stopped
**** v1    0.1 STDOUT poll 0x10
**   v1    0.1 R 53852 Status: 0000 (u 0.007000 s 0.023000)
*    diag  0.0 ............................................................
#    top  TEST ../../../bin/varnishtest/tests/r01569.vtc TIMED OUT (kill -9)
#    top  TEST ../../../bin/varnishtest/tests/r01569.vtc FAILED (60.004) signal=9

1 @ Ubuntu LTS i686 1.04 fgs

*    top   0.0 TEST ../../../bin/varnishtest/tests/r01569.vtc starting
[...]
*    top   0.0 TEST symbol lookup order issue
[...]
**** v1    0.1 CLI TX|
**** v1    0.1 CLI TX|\tsub vcl_recv {
**** v1    0.1 CLI TX|\t\tcall debug;
**** v1    0.1 CLI TX|\t}
**** v1    0.1 CLI TX|
**** v1    0.1 CLI TX|%XJEIFLH|)Xspa8P
***  v1    0.1 CLI RX  106
**** v1    0.1 CLI RX|Message from VCC-compiler:
**** v1    0.1 CLI RX|Name 'debug' already defined.
**** v1    0.1 CLI RX|('<vcl.inline>' Line 6 Pos 17)
**** v1    0.1 CLI RX|        backend debug {
**** v1    0.1 CLI RX|----------------#####--
**** v1    0.1 CLI RX|
**** v1    0.1 CLI RX|First definition:
**** v1    0.1 CLI RX|('<vcl.inline>' Line 4 Pos 9)
**** v1    0.1 CLI RX|        import debug;
**** v1    0.1 CLI RX|--------######-------
**** v1    0.1 CLI RX|
**** v1    0.1 CLI RX|Running VCC-compiler failed, exited with 2
**** v1    0.1 CLI RX|VCL compilation failed
**   v1    0.1 VCL compilation failed (as expected)
***  v1    0.1 Found expected string: ("Name 'debug' already defined.")
*    top   0.1 RESETTING after ../../../bin/varnishtest/tests/r01569.vtc
**   v1    0.1 Wait
**** v1    0.1 CLI TX|backend.list
***  v1    0.2 CLI RX  101
**** v1    0.2 CLI RX|Unknown request in manager process (child not running).
**** v1    0.2 CLI RX|Type 'help' for more info.
**   v1    0.2 Stop
**** v1    0.2 CLI TX|stop
***  v1    0.2 CLI RX  300
**** v1    0.2 CLI RX|Child in state stopped
**** v1    0.2 CLI TX|status
***  v1    0.2 CLI RX  200
**** v1    0.2 CLI RX|Child in state stopped
**** v1    0.2 STDOUT poll 0x10
**   v1    0.2 R 18114 Status: 0000 (u 0.004000 s 0.000000)
*    diag  0.0 ............................................................
#    top  TEST ../../../bin/varnishtest/tests/r01569.vtc TIMED OUT (kill -9)
#    top  TEST ../../../bin/varnishtest/tests/r01569.vtc FAILED (60.001) signal=9

1 @ SunOS 5.11 i86pc 1.04 64_sun12.4 uplex

*    top   0.0 TEST ../../../bin/varnishtest/tests/r01569.vtc starting
[...]
*    top   0.0 TEST symbol lookup order issue
[...]
**** v1    0.1 CLI TX|\tsub vcl_recv {
**** v1    0.1 CLI TX|\t\tcall debug;
**** v1    0.1 CLI TX|\t}
**** v1    0.1 CLI TX|
**** v1    0.1 CLI TX|%XJEIFLH|)Xspa8P
***  v1    0.1 CLI RX  106
**** v1    0.1 CLI RX|Message from VCC-compiler:
**** v1    0.1 CLI RX|Security: Privilege proc_setid missing, will not change uid/gid
**** v1    0.1 CLI RX|Name 'debug' already defined.
**** v1    0.1 CLI RX|('<vcl.inline>' Line 6 Pos 17)
**** v1    0.1 CLI RX|        backend debug {
**** v1    0.1 CLI RX|----------------#####--
**** v1    0.1 CLI RX|
**** v1    0.1 CLI RX|First definition:
**** v1    0.1 CLI RX|('<vcl.inline>' Line 4 Pos 9)
**** v1    0.1 CLI RX|        import debug;
**** v1    0.1 CLI RX|--------######-------
**** v1    0.1 CLI RX|
**** v1    0.1 CLI RX|Running VCC-compiler failed, exited with 2
**** v1    0.1 CLI RX|VCL compilation failed
**   v1    0.1 VCL compilation failed (as expected)
***  v1    0.1 Found expected string: ("Name 'debug' already defined.")
*    top   0.1 RESETTING after ../../../bin/varnishtest/tests/r01569.vtc
**   v1    0.1 Wait
**** v1    0.1 CLI TX|backend.list
***  v1    0.1 CLI RX  101
**** v1    0.1 CLI RX|Unknown request in manager process (child not running).
**** v1    0.1 CLI RX|Type 'help' for more info.
**   v1    0.1 Stop
**** v1    0.1 CLI TX|stop
***  v1    0.1 CLI RX  300
**** v1    0.1 CLI RX|Child in state stopped
**** v1    0.1 CLI TX|status
***  v1    0.1 CLI RX  200
**** v1    0.1 CLI RX|Child in state stopped
**** v1    0.1 STDOUT poll 0x10
**   v1    0.1 R 16862 Status: 0000 (u 0.007000 s 0.023000)
*    diag  0.0 ............................................................
#    top  TEST ../../../bin/varnishtest/tests/r01569.vtc TIMED OUT (kill -9)
#    top  TEST ../../../bin/varnishtest/tests/r01569.vtc FAILED (60.004) signal=9

1 @ SunOS 5.11 i86pc 1.04 64_sun12.4 uplex

*    top   0.0 TEST ../../../bin/varnishtest/tests/r01569.vtc starting
[...]
*    top   0.0 TEST symbol lookup order issue
[...]
**** v1    0.2 CLI TX|\tsub vcl_recv {
**** v1    0.2 CLI TX|\t\tcall debug;
**** v1    0.2 CLI TX|\t}
**** v1    0.2 CLI TX|
**** v1    0.2 CLI TX|%XJEIFLH|)Xspa8P
***  v1    0.2 CLI RX  106
**** v1    0.2 CLI RX|Message from VCC-compiler:
**** v1    0.2 CLI RX|Security: Privilege proc_setid missing, will not change uid/gid
**** v1    0.2 CLI RX|Name 'debug' already defined.
**** v1    0.2 CLI RX|('<vcl.inline>' Line 6 Pos 17)
**** v1    0.2 CLI RX|        backend debug {
**** v1    0.2 CLI RX|----------------#####--
**** v1    0.2 CLI RX|
**** v1    0.2 CLI RX|First definition:
**** v1    0.2 CLI RX|('<vcl.inline>' Line 4 Pos 9)
**** v1    0.2 CLI RX|        import debug;
**** v1    0.2 CLI RX|--------######-------
**** v1    0.2 CLI RX|
**** v1    0.2 CLI RX|Running VCC-compiler failed, exited with 2
**** v1    0.2 CLI RX|VCL compilation failed
**   v1    0.2 VCL compilation failed (as expected)
***  v1    0.2 Found expected string: ("Name 'debug' already defined.")
*    top   0.2 RESETTING after ../../../bin/varnishtest/tests/r01569.vtc
**   v1    0.2 Wait
**** v1    0.2 CLI TX|backend.list
***  v1    0.2 CLI RX  101
**** v1    0.2 CLI RX|Unknown request in manager process (child not running).
**** v1    0.2 CLI RX|Type 'help' for more info.
**   v1    0.2 Stop
**** v1    0.2 CLI TX|stop
***  v1    0.2 CLI RX  300
**** v1    0.2 CLI RX|Child in state stopped
**** v1    0.2 CLI TX|status
***  v1    0.2 CLI RX  200
**** v1    0.2 CLI RX|Child in state stopped
**** v1    0.2 STDOUT poll 0x10
**   v1    0.2 R 85246 Status: 0000 (u 0.011000 s 0.065000)
*    diag  0.0 ............................................................
#    top  TEST ../../../bin/varnishtest/tests/r01569.vtc TIMED OUT (kill -9)
#    top  TEST ../../../bin/varnishtest/tests/r01569.vtc FAILED (60.005) signal=9

1 @ SunOS 5.11 i86pc 1.04 32_sun12.4 uplex

*    top   0.0 TEST ../../../bin/varnishtest/tests/r01569.vtc starting
[...]
*    top   0.0 TEST symbol lookup order issue
[...]
**** v1    0.1 CLI TX|\tsub vcl_recv {
**** v1    0.1 CLI TX|\t\tcall debug;
**** v1    0.1 CLI TX|\t}
**** v1    0.1 CLI TX|
**** v1    0.1 CLI TX|%XJEIFLH|)Xspa8P
***  v1    0.1 CLI RX  106
**** v1    0.1 CLI RX|Message from VCC-compiler:
**** v1    0.1 CLI RX|Security: Privilege proc_setid missing, will not change uid/gid
**** v1    0.1 CLI RX|Name 'debug' already defined.
**** v1    0.1 CLI RX|('<vcl.inline>' Line 6 Pos 17)
**** v1    0.1 CLI RX|        backend debug {
**** v1    0.1 CLI RX|----------------#####--
**** v1    0.1 CLI RX|
**** v1    0.1 CLI RX|First definition:
**** v1    0.1 CLI RX|('<vcl.inline>' Line 4 Pos 9)
**** v1    0.1 CLI RX|        import debug;
**** v1    0.1 CLI RX|--------######-------
**** v1    0.1 CLI RX|
**** v1    0.1 CLI RX|Running VCC-compiler failed, exited with 2
**** v1    0.1 CLI RX|VCL compilation failed
**   v1    0.1 VCL compilation failed (as expected)
***  v1    0.1 Found expected string: ("Name 'debug' already defined.")
*    top   0.1 RESETTING after ../../../bin/varnishtest/tests/r01569.vtc
**   v1    0.1 Wait
**** v1    0.1 CLI TX|backend.list
***  v1    0.1 CLI RX  101
**** v1    0.1 CLI RX|Unknown request in manager process (child not running).
**** v1    0.1 CLI RX|Type 'help' for more info.
**   v1    0.1 Stop
**** v1    0.1 CLI TX|stop
***  v1    0.1 CLI RX  300
**** v1    0.1 CLI RX|Child in state stopped
**** v1    0.1 CLI TX|status
***  v1    0.1 CLI RX  200
**** v1    0.1 CLI RX|Child in state stopped
**** v1    0.1 STDOUT poll 0x10
**   v1    0.1 R 75740 Status: 0000 (u 0.005000 s 0.017000)
*    diag  0.0 ............................................................
#    top  TEST ../../../bin/varnishtest/tests/r01569.vtc TIMED OUT (kill -9)
#    top  TEST ../../../bin/varnishtest/tests/r01569.vtc FAILED (60.002) signal=9

1 @ SunOS 5.11 i86pc 1.04 64_sun12.4 uplex

*    top   0.0 TEST ../../../bin/varnishtest/tests/r01569.vtc starting
[...]
*    top   0.0 TEST symbol lookup order issue
[...]
**** v1    0.1 CLI TX|\tsub vcl_recv {
**** v1    0.1 CLI TX|\t\tcall debug;
**** v1    0.1 CLI TX|\t}
**** v1    0.1 CLI TX|
**** v1    0.1 CLI TX|%XJEIFLH|)Xspa8P
***  v1    0.1 CLI RX  106
**** v1    0.1 CLI RX|Message from VCC-compiler:
**** v1    0.1 CLI RX|Security: Privilege proc_setid missing, will not change uid/gid
**** v1    0.1 CLI RX|Name 'debug' already defined.
**** v1    0.1 CLI RX|('<vcl.inline>' Line 6 Pos 17)
**** v1    0.1 CLI RX|        backend debug {
**** v1    0.1 CLI RX|----------------#####--
**** v1    0.1 CLI RX|
**** v1    0.1 CLI RX|First definition:
**** v1    0.1 CLI RX|('<vcl.inline>' Line 4 Pos 9)
**** v1    0.1 CLI RX|        import debug;
**** v1    0.1 CLI RX|--------######-------
**** v1    0.1 CLI RX|
**** v1    0.1 CLI RX|Running VCC-compiler failed, exited with 2
**** v1    0.1 CLI RX|VCL compilation failed
**   v1    0.1 VCL compilation failed (as expected)
***  v1    0.1 Found expected string: ("Name 'debug' already defined.")
*    top   0.1 RESETTING after ../../../bin/varnishtest/tests/r01569.vtc
**   v1    0.1 Wait
**** v1    0.1 CLI TX|backend.list
***  v1    0.1 CLI RX  101
**** v1    0.1 CLI RX|Unknown request in manager process (child not running).
**** v1    0.1 CLI RX|Type 'help' for more info.
**   v1    0.1 Stop
**** v1    0.1 CLI TX|stop
***  v1    0.1 CLI RX  300
**** v1    0.1 CLI RX|Child in state stopped
**** v1    0.1 CLI TX|status
***  v1    0.1 CLI RX  200
**** v1    0.1 CLI RX|Child in state stopped
**** v1    0.1 STDOUT poll 0x10
**   v1    0.1 R 79508 Status: 0000 (u 0.007000 s 0.023000)
*    diag  0.0 ............................................................
#    top  TEST ../../../bin/varnishtest/tests/r01569.vtc TIMED OUT (kill -9)
#    top  TEST ../../../bin/varnishtest/tests/r01569.vtc FAILED (60.004) signal=9

1 @ SunOS 5.11 i86pc 1.04 64_sun12.4 uplex

*    top   0.0 TEST ../../../bin/varnishtest/tests/r01569.vtc starting
[...]
*    top   0.0 TEST symbol lookup order issue
[...]
**** v1    0.1 CLI TX|\tsub vcl_recv {
**** v1    0.1 CLI TX|\t\tcall debug;
**** v1    0.1 CLI TX|\t}
**** v1    0.1 CLI TX|
**** v1    0.1 CLI TX|%XJEIFLH|)Xspa8P
***  v1    0.1 CLI RX  106
**** v1    0.1 CLI RX|Message from VCC-compiler:
**** v1    0.1 CLI RX|Security: Privilege proc_setid missing, will not change uid/gid
**** v1    0.1 CLI RX|Name 'debug' already defined.
**** v1    0.1 CLI RX|('<vcl.inline>' Line 6 Pos 17)
**** v1    0.1 CLI RX|        backend debug {
**** v1    0.1 CLI RX|----------------#####--
**** v1    0.1 CLI RX|
**** v1    0.1 CLI RX|First definition:
**** v1    0.1 CLI RX|('<vcl.inline>' Line 4 Pos 9)
**** v1    0.1 CLI RX|        import debug;
**** v1    0.1 CLI RX|--------######-------
**** v1    0.1 CLI RX|
**** v1    0.1 CLI RX|Running VCC-compiler failed, exited with 2
**** v1    0.1 CLI RX|VCL compilation failed
**   v1    0.1 VCL compilation failed (as expected)
***  v1    0.1 Found expected string: ("Name 'debug' already defined.")
*    top   0.1 RESETTING after ../../../bin/varnishtest/tests/r01569.vtc
**   v1    0.1 Wait
**** v1    0.1 CLI TX|backend.list
***  v1    0.1 CLI RX  101
**** v1    0.1 CLI RX|Unknown request in manager process (child not running).
**** v1    0.1 CLI RX|Type 'help' for more info.
**   v1    0.1 Stop
**** v1    0.1 CLI TX|stop
***  v1    0.1 CLI RX  300
**** v1    0.1 CLI RX|Child in state stopped
**** v1    0.1 CLI TX|status
***  v1    0.1 CLI RX  200
**** v1    0.1 CLI RX|Child in state stopped
**** v1    0.1 STDOUT poll 0x10
**   v1    0.1 R 8765 Status: 0000 (u 0.007000 s 0.022000)
*    diag  0.0 ............................................................
#    top  TEST ../../../bin/varnishtest/tests/r01569.vtc TIMED OUT (kill -9)
#    top  TEST ../../../bin/varnishtest/tests/r01569.vtc FAILED (60.004) signal=9

1 @ SunOS 5.11 i86pc 1.04 32_gcc4.7 uplex

*    top   0.0 TEST ../../../bin/varnishtest/tests/r01569.vtc starting
[...]
*    top   0.0 TEST symbol lookup order issue
[...]
**** v1    0.1 CLI TX|\tsub vcl_recv {
**** v1    0.1 CLI TX|\t\tcall debug;
**** v1    0.1 CLI TX|\t}
**** v1    0.1 CLI TX|
**** v1    0.1 CLI TX|%XJEIFLH|)Xspa8P
***  v1    0.1 CLI RX  106
**** v1    0.1 CLI RX|Message from VCC-compiler:
**** v1    0.1 CLI RX|Security: Privilege proc_setid missing, will not change uid/gid
**** v1    0.1 CLI RX|Name 'debug' already defined.
**** v1    0.1 CLI RX|('<vcl.inline>' Line 6 Pos 17)
**** v1    0.1 CLI RX|        backend debug {
**** v1    0.1 CLI RX|----------------#####--
**** v1    0.1 CLI RX|
**** v1    0.1 CLI RX|First definition:
**** v1    0.1 CLI RX|('<vcl.inline>' Line 4 Pos 9)
**** v1    0.1 CLI RX|        import debug;
**** v1    0.1 CLI RX|--------######-------
**** v1    0.1 CLI RX|
**** v1    0.1 CLI RX|Running VCC-compiler failed, exited with 2
**** v1    0.1 CLI RX|VCL compilation failed
**   v1    0.1 VCL compilation failed (as expected)
***  v1    0.1 Found expected string: ("Name 'debug' already defined.")
*    top   0.1 RESETTING after ../../../bin/varnishtest/tests/r01569.vtc
**   v1    0.1 Wait
**** v1    0.1 CLI TX|backend.list
***  v1    0.1 CLI RX  101
**** v1    0.1 CLI RX|Unknown request in manager process (child not running).
**** v1    0.1 CLI RX|Type 'help' for more info.
**   v1    0.1 Stop
**** v1    0.1 CLI TX|stop
***  v1    0.1 CLI RX  300
**** v1    0.1 CLI RX|Child in state stopped
**** v1    0.1 CLI TX|status
***  v1    0.1 CLI RX  200
**** v1    0.1 CLI RX|Child in state stopped
**** v1    0.1 STDOUT poll 0x10
**   v1    0.1 R 23139 Status: 0000 (u 0.005000 s 0.017000)
*    diag  0.0 ............................................................
#    top  TEST ../../../bin/varnishtest/tests/r01569.vtc TIMED OUT (kill -9)
#    top  TEST ../../../bin/varnishtest/tests/r01569.vtc FAILED (60.004) signal=9

1 @ SunOS 5.11 i86pc 1.04 32_sun12.4 uplex

*    top   0.0 TEST ../../../bin/varnishtest/tests/r01569.vtc starting
[...]
*    top   0.0 TEST symbol lookup order issue
[...]
**** v1    0.1 CLI TX|\tsub vcl_recv {
**** v1    0.1 CLI TX|\t\tcall debug;
**** v1    0.1 CLI TX|\t}
**** v1    0.1 CLI TX|
**** v1    0.1 CLI TX|%XJEIFLH|)Xspa8P
***  v1    0.1 CLI RX  106
**** v1    0.1 CLI RX|Message from VCC-compiler:
**** v1    0.1 CLI RX|Security: Privilege proc_setid missing, will not change uid/gid
**** v1    0.1 CLI RX|Name 'debug' already defined.
**** v1    0.1 CLI RX|('<vcl.inline>' Line 6 Pos 17)
**** v1    0.1 CLI RX|        backend debug {
**** v1    0.1 CLI RX|----------------#####--
**** v1    0.1 CLI RX|
**** v1    0.1 CLI RX|First definition:
**** v1    0.1 CLI RX|('<vcl.inline>' Line 4 Pos 9)
**** v1    0.1 CLI RX|        import debug;
**** v1    0.1 CLI RX|--------######-------
**** v1    0.1 CLI RX|
**** v1    0.1 CLI RX|Running VCC-compiler failed, exited with 2
**** v1    0.1 CLI RX|VCL compilation failed
**   v1    0.1 VCL compilation failed (as expected)
***  v1    0.1 Found expected string: ("Name 'debug' already defined.")
*    top   0.1 RESETTING after ../../../bin/varnishtest/tests/r01569.vtc
**   v1    0.1 Wait
**** v1    0.1 CLI TX|backend.list
***  v1    0.1 CLI RX  101
**** v1    0.1 CLI RX|Unknown request in manager process (child not running).
**** v1    0.1 CLI RX|Type 'help' for more info.
**   v1    0.1 Stop
**** v1    0.1 CLI TX|stop
***  v1    0.1 CLI RX  300
**** v1    0.1 CLI RX|Child in state stopped
**** v1    0.1 CLI TX|status
***  v1    0.1 CLI RX  200
**** v1    0.1 CLI RX|Child in state stopped
**** v1    0.1 STDOUT poll 0x10
**   v1    0.1 R 35528 Status: 0000 (u 0.005000 s 0.016000)
*    diag  0.0 ............................................................
#    top  TEST ../../../bin/varnishtest/tests/r01569.vtc TIMED OUT (kill -9)
#    top  TEST ../../../bin/varnishtest/tests/r01569.vtc FAILED (60.003) signal=9

1 @ SunOS 5.11 i86pc 1.04 32_gcc4.7 uplex

*    top   0.0 TEST ../../../bin/varnishtest/tests/r01569.vtc starting
[...]
*    top   0.0 TEST symbol lookup order issue
[...]
**** v1    0.1 CLI TX|\tsub vcl_recv {
**** v1    0.1 CLI TX|\t\tcall debug;
**** v1    0.1 CLI TX|\t}
**** v1    0.1 CLI TX|
**** v1    0.1 CLI TX|%XJEIFLH|)Xspa8P
***  v1    0.1 CLI RX  106
**** v1    0.1 CLI RX|Message from VCC-compiler:
**** v1    0.1 CLI RX|Security: Privilege proc_setid missing, will not change uid/gid
**** v1    0.1 CLI RX|Name 'debug' already defined.
**** v1    0.1 CLI RX|('<vcl.inline>' Line 6 Pos 17)
**** v1    0.1 CLI RX|        backend debug {
**** v1    0.1 CLI RX|----------------#####--
**** v1    0.1 CLI RX|
**** v1    0.1 CLI RX|First definition:
**** v1    0.1 CLI RX|('<vcl.inline>' Line 4 Pos 9)
**** v1    0.1 CLI RX|        import debug;
**** v1    0.1 CLI RX|--------######-------
**** v1    0.1 CLI RX|
**** v1    0.1 CLI RX|Running VCC-compiler failed, exited with 2
**** v1    0.1 CLI RX|VCL compilation failed
**   v1    0.1 VCL compilation failed (as expected)
***  v1    0.1 Found expected string: ("Name 'debug' already defined.")
*    top   0.1 RESETTING after ../../../bin/varnishtest/tests/r01569.vtc
**   v1    0.1 Wait
**** v1    0.1 CLI TX|backend.list
***  v1    0.1 CLI RX  101
**** v1    0.1 CLI RX|Unknown request in manager process (child not running).
**** v1    0.1 CLI RX|Type 'help' for more info.
**   v1    0.1 Stop
**** v1    0.1 CLI TX|stop
***  v1    0.1 CLI RX  300
**** v1    0.1 CLI RX|Child in state stopped
**** v1    0.1 CLI TX|status
***  v1    0.1 CLI RX  200
**** v1    0.1 CLI RX|Child in state stopped
**** v1    0.1 STDOUT poll 0x10
**   v1    0.1 R 79881 Status: 0000 (u 0.005000 s 0.019000)
*    diag  0.0 ............................................................
#    top  TEST ../../../bin/varnishtest/tests/r01569.vtc TIMED OUT (kill -9)
#    top  TEST ../../../bin/varnishtest/tests/r01569.vtc FAILED (60.002) signal=9

1 @ SunOS 5.11 i86pc 1.04 32_sun12.4 uplex

*    top   0.0 TEST ../../../bin/varnishtest/tests/r01569.vtc starting
[...]
*    top   0.0 TEST symbol lookup order issue
[...]
**** v1    0.1 CLI TX|\tsub vcl_recv {
**** v1    0.1 CLI TX|\t\tcall debug;
**** v1    0.1 CLI TX|\t}
**** v1    0.1 CLI TX|
**** v1    0.1 CLI TX|%XJEIFLH|)Xspa8P
***  v1    0.1 CLI RX  106
**** v1    0.1 CLI RX|Message from VCC-compiler:
**** v1    0.1 CLI RX|Security: Privilege proc_setid missing, will not change uid/gid
**** v1    0.1 CLI RX|Name 'debug' already defined.
**** v1    0.1 CLI RX|('<vcl.inline>' Line 6 Pos 17)
**** v1    0.1 CLI RX|        backend debug {
**** v1    0.1 CLI RX|----------------#####--
**** v1    0.1 CLI RX|
**** v1    0.1 CLI RX|First definition:
**** v1    0.1 CLI RX|('<vcl.inline>' Line 4 Pos 9)
**** v1    0.1 CLI RX|        import debug;
**** v1    0.1 CLI RX|--------######-------
**** v1    0.1 CLI RX|
**** v1    0.1 CLI RX|Running VCC-compiler failed, exited with 2
**** v1    0.1 CLI RX|VCL compilation failed
**   v1    0.1 VCL compilation failed (as expected)
***  v1    0.1 Found expected string: ("Name 'debug' already defined.")
*    top   0.1 RESETTING after ../../../bin/varnishtest/tests/r01569.vtc
**   v1    0.1 Wait
**** v1    0.1 CLI TX|backend.list
***  v1    0.1 CLI RX  101
**** v1    0.1 CLI RX|Unknown request in manager process (child not running).
**** v1    0.1 CLI RX|Type 'help' for more info.
**   v1    0.1 Stop
**** v1    0.1 CLI TX|stop
***  v1    0.1 CLI RX  300
**** v1    0.1 CLI RX|Child in state stopped
**** v1    0.1 CLI TX|status
***  v1    0.1 CLI RX  200
**** v1    0.1 CLI RX|Child in state stopped
**** v1    0.1 STDOUT poll 0x10
**   v1    0.1 R 16736 Status: 0000 (u 0.005000 s 0.018000)
*    diag  0.0 ............................................................
#    top  TEST ../../../bin/varnishtest/tests/r01569.vtc TIMED OUT (kill -9)
#    top  TEST ../../../bin/varnishtest/tests/r01569.vtc FAILED (60.001) signal=9

1 @ Ubuntu LTS i686 1.04 fgs

*    top   0.0 TEST ../../../bin/varnishtest/tests/r01569.vtc starting
[...]
*    top   0.0 TEST symbol lookup order issue
[...]
**** v1    0.1 CLI TX|
**** v1    0.1 CLI TX|\tsub vcl_recv {
**** v1    0.1 CLI TX|\t\tcall debug;
**** v1    0.1 CLI TX|\t}
**** v1    0.1 CLI TX|
**** v1    0.1 CLI TX|%XJEIFLH|)Xspa8P
***  v1    0.1 CLI RX  106
**** v1    0.1 CLI RX|Message from VCC-compiler:
**** v1    0.1 CLI RX|Name 'debug' already defined.
**** v1    0.1 CLI RX|('<vcl.inline>' Line 6 Pos 17)
**** v1    0.1 CLI RX|        backend debug {
**** v1    0.1 CLI RX|----------------#####--
**** v1    0.1 CLI RX|
**** v1    0.1 CLI RX|First definition:
**** v1    0.1 CLI RX|('<vcl.inline>' Line 4 Pos 9)
**** v1    0.1 CLI RX|        import debug;
**** v1    0.1 CLI RX|--------######-------
**** v1    0.1 CLI RX|
**** v1    0.1 CLI RX|Running VCC-compiler failed, exited with 2
**** v1    0.1 CLI RX|VCL compilation failed
**   v1    0.1 VCL compilation failed (as expected)
***  v1    0.1 Found expected string: ("Name 'debug' already defined.")
*    top   0.1 RESETTING after ../../../bin/varnishtest/tests/r01569.vtc
**   v1    0.1 Wait
**** v1    0.1 CLI TX|backend.list
***  v1    0.2 CLI RX  101
**** v1    0.2 CLI RX|Unknown request in manager process (child not running).
**** v1    0.2 CLI RX|Type 'help' for more info.
**   v1    0.2 Stop
**** v1    0.2 CLI TX|stop
***  v1    0.2 CLI RX  300
**** v1    0.2 CLI RX|Child in state stopped
**** v1    0.2 CLI TX|status
***  v1    0.2 CLI RX  200
**** v1    0.2 CLI RX|Child in state stopped
**** v1    0.2 STDOUT poll 0x10
**   v1    0.2 R 21128 Status: 0000 (u 0.000000 s 0.004000)
*    diag  0.0 ............................................................
#    top  TEST ../../../bin/varnishtest/tests/r01569.vtc TIMED OUT (kill -9)
#    top  TEST ../../../bin/varnishtest/tests/r01569.vtc FAILED (60.001) signal=9

1 @ Ubuntu LTS i686 1.04 fgs

*    top   0.0 TEST ../../../bin/varnishtest/tests/r01569.vtc starting
[...]
*    top   0.0 TEST symbol lookup order issue
[...]
**** v1    0.1 CLI TX|
**** v1    0.1 CLI TX|\tsub vcl_recv {
**** v1    0.1 CLI TX|\t\tcall debug;
**** v1    0.1 CLI TX|\t}
**** v1    0.1 CLI TX|
**** v1    0.1 CLI TX|%XJEIFLH|)Xspa8P
***  v1    0.1 CLI RX  106
**** v1    0.1 CLI RX|Message from VCC-compiler:
**** v1    0.1 CLI RX|Name 'debug' already defined.
**** v1    0.1 CLI RX|('<vcl.inline>' Line 6 Pos 17)
**** v1    0.1 CLI RX|        backend debug {
**** v1    0.1 CLI RX|----------------#####--
**** v1    0.1 CLI RX|
**** v1    0.1 CLI RX|First definition:
**** v1    0.1 CLI RX|('<vcl.inline>' Line 4 Pos 9)
**** v1    0.1 CLI RX|        import debug;
**** v1    0.1 CLI RX|--------######-------
**** v1    0.1 CLI RX|
**** v1    0.1 CLI RX|Running VCC-compiler failed, exited with 2
**** v1    0.1 CLI RX|VCL compilation failed
**   v1    0.1 VCL compilation failed (as expected)
***  v1    0.1 Found expected string: ("Name 'debug' already defined.")
*    top   0.1 RESETTING after ../../../bin/varnishtest/tests/r01569.vtc
**   v1    0.1 Wait
**** v1    0.1 CLI TX|backend.list
***  v1    0.2 CLI RX  101
**** v1    0.2 CLI RX|Unknown request in manager process (child not running).
**** v1    0.2 CLI RX|Type 'help' for more info.
**   v1    0.2 Stop
**** v1    0.2 CLI TX|stop
***  v1    0.2 CLI RX  300
**** v1    0.2 CLI RX|Child in state stopped
**** v1    0.2 CLI TX|status
***  v1    0.2 CLI RX  200
**** v1    0.2 CLI RX|Child in state stopped
**** v1    0.2 STDOUT poll 0x10
**   v1    0.2 R 7000 Status: 0000 (u 0.004000 s 0.000000)
*    diag  0.0 ............................................................
#    top  TEST ../../../bin/varnishtest/tests/r01569.vtc TIMED OUT (kill -9)
#    top  TEST ../../../bin/varnishtest/tests/r01569.vtc FAILED (60.002) signal=9