r01837

8bbbdfa

1 @ SunOS 5.11 i86pc 1.04 32_sun12.4 uplex

*    top   0.0 TEST ../../../bin/varnishtest/tests/r01837.vtc starting
[...]
*    top   0.0 TEST Test VCC errors out if probe is used before it is defined
[...]
**** v1    0.1 CLI TX|vcl 4.0;
**** v1    0.1 CLI TX|
**** v1    0.1 CLI TX|\tbackend b {
**** v1    0.1 CLI TX|\t\t.host = "127.0.0.1";
**** v1    0.1 CLI TX|\t\t.probe = p;
**** v1    0.1 CLI TX|\t}
**** v1    0.1 CLI TX|\tprobe p {
**** v1    0.1 CLI TX|\t}
**** v1    0.1 CLI TX|
**** v1    0.1 CLI TX|%XJEIFLH|)Xspa8P
***  v1    0.1 CLI RX  106
**** v1    0.1 CLI RX|Message from VCC-compiler:
**** v1    0.1 CLI RX|Security: Privilege proc_setid missing, will not change uid/gid
**** v1    0.1 CLI RX|Probe p not found
**** v1    0.1 CLI RX|('<vcl.inline>' Line 5 Pos 26)
**** v1    0.1 CLI RX|                .probe = p;
**** v1    0.1 CLI RX|-------------------------#-
**** v1    0.1 CLI RX|
**** v1    0.1 CLI RX|Running VCC-compiler failed, exited with 2
**** v1    0.1 CLI RX|VCL compilation failed
**   v1    0.1 VCL compilation failed (as expected)
***  v1    0.1 Found expected string: ("Probe p not found")
*    top   0.1 RESETTING after ../../../bin/varnishtest/tests/r01837.vtc
**   v1    0.1 Wait
**** v1    0.1 CLI TX|backend.list
***  v1    0.1 CLI RX  101
**** v1    0.1 CLI RX|Unknown request in manager process (child not running).
**** v1    0.1 CLI RX|Type 'help' for more info.
**   v1    0.1 Stop
**** v1    0.1 CLI TX|stop
***  v1    0.1 CLI RX  300
**** v1    0.1 CLI RX|Child in state stopped
**** v1    0.1 CLI TX|status
***  v1    0.1 CLI RX  200
**** v1    0.1 CLI RX|Child in state stopped
**** v1    0.1 STDOUT poll 0x10
**   v1    0.1 R 30183 Status: 0000 (u 0.004000 s 0.017000)
*    diag  0.0 ............................................................
#    top  TEST ../../../bin/varnishtest/tests/r01837.vtc TIMED OUT (kill -9)
#    top  TEST ../../../bin/varnishtest/tests/r01837.vtc FAILED (60.003) signal=9

1 @ Ubuntu LTS i686 1.04 fgs

*    top   0.0 TEST ../../../bin/varnishtest/tests/r01837.vtc starting
[...]
*    top   0.0 TEST Test VCC errors out if probe is used before it is defined
[...]
**** v1    0.1 CLI TX|vcl.inline vcl1 << %XJEIFLH|)Xspa8P
**** v1    0.1 CLI TX|vcl 4.0;
**** v1    0.1 CLI TX|
**** v1    0.1 CLI TX|\tbackend b {
**** v1    0.1 CLI TX|\t\t.host = "127.0.0.1";
**** v1    0.1 CLI TX|\t\t.probe = p;
**** v1    0.1 CLI TX|\t}
**** v1    0.1 CLI TX|\tprobe p {
**** v1    0.1 CLI TX|\t}
**** v1    0.1 CLI TX|
**** v1    0.1 CLI TX|%XJEIFLH|)Xspa8P
***  v1    0.1 CLI RX  106
**** v1    0.1 CLI RX|Message from VCC-compiler:
**** v1    0.1 CLI RX|Probe p not found
**** v1    0.1 CLI RX|('<vcl.inline>' Line 5 Pos 26)
**** v1    0.1 CLI RX|                .probe = p;
**** v1    0.1 CLI RX|-------------------------#-
**** v1    0.1 CLI RX|
**** v1    0.1 CLI RX|Running VCC-compiler failed, exited with 2
**** v1    0.1 CLI RX|VCL compilation failed
**   v1    0.1 VCL compilation failed (as expected)
***  v1    0.1 Found expected string: ("Probe p not found")
*    top   0.1 RESETTING after ../../../bin/varnishtest/tests/r01837.vtc
**   v1    0.1 Wait
**** v1    0.1 CLI TX|backend.list
***  v1    0.1 CLI RX  101
**** v1    0.1 CLI RX|Unknown request in manager process (child not running).
**** v1    0.1 CLI RX|Type 'help' for more info.
**   v1    0.1 Stop
**** v1    0.1 CLI TX|stop
***  v1    0.2 CLI RX  300
**** v1    0.2 CLI RX|Child in state stopped
**** v1    0.2 CLI TX|status
***  v1    0.2 CLI RX  200
**** v1    0.2 CLI RX|Child in state stopped
**** v1    0.2 STDOUT poll 0x10
**   v1    0.2 R 17071 Status: 0000 (u 0.000000 s 0.004000)
*    diag  0.0 ............................................................
#    top  TEST ../../../bin/varnishtest/tests/r01837.vtc TIMED OUT (kill -9)
#    top  TEST ../../../bin/varnishtest/tests/r01837.vtc FAILED (60.001) signal=9

1 @ Linux 3.10.0 x86_64 1.02 mblissett

*    top   0.0 TEST ../../../bin/varnishtest/tests/r01837.vtc starting
[...]
*    top   0.0 TEST Test VCC errors out if probe is used before it is defined
[...]
**** v1    0.1 CLI TX|vcl.inline vcl1 << %XJEIFLH|)Xspa8P
**** v1    0.1 CLI TX|vcl 4.0;
**** v1    0.1 CLI TX|
**** v1    0.1 CLI TX|\tbackend b {
**** v1    0.1 CLI TX|\t\t.host = "127.0.0.1";
**** v1    0.1 CLI TX|\t\t.probe = p;
**** v1    0.1 CLI TX|\t}
**** v1    0.1 CLI TX|\tprobe p {
**** v1    0.1 CLI TX|\t}
**** v1    0.1 CLI TX|
**** v1    0.1 CLI TX|%XJEIFLH|)Xspa8P
***  v1    0.1 CLI RX  106
**** v1    0.1 CLI RX|Message from VCC-compiler:
**** v1    0.1 CLI RX|Probe p not found
**** v1    0.1 CLI RX|('<vcl.inline>' Line 5 Pos 26)
**** v1    0.1 CLI RX|                .probe = p;
**** v1    0.1 CLI RX|-------------------------#-
**** v1    0.1 CLI RX|
**** v1    0.1 CLI RX|Running VCC-compiler failed, exited with 2
**** v1    0.1 CLI RX|VCL compilation failed
**   v1    0.1 VCL compilation failed (as expected)
***  v1    0.1 Found expected string: ("Probe p not found")
*    top   0.1 RESETTING after ../../../bin/varnishtest/tests/r01837.vtc
**   v1    0.1 Wait
**** v1    0.1 CLI TX|backend.list
***  v1    0.2 CLI RX  101
**** v1    0.2 CLI RX|Unknown request in manager process (child not running).
**** v1    0.2 CLI RX|Type 'help' for more info.
**   v1    0.2 Stop
**** v1    0.2 CLI TX|stop
***  v1    0.2 CLI RX  300
**** v1    0.2 CLI RX|Child in state stopped
**** v1    0.2 CLI TX|status
***  v1    0.2 CLI RX  200
**** v1    0.2 CLI RX|Child in state stopped
**** v1    0.2 STDOUT poll 0x10
**   v1    0.2 R 29862 Status: 0000 (u 0.001115 s 0.010250)
*    diag  0.0 ............................................................
#    top  TEST ../../../bin/varnishtest/tests/r01837.vtc TIMED OUT (kill -9)
#    top  TEST ../../../bin/varnishtest/tests/r01837.vtc FAILED (60.001) signal=9

1 @ SunOS 5.11 i86pc 1.04 64_gcc4.7 uplex

*    top   0.0 TEST ../../../bin/varnishtest/tests/r01837.vtc starting
[...]
*    top   0.0 TEST Test VCC errors out if probe is used before it is defined
[...]
**** v1    0.1 CLI TX|vcl 4.0;
**** v1    0.1 CLI TX|
**** v1    0.1 CLI TX|\tbackend b {
**** v1    0.1 CLI TX|\t\t.host = "127.0.0.1";
**** v1    0.1 CLI TX|\t\t.probe = p;
**** v1    0.1 CLI TX|\t}
**** v1    0.1 CLI TX|\tprobe p {
**** v1    0.1 CLI TX|\t}
**** v1    0.1 CLI TX|
**** v1    0.1 CLI TX|%XJEIFLH|)Xspa8P
***  v1    0.1 CLI RX  106
**** v1    0.1 CLI RX|Message from VCC-compiler:
**** v1    0.1 CLI RX|Security: Privilege proc_setid missing, will not change uid/gid
**** v1    0.1 CLI RX|Probe p not found
**** v1    0.1 CLI RX|('<vcl.inline>' Line 5 Pos 26)
**** v1    0.1 CLI RX|                .probe = p;
**** v1    0.1 CLI RX|-------------------------#-
**** v1    0.1 CLI RX|
**** v1    0.1 CLI RX|Running VCC-compiler failed, exited with 2
**** v1    0.1 CLI RX|VCL compilation failed
**   v1    0.1 VCL compilation failed (as expected)
***  v1    0.1 Found expected string: ("Probe p not found")
*    top   0.1 RESETTING after ../../../bin/varnishtest/tests/r01837.vtc
**   v1    0.1 Wait
**** v1    0.1 CLI TX|backend.list
***  v1    0.1 CLI RX  101
**** v1    0.1 CLI RX|Unknown request in manager process (child not running).
**** v1    0.1 CLI RX|Type 'help' for more info.
**   v1    0.1 Stop
**** v1    0.1 CLI TX|stop
***  v1    0.1 CLI RX  300
**** v1    0.1 CLI RX|Child in state stopped
**** v1    0.1 CLI TX|status
***  v1    0.1 CLI RX  200
**** v1    0.1 CLI RX|Child in state stopped
**** v1    0.1 STDOUT poll 0x10
**   v1    0.1 R 97999 Status: 0000 (u 0.007000 s 0.028000)
*    diag  0.0 ............................................................
#    top  TEST ../../../bin/varnishtest/tests/r01837.vtc TIMED OUT (kill -9)
#    top  TEST ../../../bin/varnishtest/tests/r01837.vtc FAILED (60.003) signal=9

1 @ Linux 3.10.0 x86_64 1.02 mblissett

*    top   0.0 TEST ../../../bin/varnishtest/tests/r01837.vtc starting
[...]
*    top   0.0 TEST Test VCC errors out if probe is used before it is defined
[...]
**** v1    0.1 CLI TX|vcl.inline vcl1 << %XJEIFLH|)Xspa8P
**** v1    0.1 CLI TX|vcl 4.0;
**** v1    0.1 CLI TX|
**** v1    0.1 CLI TX|\tbackend b {
**** v1    0.1 CLI TX|\t\t.host = "127.0.0.1";
**** v1    0.1 CLI TX|\t\t.probe = p;
**** v1    0.1 CLI TX|\t}
**** v1    0.1 CLI TX|\tprobe p {
**** v1    0.1 CLI TX|\t}
**** v1    0.1 CLI TX|
**** v1    0.1 CLI TX|%XJEIFLH|)Xspa8P
***  v1    0.1 CLI RX  106
**** v1    0.1 CLI RX|Message from VCC-compiler:
**** v1    0.1 CLI RX|Probe p not found
**** v1    0.1 CLI RX|('<vcl.inline>' Line 5 Pos 26)
**** v1    0.1 CLI RX|                .probe = p;
**** v1    0.1 CLI RX|-------------------------#-
**** v1    0.1 CLI RX|
**** v1    0.1 CLI RX|Running VCC-compiler failed, exited with 2
**** v1    0.1 CLI RX|VCL compilation failed
**   v1    0.1 VCL compilation failed (as expected)
***  v1    0.1 Found expected string: ("Probe p not found")
*    top   0.1 RESETTING after ../../../bin/varnishtest/tests/r01837.vtc
**   v1    0.1 Wait
**** v1    0.1 CLI TX|backend.list
***  v1    0.1 CLI RX  101
**** v1    0.1 CLI RX|Unknown request in manager process (child not running).
**** v1    0.1 CLI RX|Type 'help' for more info.
**   v1    0.1 Stop
**** v1    0.1 CLI TX|stop
***  v1    0.2 CLI RX  300
**** v1    0.2 CLI RX|Child in state stopped
**** v1    0.2 CLI TX|status
***  v1    0.2 CLI RX  200
**** v1    0.2 CLI RX|Child in state stopped
**** v1    0.2 STDOUT poll 0x10
**   v1    0.2 R 26796 Status: 0000 (u 0.004161 s 0.006541)
*    diag  0.0 ............................................................
#    top  TEST ../../../bin/varnishtest/tests/r01837.vtc TIMED OUT (kill -9)
#    top  TEST ../../../bin/varnishtest/tests/r01837.vtc FAILED (60.001) signal=9

1 @ SunOS 5.11 i86pc 1.04 64_gcc4.7 uplex

*    top   0.0 TEST ../../../bin/varnishtest/tests/r01837.vtc starting
[...]
*    top   0.0 TEST Test VCC errors out if probe is used before it is defined
[...]
**** v1    0.1 CLI TX|vcl 4.0;
**** v1    0.1 CLI TX|
**** v1    0.1 CLI TX|\tbackend b {
**** v1    0.1 CLI TX|\t\t.host = "127.0.0.1";
**** v1    0.1 CLI TX|\t\t.probe = p;
**** v1    0.1 CLI TX|\t}
**** v1    0.1 CLI TX|\tprobe p {
**** v1    0.1 CLI TX|\t}
**** v1    0.1 CLI TX|
**** v1    0.1 CLI TX|%XJEIFLH|)Xspa8P
***  v1    0.1 CLI RX  106
**** v1    0.1 CLI RX|Message from VCC-compiler:
**** v1    0.1 CLI RX|Security: Privilege proc_setid missing, will not change uid/gid
**** v1    0.1 CLI RX|Probe p not found
**** v1    0.1 CLI RX|('<vcl.inline>' Line 5 Pos 26)
**** v1    0.1 CLI RX|                .probe = p;
**** v1    0.1 CLI RX|-------------------------#-
**** v1    0.1 CLI RX|
**** v1    0.1 CLI RX|Running VCC-compiler failed, exited with 2
**** v1    0.1 CLI RX|VCL compilation failed
**   v1    0.1 VCL compilation failed (as expected)
***  v1    0.1 Found expected string: ("Probe p not found")
*    top   0.1 RESETTING after ../../../bin/varnishtest/tests/r01837.vtc
**   v1    0.1 Wait
**** v1    0.1 CLI TX|backend.list
***  v1    0.1 CLI RX  101
**** v1    0.1 CLI RX|Unknown request in manager process (child not running).
**** v1    0.1 CLI RX|Type 'help' for more info.
**   v1    0.1 Stop
**** v1    0.1 CLI TX|stop
***  v1    0.1 CLI RX  300
**** v1    0.1 CLI RX|Child in state stopped
**** v1    0.1 CLI TX|status
***  v1    0.1 CLI RX  200
**** v1    0.1 CLI RX|Child in state stopped
**** v1    0.1 STDOUT poll 0x10
**   v1    0.1 R 42012 Status: 0000 (u 0.007000 s 0.021000)
*    diag  0.0 ............................................................
#    top  TEST ../../../bin/varnishtest/tests/r01837.vtc TIMED OUT (kill -9)
#    top  TEST ../../../bin/varnishtest/tests/r01837.vtc FAILED (60.004) signal=9

1 @ SunOS 5.11 i86pc 1.04 32_sun12.4 uplex

*    top   0.0 TEST ../../../bin/varnishtest/tests/r01837.vtc starting
[...]
*    top   0.0 TEST Test VCC errors out if probe is used before it is defined
[...]
**** v1    0.1 CLI TX|vcl 4.0;
**** v1    0.1 CLI TX|
**** v1    0.1 CLI TX|\tbackend b {
**** v1    0.1 CLI TX|\t\t.host = "127.0.0.1";
**** v1    0.1 CLI TX|\t\t.probe = p;
**** v1    0.1 CLI TX|\t}
**** v1    0.1 CLI TX|\tprobe p {
**** v1    0.1 CLI TX|\t}
**** v1    0.1 CLI TX|
**** v1    0.1 CLI TX|%XJEIFLH|)Xspa8P
***  v1    0.1 CLI RX  106
**** v1    0.1 CLI RX|Message from VCC-compiler:
**** v1    0.1 CLI RX|Security: Privilege proc_setid missing, will not change uid/gid
**** v1    0.1 CLI RX|Probe p not found
**** v1    0.1 CLI RX|('<vcl.inline>' Line 5 Pos 26)
**** v1    0.1 CLI RX|                .probe = p;
**** v1    0.1 CLI RX|-------------------------#-
**** v1    0.1 CLI RX|
**** v1    0.1 CLI RX|Running VCC-compiler failed, exited with 2
**** v1    0.1 CLI RX|VCL compilation failed
**   v1    0.1 VCL compilation failed (as expected)
***  v1    0.1 Found expected string: ("Probe p not found")
*    top   0.1 RESETTING after ../../../bin/varnishtest/tests/r01837.vtc
**   v1    0.1 Wait
**** v1    0.1 CLI TX|backend.list
***  v1    0.1 CLI RX  101
**** v1    0.1 CLI RX|Unknown request in manager process (child not running).
**** v1    0.1 CLI RX|Type 'help' for more info.
**   v1    0.1 Stop
**** v1    0.1 CLI TX|stop
***  v1    0.1 CLI RX  300
**** v1    0.1 CLI RX|Child in state stopped
**** v1    0.1 CLI TX|status
***  v1    0.1 CLI RX  200
**** v1    0.1 CLI RX|Child in state stopped
**** v1    0.1 STDOUT poll 0x10
**   v1    0.1 R 35253 Status: 0000 (u 0.006000 s 0.025000)
*    diag  0.0 ............................................................
#    top  TEST ../../../bin/varnishtest/tests/r01837.vtc TIMED OUT (kill -9)
#    top  TEST ../../../bin/varnishtest/tests/r01837.vtc FAILED (60.002) signal=9

1 @ SunOS 5.11 i86pc 1.04 64_sun12.4 uplex

*    top   0.0 TEST ../../../bin/varnishtest/tests/r01837.vtc starting
[...]
*    top   0.0 TEST Test VCC errors out if probe is used before it is defined
[...]
**** v1    0.1 CLI TX|vcl 4.0;
**** v1    0.1 CLI TX|
**** v1    0.1 CLI TX|\tbackend b {
**** v1    0.1 CLI TX|\t\t.host = "127.0.0.1";
**** v1    0.1 CLI TX|\t\t.probe = p;
**** v1    0.1 CLI TX|\t}
**** v1    0.1 CLI TX|\tprobe p {
**** v1    0.1 CLI TX|\t}
**** v1    0.1 CLI TX|
**** v1    0.1 CLI TX|%XJEIFLH|)Xspa8P
***  v1    0.1 CLI RX  106
**** v1    0.1 CLI RX|Message from VCC-compiler:
**** v1    0.1 CLI RX|Security: Privilege proc_setid missing, will not change uid/gid
**** v1    0.1 CLI RX|Probe p not found
**** v1    0.1 CLI RX|('<vcl.inline>' Line 5 Pos 26)
**** v1    0.1 CLI RX|                .probe = p;
**** v1    0.1 CLI RX|-------------------------#-
**** v1    0.1 CLI RX|
**** v1    0.1 CLI RX|Running VCC-compiler failed, exited with 2
**** v1    0.1 CLI RX|VCL compilation failed
**   v1    0.1 VCL compilation failed (as expected)
***  v1    0.1 Found expected string: ("Probe p not found")
*    top   0.1 RESETTING after ../../../bin/varnishtest/tests/r01837.vtc
**   v1    0.1 Wait
**** v1    0.1 CLI TX|backend.list
***  v1    0.1 CLI RX  101
**** v1    0.1 CLI RX|Unknown request in manager process (child not running).
**** v1    0.1 CLI RX|Type 'help' for more info.
**   v1    0.1 Stop
**** v1    0.1 CLI TX|stop
***  v1    0.1 CLI RX  300
**** v1    0.1 CLI RX|Child in state stopped
**** v1    0.1 CLI TX|status
***  v1    0.1 CLI RX  200
**** v1    0.1 CLI RX|Child in state stopped
**** v1    0.1 STDOUT poll 0x10
**   v1    0.1 R 9941 Status: 0000 (u 0.007000 s 0.022000)
*    diag  0.0 ............................................................
#    top  TEST ../../../bin/varnishtest/tests/r01837.vtc TIMED OUT (kill -9)
#    top  TEST ../../../bin/varnishtest/tests/r01837.vtc FAILED (60.004) signal=9

1 @ SunOS 5.11 i86pc 1.04 64_gcc4.7 uplex

*    top   0.0 TEST ../../../bin/varnishtest/tests/r01837.vtc starting
[...]
*    top   0.0 TEST Test VCC errors out if probe is used before it is defined
[...]
**** v1    0.1 CLI TX|vcl 4.0;
**** v1    0.1 CLI TX|
**** v1    0.1 CLI TX|\tbackend b {
**** v1    0.1 CLI TX|\t\t.host = "127.0.0.1";
**** v1    0.1 CLI TX|\t\t.probe = p;
**** v1    0.1 CLI TX|\t}
**** v1    0.1 CLI TX|\tprobe p {
**** v1    0.1 CLI TX|\t}
**** v1    0.1 CLI TX|
**** v1    0.1 CLI TX|%XJEIFLH|)Xspa8P
***  v1    0.1 CLI RX  106
**** v1    0.1 CLI RX|Message from VCC-compiler:
**** v1    0.1 CLI RX|Security: Privilege proc_setid missing, will not change uid/gid
**** v1    0.1 CLI RX|Probe p not found
**** v1    0.1 CLI RX|('<vcl.inline>' Line 5 Pos 26)
**** v1    0.1 CLI RX|                .probe = p;
**** v1    0.1 CLI RX|-------------------------#-
**** v1    0.1 CLI RX|
**** v1    0.1 CLI RX|Running VCC-compiler failed, exited with 2
**** v1    0.1 CLI RX|VCL compilation failed
**   v1    0.1 VCL compilation failed (as expected)
***  v1    0.1 Found expected string: ("Probe p not found")
*    top   0.1 RESETTING after ../../../bin/varnishtest/tests/r01837.vtc
**   v1    0.1 Wait
**** v1    0.1 CLI TX|backend.list
***  v1    0.1 CLI RX  101
**** v1    0.1 CLI RX|Unknown request in manager process (child not running).
**** v1    0.1 CLI RX|Type 'help' for more info.
**   v1    0.1 Stop
**** v1    0.1 CLI TX|stop
***  v1    0.1 CLI RX  300
**** v1    0.1 CLI RX|Child in state stopped
**** v1    0.1 CLI TX|status
***  v1    0.1 CLI RX  200
**** v1    0.1 CLI RX|Child in state stopped
**** v1    0.1 STDOUT poll 0x10
**   v1    0.1 R 40075 Status: 0000 (u 0.007000 s 0.021000)
*    diag  0.0 ............................................................
#    top  TEST ../../../bin/varnishtest/tests/r01837.vtc TIMED OUT (kill -9)
#    top  TEST ../../../bin/varnishtest/tests/r01837.vtc FAILED (60.004) signal=9

1 @ SunOS 5.11 i86pc 1.04 64_sun12.4 uplex

*    top   0.0 TEST ../../../bin/varnishtest/tests/r01837.vtc starting
[...]
*    top   0.0 TEST Test VCC errors out if probe is used before it is defined
[...]
**** v1    0.1 CLI TX|vcl 4.0;
**** v1    0.1 CLI TX|
**** v1    0.1 CLI TX|\tbackend b {
**** v1    0.1 CLI TX|\t\t.host = "127.0.0.1";
**** v1    0.1 CLI TX|\t\t.probe = p;
**** v1    0.1 CLI TX|\t}
**** v1    0.1 CLI TX|\tprobe p {
**** v1    0.1 CLI TX|\t}
**** v1    0.1 CLI TX|
**** v1    0.1 CLI TX|%XJEIFLH|)Xspa8P
***  v1    0.1 CLI RX  106
**** v1    0.1 CLI RX|Message from VCC-compiler:
**** v1    0.1 CLI RX|Security: Privilege proc_setid missing, will not change uid/gid
**** v1    0.1 CLI RX|Probe p not found
**** v1    0.1 CLI RX|('<vcl.inline>' Line 5 Pos 26)
**** v1    0.1 CLI RX|                .probe = p;
**** v1    0.1 CLI RX|-------------------------#-
**** v1    0.1 CLI RX|
**** v1    0.1 CLI RX|Running VCC-compiler failed, exited with 2
**** v1    0.1 CLI RX|VCL compilation failed
**   v1    0.1 VCL compilation failed (as expected)
***  v1    0.1 Found expected string: ("Probe p not found")
*    top   0.1 RESETTING after ../../../bin/varnishtest/tests/r01837.vtc
**   v1    0.1 Wait
**** v1    0.1 CLI TX|backend.list
***  v1    0.1 CLI RX  101
**** v1    0.1 CLI RX|Unknown request in manager process (child not running).
**** v1    0.1 CLI RX|Type 'help' for more info.
**   v1    0.1 Stop
**** v1    0.1 CLI TX|stop
***  v1    0.1 CLI RX  300
**** v1    0.1 CLI RX|Child in state stopped
**** v1    0.1 CLI TX|status
***  v1    0.1 CLI RX  200
**** v1    0.1 CLI RX|Child in state stopped
**** v1    0.1 STDOUT poll 0x10
**   v1    0.1 R 93039 Status: 0000 (u 0.007000 s 0.025000)
*    diag  0.0 ............................................................
#    top  TEST ../../../bin/varnishtest/tests/r01837.vtc TIMED OUT (kill -9)
#    top  TEST ../../../bin/varnishtest/tests/r01837.vtc FAILED (60.004) signal=9

1 @ SunOS 5.11 i86pc 1.04 64_sun12.4 uplex

*    top   0.0 TEST ../../../bin/varnishtest/tests/r01837.vtc starting
[...]
*    top   0.0 TEST Test VCC errors out if probe is used before it is defined
[...]
**** v1    0.1 CLI TX|vcl 4.0;
**** v1    0.1 CLI TX|
**** v1    0.1 CLI TX|\tbackend b {
**** v1    0.1 CLI TX|\t\t.host = "127.0.0.1";
**** v1    0.1 CLI TX|\t\t.probe = p;
**** v1    0.1 CLI TX|\t}
**** v1    0.1 CLI TX|\tprobe p {
**** v1    0.1 CLI TX|\t}
**** v1    0.1 CLI TX|
**** v1    0.1 CLI TX|%XJEIFLH|)Xspa8P
***  v1    0.2 CLI RX  106
**** v1    0.2 CLI RX|Message from VCC-compiler:
**** v1    0.2 CLI RX|Security: Privilege proc_setid missing, will not change uid/gid
**** v1    0.2 CLI RX|Probe p not found
**** v1    0.2 CLI RX|('<vcl.inline>' Line 5 Pos 26)
**** v1    0.2 CLI RX|                .probe = p;
**** v1    0.2 CLI RX|-------------------------#-
**** v1    0.2 CLI RX|
**** v1    0.2 CLI RX|Running VCC-compiler failed, exited with 2
**** v1    0.2 CLI RX|VCL compilation failed
**   v1    0.2 VCL compilation failed (as expected)
***  v1    0.2 Found expected string: ("Probe p not found")
*    top   0.2 RESETTING after ../../../bin/varnishtest/tests/r01837.vtc
**   v1    0.2 Wait
**** v1    0.2 CLI TX|backend.list
***  v1    0.2 CLI RX  101
**** v1    0.2 CLI RX|Unknown request in manager process (child not running).
**** v1    0.2 CLI RX|Type 'help' for more info.
**   v1    0.2 Stop
**** v1    0.2 CLI TX|stop
***  v1    0.2 CLI RX  300
**** v1    0.2 CLI RX|Child in state stopped
**** v1    0.2 CLI TX|status
***  v1    0.2 CLI RX  200
**** v1    0.2 CLI RX|Child in state stopped
**** v1    0.2 STDOUT poll 0x10
**   v1    0.2 R 99848 Status: 0000 (u 0.010000 s 0.032000)
*    diag  0.0 ............................................................
#    top  TEST ../../../bin/varnishtest/tests/r01837.vtc TIMED OUT (kill -9)
#    top  TEST ../../../bin/varnishtest/tests/r01837.vtc FAILED (60.006) signal=9

1 @ SunOS 5.11 i86pc 1.04 32_gcc4.7 uplex

*    top   0.0 TEST ../../../bin/varnishtest/tests/r01837.vtc starting
[...]
*    top   0.0 TEST Test VCC errors out if probe is used before it is defined
[...]
**** v1    0.1 CLI TX|vcl 4.0;
**** v1    0.1 CLI TX|
**** v1    0.1 CLI TX|\tbackend b {
**** v1    0.1 CLI TX|\t\t.host = "127.0.0.1";
**** v1    0.1 CLI TX|\t\t.probe = p;
**** v1    0.1 CLI TX|\t}
**** v1    0.1 CLI TX|\tprobe p {
**** v1    0.1 CLI TX|\t}
**** v1    0.1 CLI TX|
**** v1    0.1 CLI TX|%XJEIFLH|)Xspa8P
***  v1    0.1 CLI RX  106
**** v1    0.1 CLI RX|Message from VCC-compiler:
**** v1    0.1 CLI RX|Security: Privilege proc_setid missing, will not change uid/gid
**** v1    0.1 CLI RX|Probe p not found
**** v1    0.1 CLI RX|('<vcl.inline>' Line 5 Pos 26)
**** v1    0.1 CLI RX|                .probe = p;
**** v1    0.1 CLI RX|-------------------------#-
**** v1    0.1 CLI RX|
**** v1    0.1 CLI RX|Running VCC-compiler failed, exited with 2
**** v1    0.1 CLI RX|VCL compilation failed
**   v1    0.1 VCL compilation failed (as expected)
***  v1    0.1 Found expected string: ("Probe p not found")
*    top   0.1 RESETTING after ../../../bin/varnishtest/tests/r01837.vtc
**   v1    0.1 Wait
**** v1    0.1 CLI TX|backend.list
***  v1    0.1 CLI RX  101
**** v1    0.1 CLI RX|Unknown request in manager process (child not running).
**** v1    0.1 CLI RX|Type 'help' for more info.
**   v1    0.1 Stop
**** v1    0.1 CLI TX|stop
***  v1    0.1 CLI RX  300
**** v1    0.1 CLI RX|Child in state stopped
**** v1    0.1 CLI TX|status
***  v1    0.1 CLI RX  200
**** v1    0.1 CLI RX|Child in state stopped
**** v1    0.1 STDOUT poll 0x10
**   v1    0.1 R 68369 Status: 0000 (u 0.004000 s 0.018000)
*    diag  0.0 ............................................................
#    top  TEST ../../../bin/varnishtest/tests/r01837.vtc TIMED OUT (kill -9)
#    top  TEST ../../../bin/varnishtest/tests/r01837.vtc FAILED (60.002) signal=9

1 @ SunOS 5.11 i86pc 1.04 64_gcc4.7 uplex

*    top   0.0 TEST ../../../bin/varnishtest/tests/r01837.vtc starting
[...]
*    top   0.0 TEST Test VCC errors out if probe is used before it is defined
[...]
**** v1    0.1 CLI TX|vcl 4.0;
**** v1    0.1 CLI TX|
**** v1    0.1 CLI TX|\tbackend b {
**** v1    0.1 CLI TX|\t\t.host = "127.0.0.1";
**** v1    0.1 CLI TX|\t\t.probe = p;
**** v1    0.1 CLI TX|\t}
**** v1    0.1 CLI TX|\tprobe p {
**** v1    0.1 CLI TX|\t}
**** v1    0.1 CLI TX|
**** v1    0.1 CLI TX|%XJEIFLH|)Xspa8P
***  v1    0.1 CLI RX  106
**** v1    0.1 CLI RX|Message from VCC-compiler:
**** v1    0.1 CLI RX|Security: Privilege proc_setid missing, will not change uid/gid
**** v1    0.1 CLI RX|Probe p not found
**** v1    0.1 CLI RX|('<vcl.inline>' Line 5 Pos 26)
**** v1    0.1 CLI RX|                .probe = p;
**** v1    0.1 CLI RX|-------------------------#-
**** v1    0.1 CLI RX|
**** v1    0.1 CLI RX|Running VCC-compiler failed, exited with 2
**** v1    0.1 CLI RX|VCL compilation failed
**   v1    0.1 VCL compilation failed (as expected)
***  v1    0.1 Found expected string: ("Probe p not found")
*    top   0.1 RESETTING after ../../../bin/varnishtest/tests/r01837.vtc
**   v1    0.1 Wait
**** v1    0.1 CLI TX|backend.list
***  v1    0.1 CLI RX  101
**** v1    0.1 CLI RX|Unknown request in manager process (child not running).
**** v1    0.1 CLI RX|Type 'help' for more info.
**   v1    0.1 Stop
**** v1    0.1 CLI TX|stop
***  v1    0.1 CLI RX  300
**** v1    0.1 CLI RX|Child in state stopped
**** v1    0.1 CLI TX|status
***  v1    0.1 CLI RX  200
**** v1    0.1 CLI RX|Child in state stopped
**** v1    0.1 STDOUT poll 0x10
**   v1    0.2 R 82870 Status: 0000 (u 0.008000 s 0.030000)
*    diag  0.0 ............................................................
#    top  TEST ../../../bin/varnishtest/tests/r01837.vtc TIMED OUT (kill -9)
#    top  TEST ../../../bin/varnishtest/tests/r01837.vtc FAILED (60.004) signal=9

1 @ SunOS 5.11 i86pc 1.04 64_sun12.4 uplex

*    top   0.0 TEST ../../../bin/varnishtest/tests/r01837.vtc starting
[...]
*    top   0.0 TEST Test VCC errors out if probe is used before it is defined
[...]
**** v1    0.2 CLI TX|vcl 4.0;
**** v1    0.2 CLI TX|
**** v1    0.2 CLI TX|\tbackend b {
**** v1    0.2 CLI TX|\t\t.host = "127.0.0.1";
**** v1    0.2 CLI TX|\t\t.probe = p;
**** v1    0.2 CLI TX|\t}
**** v1    0.2 CLI TX|\tprobe p {
**** v1    0.2 CLI TX|\t}
**** v1    0.2 CLI TX|
**** v1    0.2 CLI TX|%XJEIFLH|)Xspa8P
***  v1    0.2 CLI RX  106
**** v1    0.2 CLI RX|Message from VCC-compiler:
**** v1    0.2 CLI RX|Security: Privilege proc_setid missing, will not change uid/gid
**** v1    0.2 CLI RX|Probe p not found
**** v1    0.2 CLI RX|('<vcl.inline>' Line 5 Pos 26)
**** v1    0.2 CLI RX|                .probe = p;
**** v1    0.2 CLI RX|-------------------------#-
**** v1    0.2 CLI RX|
**** v1    0.2 CLI RX|Running VCC-compiler failed, exited with 2
**** v1    0.2 CLI RX|VCL compilation failed
**   v1    0.2 VCL compilation failed (as expected)
***  v1    0.2 Found expected string: ("Probe p not found")
*    top   0.2 RESETTING after ../../../bin/varnishtest/tests/r01837.vtc
**   v1    0.2 Wait
**** v1    0.2 CLI TX|backend.list
***  v1    0.2 CLI RX  101
**** v1    0.2 CLI RX|Unknown request in manager process (child not running).
**** v1    0.2 CLI RX|Type 'help' for more info.
**   v1    0.2 Stop
**** v1    0.2 CLI TX|stop
***  v1    0.2 CLI RX  300
**** v1    0.2 CLI RX|Child in state stopped
**** v1    0.2 CLI TX|status
***  v1    0.2 CLI RX  200
**** v1    0.2 CLI RX|Child in state stopped
**** v1    0.2 STDOUT poll 0x10
**   v1    0.2 R 87923 Status: 0000 (u 0.010000 s 0.038000)
*    diag  0.0 ............................................................
#    top  TEST ../../../bin/varnishtest/tests/r01837.vtc TIMED OUT (kill -9)
#    top  TEST ../../../bin/varnishtest/tests/r01837.vtc FAILED (60.034) signal=9

1 @ Ubuntu LTS i686 1.04 fgs

*    top   0.0 TEST ../../../bin/varnishtest/tests/r01837.vtc starting
[...]
*    top   0.0 TEST Test VCC errors out if probe is used before it is defined
[...]
**** v1    0.1 CLI TX|vcl.inline vcl1 << %XJEIFLH|)Xspa8P
**** v1    0.1 CLI TX|vcl 4.0;
**** v1    0.1 CLI TX|
**** v1    0.1 CLI TX|\tbackend b {
**** v1    0.1 CLI TX|\t\t.host = "127.0.0.1";
**** v1    0.1 CLI TX|\t\t.probe = p;
**** v1    0.1 CLI TX|\t}
**** v1    0.1 CLI TX|\tprobe p {
**** v1    0.1 CLI TX|\t}
**** v1    0.1 CLI TX|
**** v1    0.1 CLI TX|%XJEIFLH|)Xspa8P
***  v1    0.1 CLI RX  106
**** v1    0.1 CLI RX|Message from VCC-compiler:
**** v1    0.1 CLI RX|Probe p not found
**** v1    0.1 CLI RX|('<vcl.inline>' Line 5 Pos 26)
**** v1    0.1 CLI RX|                .probe = p;
**** v1    0.1 CLI RX|-------------------------#-
**** v1    0.1 CLI RX|
**** v1    0.1 CLI RX|Running VCC-compiler failed, exited with 2
**** v1    0.1 CLI RX|VCL compilation failed
**   v1    0.1 VCL compilation failed (as expected)
***  v1    0.1 Found expected string: ("Probe p not found")
*    top   0.1 RESETTING after ../../../bin/varnishtest/tests/r01837.vtc
**   v1    0.1 Wait
**** v1    0.1 CLI TX|backend.list
***  v1    0.1 CLI RX  101
**** v1    0.1 CLI RX|Unknown request in manager process (child not running).
**** v1    0.1 CLI RX|Type 'help' for more info.
**   v1    0.1 Stop
**** v1    0.1 CLI TX|stop
***  v1    0.2 CLI RX  300
**** v1    0.2 CLI RX|Child in state stopped
**** v1    0.2 CLI TX|status
***  v1    0.2 CLI RX  200
**** v1    0.2 CLI RX|Child in state stopped
**** v1    0.2 STDOUT poll 0x10
**   v1    0.2 R 11136 Status: 0000 (u 0.004000 s 0.000000)
*    diag  0.0 ............................................................
#    top  TEST ../../../bin/varnishtest/tests/r01837.vtc TIMED OUT (kill -9)
#    top  TEST ../../../bin/varnishtest/tests/r01837.vtc FAILED (60.002) signal=9

1 @ SunOS 5.11 i86pc 1.04 64_sun12.4 uplex

*    top   0.0 TEST ../../../bin/varnishtest/tests/r01837.vtc starting
[...]
*    top   0.0 TEST Test VCC errors out if probe is used before it is defined
[...]
**** v1    0.1 CLI TX|vcl 4.0;
**** v1    0.1 CLI TX|
**** v1    0.1 CLI TX|\tbackend b {
**** v1    0.1 CLI TX|\t\t.host = "127.0.0.1";
**** v1    0.1 CLI TX|\t\t.probe = p;
**** v1    0.1 CLI TX|\t}
**** v1    0.1 CLI TX|\tprobe p {
**** v1    0.1 CLI TX|\t}
**** v1    0.1 CLI TX|
**** v1    0.1 CLI TX|%XJEIFLH|)Xspa8P
***  v1    0.1 CLI RX  106
**** v1    0.1 CLI RX|Message from VCC-compiler:
**** v1    0.1 CLI RX|Security: Privilege proc_setid missing, will not change uid/gid
**** v1    0.1 CLI RX|Probe p not found
**** v1    0.1 CLI RX|('<vcl.inline>' Line 5 Pos 26)
**** v1    0.1 CLI RX|                .probe = p;
**** v1    0.1 CLI RX|-------------------------#-
**** v1    0.1 CLI RX|
**** v1    0.1 CLI RX|Running VCC-compiler failed, exited with 2
**** v1    0.1 CLI RX|VCL compilation failed
**   v1    0.1 VCL compilation failed (as expected)
***  v1    0.1 Found expected string: ("Probe p not found")
*    top   0.1 RESETTING after ../../../bin/varnishtest/tests/r01837.vtc
**   v1    0.1 Wait
**** v1    0.1 CLI TX|backend.list
***  v1    0.1 CLI RX  101
**** v1    0.1 CLI RX|Unknown request in manager process (child not running).
**** v1    0.1 CLI RX|Type 'help' for more info.
**   v1    0.1 Stop
**** v1    0.1 CLI TX|stop
***  v1    0.1 CLI RX  300
**** v1    0.1 CLI RX|Child in state stopped
**** v1    0.1 CLI TX|status
***  v1    0.1 CLI RX  200
**** v1    0.1 CLI RX|Child in state stopped
**** v1    0.1 STDOUT poll 0x10
**   v1    0.1 R 76260 Status: 0000 (u 0.008000 s 0.028000)
*    diag  0.0 ............................................................
#    top  TEST ../../../bin/varnishtest/tests/r01837.vtc TIMED OUT (kill -9)
#    top  TEST ../../../bin/varnishtest/tests/r01837.vtc FAILED (60.004) signal=9

1 @ SunOS 5.11 i86pc 1.04 64_sun12.4 uplex

*    top   0.0 TEST ../../../bin/varnishtest/tests/r01837.vtc starting
[...]
*    top   0.0 TEST Test VCC errors out if probe is used before it is defined
[...]
**** v1    0.1 CLI TX|vcl 4.0;
**** v1    0.1 CLI TX|
**** v1    0.1 CLI TX|\tbackend b {
**** v1    0.1 CLI TX|\t\t.host = "127.0.0.1";
**** v1    0.1 CLI TX|\t\t.probe = p;
**** v1    0.1 CLI TX|\t}
**** v1    0.1 CLI TX|\tprobe p {
**** v1    0.1 CLI TX|\t}
**** v1    0.1 CLI TX|
**** v1    0.1 CLI TX|%XJEIFLH|)Xspa8P
***  v1    0.1 CLI RX  106
**** v1    0.1 CLI RX|Message from VCC-compiler:
**** v1    0.1 CLI RX|Security: Privilege proc_setid missing, will not change uid/gid
**** v1    0.1 CLI RX|Probe p not found
**** v1    0.1 CLI RX|('<vcl.inline>' Line 5 Pos 26)
**** v1    0.1 CLI RX|                .probe = p;
**** v1    0.1 CLI RX|-------------------------#-
**** v1    0.1 CLI RX|
**** v1    0.1 CLI RX|Running VCC-compiler failed, exited with 2
**** v1    0.1 CLI RX|VCL compilation failed
**   v1    0.1 VCL compilation failed (as expected)
***  v1    0.1 Found expected string: ("Probe p not found")
*    top   0.1 RESETTING after ../../../bin/varnishtest/tests/r01837.vtc
**   v1    0.1 Wait
**** v1    0.1 CLI TX|backend.list
***  v1    0.1 CLI RX  101
**** v1    0.1 CLI RX|Unknown request in manager process (child not running).
**** v1    0.1 CLI RX|Type 'help' for more info.
**   v1    0.1 Stop
**** v1    0.1 CLI TX|stop
***  v1    0.1 CLI RX  300
**** v1    0.1 CLI RX|Child in state stopped
**** v1    0.1 CLI TX|status
***  v1    0.1 CLI RX  200
**** v1    0.1 CLI RX|Child in state stopped
**** v1    0.1 STDOUT poll 0x10
**   v1    0.1 R 26120 Status: 0000 (u 0.007000 s 0.022000)
*    diag  0.0 ............................................................
#    top  TEST ../../../bin/varnishtest/tests/r01837.vtc TIMED OUT (kill -9)
#    top  TEST ../../../bin/varnishtest/tests/r01837.vtc FAILED (60.004) signal=9

1 @ SunOS 5.11 i86pc 1.04 32_gcc4.7 uplex

*    top   0.0 TEST ../../../bin/varnishtest/tests/r01837.vtc starting
[...]
*    top   0.0 TEST Test VCC errors out if probe is used before it is defined
[...]
**** v1    0.1 CLI TX|vcl 4.0;
**** v1    0.1 CLI TX|
**** v1    0.1 CLI TX|\tbackend b {
**** v1    0.1 CLI TX|\t\t.host = "127.0.0.1";
**** v1    0.1 CLI TX|\t\t.probe = p;
**** v1    0.1 CLI TX|\t}
**** v1    0.1 CLI TX|\tprobe p {
**** v1    0.1 CLI TX|\t}
**** v1    0.1 CLI TX|
**** v1    0.1 CLI TX|%XJEIFLH|)Xspa8P
***  v1    0.1 CLI RX  106
**** v1    0.1 CLI RX|Message from VCC-compiler:
**** v1    0.1 CLI RX|Security: Privilege proc_setid missing, will not change uid/gid
**** v1    0.1 CLI RX|Probe p not found
**** v1    0.1 CLI RX|('<vcl.inline>' Line 5 Pos 26)
**** v1    0.1 CLI RX|                .probe = p;
**** v1    0.1 CLI RX|-------------------------#-
**** v1    0.1 CLI RX|
**** v1    0.1 CLI RX|Running VCC-compiler failed, exited with 2
**** v1    0.1 CLI RX|VCL compilation failed
**   v1    0.1 VCL compilation failed (as expected)
***  v1    0.1 Found expected string: ("Probe p not found")
*    top   0.1 RESETTING after ../../../bin/varnishtest/tests/r01837.vtc
**   v1    0.1 Wait
**** v1    0.1 CLI TX|backend.list
***  v1    0.1 CLI RX  101
**** v1    0.1 CLI RX|Unknown request in manager process (child not running).
**** v1    0.1 CLI RX|Type 'help' for more info.
**   v1    0.1 Stop
**** v1    0.1 CLI TX|stop
***  v1    0.1 CLI RX  300
**** v1    0.1 CLI RX|Child in state stopped
**** v1    0.1 CLI TX|status
***  v1    0.1 CLI RX  200
**** v1    0.1 CLI RX|Child in state stopped
**** v1    0.1 STDOUT poll 0x10
**   v1    0.1 R 11899 Status: 0000 (u 0.005000 s 0.024000)
*    diag  0.0 ............................................................
#    top  TEST ../../../bin/varnishtest/tests/r01837.vtc TIMED OUT (kill -9)
#    top  TEST ../../../bin/varnishtest/tests/r01837.vtc FAILED (60.002) signal=9

1 @ SunOS 5.11 i86pc 1.04 32_sun12.4 uplex

*    top   0.0 TEST ../../../bin/varnishtest/tests/r01837.vtc starting
[...]
*    top   0.0 TEST Test VCC errors out if probe is used before it is defined
[...]
**** v1    0.1 CLI TX|vcl 4.0;
**** v1    0.1 CLI TX|
**** v1    0.1 CLI TX|\tbackend b {
**** v1    0.1 CLI TX|\t\t.host = "127.0.0.1";
**** v1    0.1 CLI TX|\t\t.probe = p;
**** v1    0.1 CLI TX|\t}
**** v1    0.1 CLI TX|\tprobe p {
**** v1    0.1 CLI TX|\t}
**** v1    0.1 CLI TX|
**** v1    0.1 CLI TX|%XJEIFLH|)Xspa8P
***  v1    0.1 CLI RX  106
**** v1    0.1 CLI RX|Message from VCC-compiler:
**** v1    0.1 CLI RX|Security: Privilege proc_setid missing, will not change uid/gid
**** v1    0.1 CLI RX|Probe p not found
**** v1    0.1 CLI RX|('<vcl.inline>' Line 5 Pos 26)
**** v1    0.1 CLI RX|                .probe = p;
**** v1    0.1 CLI RX|-------------------------#-
**** v1    0.1 CLI RX|
**** v1    0.1 CLI RX|Running VCC-compiler failed, exited with 2
**** v1    0.1 CLI RX|VCL compilation failed
**   v1    0.1 VCL compilation failed (as expected)
***  v1    0.1 Found expected string: ("Probe p not found")
*    top   0.1 RESETTING after ../../../bin/varnishtest/tests/r01837.vtc
**   v1    0.1 Wait
**** v1    0.1 CLI TX|backend.list
***  v1    0.1 CLI RX  101
**** v1    0.1 CLI RX|Unknown request in manager process (child not running).
**** v1    0.1 CLI RX|Type 'help' for more info.
**   v1    0.1 Stop
**** v1    0.1 CLI TX|stop
***  v1    0.1 CLI RX  300
**** v1    0.1 CLI RX|Child in state stopped
**** v1    0.1 CLI TX|status
***  v1    0.1 CLI RX  200
**** v1    0.1 CLI RX|Child in state stopped
**** v1    0.1 STDOUT poll 0x10
**   v1    0.1 R 51635 Status: 0000 (u 0.004000 s 0.017000)
*    diag  0.0 ............................................................
#    top  TEST ../../../bin/varnishtest/tests/r01837.vtc TIMED OUT (kill -9)
#    top  TEST ../../../bin/varnishtest/tests/r01837.vtc FAILED (60.003) signal=9

1 @ SunOS 5.11 i86pc 1.04 64_gcc4.7 uplex

*    top   0.0 TEST ../../../bin/varnishtest/tests/r01837.vtc starting
[...]
*    top   0.0 TEST Test VCC errors out if probe is used before it is defined
[...]
**** v1    0.1 CLI TX|vcl 4.0;
**** v1    0.1 CLI TX|
**** v1    0.1 CLI TX|\tbackend b {
**** v1    0.1 CLI TX|\t\t.host = "127.0.0.1";
**** v1    0.1 CLI TX|\t\t.probe = p;
**** v1    0.1 CLI TX|\t}
**** v1    0.1 CLI TX|\tprobe p {
**** v1    0.1 CLI TX|\t}
**** v1    0.1 CLI TX|
**** v1    0.1 CLI TX|%XJEIFLH|)Xspa8P
***  v1    0.1 CLI RX  106
**** v1    0.1 CLI RX|Message from VCC-compiler:
**** v1    0.1 CLI RX|Security: Privilege proc_setid missing, will not change uid/gid
**** v1    0.1 CLI RX|Probe p not found
**** v1    0.1 CLI RX|('<vcl.inline>' Line 5 Pos 26)
**** v1    0.1 CLI RX|                .probe = p;
**** v1    0.1 CLI RX|-------------------------#-
**** v1    0.1 CLI RX|
**** v1    0.1 CLI RX|Running VCC-compiler failed, exited with 2
**** v1    0.1 CLI RX|VCL compilation failed
**   v1    0.1 VCL compilation failed (as expected)
***  v1    0.1 Found expected string: ("Probe p not found")
*    top   0.1 RESETTING after ../../../bin/varnishtest/tests/r01837.vtc
**   v1    0.1 Wait
**** v1    0.1 CLI TX|backend.list
***  v1    0.1 CLI RX  101
**** v1    0.1 CLI RX|Unknown request in manager process (child not running).
**** v1    0.1 CLI RX|Type 'help' for more info.
**   v1    0.1 Stop
**** v1    0.1 CLI TX|stop
***  v1    0.1 CLI RX  300
**** v1    0.1 CLI RX|Child in state stopped
**** v1    0.1 CLI TX|status
***  v1    0.1 CLI RX  200
**** v1    0.1 CLI RX|Child in state stopped
**** v1    0.1 STDOUT poll 0x10
**   v1    0.1 R 77312 Status: 0000 (u 0.007000 s 0.022000)
*    diag  0.0 ............................................................
#    top  TEST ../../../bin/varnishtest/tests/r01837.vtc TIMED OUT (kill -9)
#    top  TEST ../../../bin/varnishtest/tests/r01837.vtc FAILED (60.004) signal=9

1 @ Linux 3.10.0 x86_64 1.02 mblissett

*    top   0.0 TEST ../../../bin/varnishtest/tests/r01837.vtc starting
[...]
*    top   0.0 TEST Test VCC errors out if probe is used before it is defined
[...]
**** v1    0.1 CLI TX|vcl.inline vcl1 << %XJEIFLH|)Xspa8P
**** v1    0.1 CLI TX|vcl 4.0;
**** v1    0.1 CLI TX|
**** v1    0.1 CLI TX|\tbackend b {
**** v1    0.1 CLI TX|\t\t.host = "127.0.0.1";
**** v1    0.1 CLI TX|\t\t.probe = p;
**** v1    0.1 CLI TX|\t}
**** v1    0.1 CLI TX|\tprobe p {
**** v1    0.1 CLI TX|\t}
**** v1    0.1 CLI TX|
**** v1    0.1 CLI TX|%XJEIFLH|)Xspa8P
***  v1    0.1 CLI RX  106
**** v1    0.1 CLI RX|Message from VCC-compiler:
**** v1    0.1 CLI RX|Probe p not found
**** v1    0.1 CLI RX|('<vcl.inline>' Line 5 Pos 26)
**** v1    0.1 CLI RX|                .probe = p;
**** v1    0.1 CLI RX|-------------------------#-
**** v1    0.1 CLI RX|
**** v1    0.1 CLI RX|Running VCC-compiler failed, exited with 2
**** v1    0.1 CLI RX|VCL compilation failed
**   v1    0.1 VCL compilation failed (as expected)
***  v1    0.1 Found expected string: ("Probe p not found")
*    top   0.1 RESETTING after ../../../bin/varnishtest/tests/r01837.vtc
**   v1    0.1 Wait
**** v1    0.1 CLI TX|backend.list
***  v1    0.2 CLI RX  101
**** v1    0.2 CLI RX|Unknown request in manager process (child not running).
**** v1    0.2 CLI RX|Type 'help' for more info.
**   v1    0.2 Stop
**** v1    0.2 CLI TX|stop
***  v1    0.2 CLI RX  300
**** v1    0.2 CLI RX|Child in state stopped
**** v1    0.2 CLI TX|status
***  v1    0.2 CLI RX  200
**** v1    0.2 CLI RX|Child in state stopped
**** v1    0.2 STDOUT poll 0x10
**   v1    0.2 R 642 Status: 0000 (u 0.001932 s 0.009496)
*    diag  0.0 ............................................................
#    top  TEST ../../../bin/varnishtest/tests/r01837.vtc TIMED OUT (kill -9)
#    top  TEST ../../../bin/varnishtest/tests/r01837.vtc FAILED (60.001) signal=9

1 @ SunOS 5.11 i86pc 1.04 64_gcc4.7 uplex

*    top   0.0 TEST ../../../bin/varnishtest/tests/r01837.vtc starting
[...]
*    top   0.0 TEST Test VCC errors out if probe is used before it is defined
[...]
**** v1    0.1 CLI TX|vcl 4.0;
**** v1    0.1 CLI TX|
**** v1    0.1 CLI TX|\tbackend b {
**** v1    0.1 CLI TX|\t\t.host = "127.0.0.1";
**** v1    0.1 CLI TX|\t\t.probe = p;
**** v1    0.1 CLI TX|\t}
**** v1    0.1 CLI TX|\tprobe p {
**** v1    0.1 CLI TX|\t}
**** v1    0.1 CLI TX|
**** v1    0.1 CLI TX|%XJEIFLH|)Xspa8P
***  v1    0.1 CLI RX  106
**** v1    0.1 CLI RX|Message from VCC-compiler:
**** v1    0.1 CLI RX|Security: Privilege proc_setid missing, will not change uid/gid
**** v1    0.1 CLI RX|Probe p not found
**** v1    0.1 CLI RX|('<vcl.inline>' Line 5 Pos 26)
**** v1    0.1 CLI RX|                .probe = p;
**** v1    0.1 CLI RX|-------------------------#-
**** v1    0.1 CLI RX|
**** v1    0.1 CLI RX|Running VCC-compiler failed, exited with 2
**** v1    0.1 CLI RX|VCL compilation failed
**   v1    0.1 VCL compilation failed (as expected)
***  v1    0.1 Found expected string: ("Probe p not found")
*    top   0.1 RESETTING after ../../../bin/varnishtest/tests/r01837.vtc
**   v1    0.1 Wait
**** v1    0.1 CLI TX|backend.list
***  v1    0.1 CLI RX  101
**** v1    0.1 CLI RX|Unknown request in manager process (child not running).
**** v1    0.1 CLI RX|Type 'help' for more info.
**   v1    0.1 Stop
**** v1    0.1 CLI TX|stop
***  v1    0.1 CLI RX  300
**** v1    0.1 CLI RX|Child in state stopped
**** v1    0.1 CLI TX|status
***  v1    0.1 CLI RX  200
**** v1    0.1 CLI RX|Child in state stopped
**** v1    0.1 STDOUT poll 0x10
**   v1    0.1 R 95270 Status: 0000 (u 0.007000 s 0.021000)
*    diag  0.0 ............................................................
#    top  TEST ../../../bin/varnishtest/tests/r01837.vtc TIMED OUT (kill -9)
#    top  TEST ../../../bin/varnishtest/tests/r01837.vtc FAILED (60.004) signal=9

1 @ Linux 3.10.0 x86_64 1.02 mblissett

*    top   0.0 TEST ../../../bin/varnishtest/tests/r01837.vtc starting
[...]
*    top   0.0 TEST Test VCC errors out if probe is used before it is defined
[...]
**** v1    0.1 CLI TX|vcl.inline vcl1 << %XJEIFLH|)Xspa8P
**** v1    0.1 CLI TX|vcl 4.0;
**** v1    0.1 CLI TX|
**** v1    0.1 CLI TX|\tbackend b {
**** v1    0.1 CLI TX|\t\t.host = "127.0.0.1";
**** v1    0.1 CLI TX|\t\t.probe = p;
**** v1    0.1 CLI TX|\t}
**** v1    0.1 CLI TX|\tprobe p {
**** v1    0.1 CLI TX|\t}
**** v1    0.1 CLI TX|
**** v1    0.1 CLI TX|%XJEIFLH|)Xspa8P
***  v1    0.1 CLI RX  106
**** v1    0.1 CLI RX|Message from VCC-compiler:
**** v1    0.1 CLI RX|Probe p not found
**** v1    0.1 CLI RX|('<vcl.inline>' Line 5 Pos 26)
**** v1    0.1 CLI RX|                .probe = p;
**** v1    0.1 CLI RX|-------------------------#-
**** v1    0.1 CLI RX|
**** v1    0.1 CLI RX|Running VCC-compiler failed, exited with 2
**** v1    0.1 CLI RX|VCL compilation failed
**   v1    0.1 VCL compilation failed (as expected)
***  v1    0.1 Found expected string: ("Probe p not found")
*    top   0.1 RESETTING after ../../../bin/varnishtest/tests/r01837.vtc
**   v1    0.1 Wait
**** v1    0.1 CLI TX|backend.list
***  v1    0.2 CLI RX  101
**** v1    0.2 CLI RX|Unknown request in manager process (child not running).
**** v1    0.2 CLI RX|Type 'help' for more info.
**   v1    0.2 Stop
**** v1    0.2 CLI TX|stop
***  v1    0.2 CLI RX  300
**** v1    0.2 CLI RX|Child in state stopped
**** v1    0.2 CLI TX|status
***  v1    0.2 CLI RX  200
**** v1    0.2 CLI RX|Child in state stopped
**** v1    0.2 STDOUT poll 0x10
**   v1    0.2 R 10390 Status: 0000 (u 0.000000 s 0.016525)
*    diag  0.0 ............................................................
#    top  TEST ../../../bin/varnishtest/tests/r01837.vtc TIMED OUT (kill -9)
#    top  TEST ../../../bin/varnishtest/tests/r01837.vtc FAILED (60.001) signal=9

1 @ Ubuntu LTS i686 1.04 fgs

*    top   0.0 TEST ../../../bin/varnishtest/tests/r01837.vtc starting
[...]
*    top   0.0 TEST Test VCC errors out if probe is used before it is defined
[...]
**** v1    0.1 CLI TX|vcl.inline vcl1 << %XJEIFLH|)Xspa8P
**** v1    0.1 CLI TX|vcl 4.0;
**** v1    0.1 CLI TX|
**** v1    0.1 CLI TX|\tbackend b {
**** v1    0.1 CLI TX|\t\t.host = "127.0.0.1";
**** v1    0.1 CLI TX|\t\t.probe = p;
**** v1    0.1 CLI TX|\t}
**** v1    0.1 CLI TX|\tprobe p {
**** v1    0.1 CLI TX|\t}
**** v1    0.1 CLI TX|
**** v1    0.1 CLI TX|%XJEIFLH|)Xspa8P
***  v1    0.1 CLI RX  106
**** v1    0.1 CLI RX|Message from VCC-compiler:
**** v1    0.1 CLI RX|Probe p not found
**** v1    0.1 CLI RX|('<vcl.inline>' Line 5 Pos 26)
**** v1    0.1 CLI RX|                .probe = p;
**** v1    0.1 CLI RX|-------------------------#-
**** v1    0.1 CLI RX|
**** v1    0.1 CLI RX|Running VCC-compiler failed, exited with 2
**** v1    0.1 CLI RX|VCL compilation failed
**   v1    0.1 VCL compilation failed (as expected)
***  v1    0.1 Found expected string: ("Probe p not found")
*    top   0.1 RESETTING after ../../../bin/varnishtest/tests/r01837.vtc
**   v1    0.1 Wait
**** v1    0.1 CLI TX|backend.list
***  v1    0.1 CLI RX  101
**** v1    0.1 CLI RX|Unknown request in manager process (child not running).
**** v1    0.1 CLI RX|Type 'help' for more info.
**   v1    0.1 Stop
**** v1    0.1 CLI TX|stop
***  v1    0.2 CLI RX  300
**** v1    0.2 CLI RX|Child in state stopped
**** v1    0.2 CLI TX|status
***  v1    0.2 CLI RX  200
**** v1    0.2 CLI RX|Child in state stopped
**** v1    0.2 STDOUT poll 0x10
**   v1    0.2 R 7979 Status: 0000 (u 0.004000 s 0.000000)
*    diag  0.0 ............................................................
#    top  TEST ../../../bin/varnishtest/tests/r01837.vtc TIMED OUT (kill -9)
#    top  TEST ../../../bin/varnishtest/tests/r01837.vtc FAILED (60.003) signal=9

1 @ SunOS 5.11 i86pc 1.04 32_sun12.4 uplex

*    top   0.0 TEST ../../../bin/varnishtest/tests/r01837.vtc starting
[...]
*    top   0.0 TEST Test VCC errors out if probe is used before it is defined
[...]
**** v1    0.1 CLI TX|vcl 4.0;
**** v1    0.1 CLI TX|
**** v1    0.1 CLI TX|\tbackend b {
**** v1    0.1 CLI TX|\t\t.host = "127.0.0.1";
**** v1    0.1 CLI TX|\t\t.probe = p;
**** v1    0.1 CLI TX|\t}
**** v1    0.1 CLI TX|\tprobe p {
**** v1    0.1 CLI TX|\t}
**** v1    0.1 CLI TX|
**** v1    0.1 CLI TX|%XJEIFLH|)Xspa8P
***  v1    0.1 CLI RX  106
**** v1    0.1 CLI RX|Message from VCC-compiler:
**** v1    0.1 CLI RX|Security: Privilege proc_setid missing, will not change uid/gid
**** v1    0.1 CLI RX|Probe p not found
**** v1    0.1 CLI RX|('<vcl.inline>' Line 5 Pos 26)
**** v1    0.1 CLI RX|                .probe = p;
**** v1    0.1 CLI RX|-------------------------#-
**** v1    0.1 CLI RX|
**** v1    0.1 CLI RX|Running VCC-compiler failed, exited with 2
**** v1    0.1 CLI RX|VCL compilation failed
**   v1    0.1 VCL compilation failed (as expected)
***  v1    0.1 Found expected string: ("Probe p not found")
*    top   0.1 RESETTING after ../../../bin/varnishtest/tests/r01837.vtc
**   v1    0.1 Wait
**** v1    0.1 CLI TX|backend.list
***  v1    0.1 CLI RX  101
**** v1    0.1 CLI RX|Unknown request in manager process (child not running).
**** v1    0.1 CLI RX|Type 'help' for more info.
**   v1    0.1 Stop
**** v1    0.1 CLI TX|stop
***  v1    0.1 CLI RX  300
**** v1    0.1 CLI RX|Child in state stopped
**** v1    0.1 CLI TX|status
***  v1    0.1 CLI RX  200
**** v1    0.1 CLI RX|Child in state stopped
**** v1    0.1 STDOUT poll 0x10
**   v1    0.1 R 50270 Status: 0000 (u 0.006000 s 0.025000)
*    diag  0.0 ............................................................
#    top  TEST ../../../bin/varnishtest/tests/r01837.vtc TIMED OUT (kill -9)
#    top  TEST ../../../bin/varnishtest/tests/r01837.vtc FAILED (60.002) signal=9

1 @ SunOS 5.11 i86pc 1.04 64_sun12.4 uplex

*    top   0.0 TEST ../../../bin/varnishtest/tests/r01837.vtc starting
[...]
*    top   0.0 TEST Test VCC errors out if probe is used before it is defined
[...]
**** v1    0.2 CLI TX|vcl 4.0;
**** v1    0.2 CLI TX|
**** v1    0.2 CLI TX|\tbackend b {
**** v1    0.2 CLI TX|\t\t.host = "127.0.0.1";
**** v1    0.2 CLI TX|\t\t.probe = p;
**** v1    0.2 CLI TX|\t}
**** v1    0.2 CLI TX|\tprobe p {
**** v1    0.2 CLI TX|\t}
**** v1    0.2 CLI TX|
**** v1    0.2 CLI TX|%XJEIFLH|)Xspa8P
***  v1    0.2 CLI RX  106
**** v1    0.2 CLI RX|Message from VCC-compiler:
**** v1    0.2 CLI RX|Security: Privilege proc_setid missing, will not change uid/gid
**** v1    0.2 CLI RX|Probe p not found
**** v1    0.2 CLI RX|('<vcl.inline>' Line 5 Pos 26)
**** v1    0.2 CLI RX|                .probe = p;
**** v1    0.2 CLI RX|-------------------------#-
**** v1    0.2 CLI RX|
**** v1    0.2 CLI RX|Running VCC-compiler failed, exited with 2
**** v1    0.2 CLI RX|VCL compilation failed
**   v1    0.2 VCL compilation failed (as expected)
***  v1    0.2 Found expected string: ("Probe p not found")
*    top   0.2 RESETTING after ../../../bin/varnishtest/tests/r01837.vtc
**   v1    0.2 Wait
**** v1    0.2 CLI TX|backend.list
***  v1    0.2 CLI RX  101
**** v1    0.2 CLI RX|Unknown request in manager process (child not running).
**** v1    0.2 CLI RX|Type 'help' for more info.
**   v1    0.2 Stop
**** v1    0.2 CLI TX|stop
***  v1    0.2 CLI RX  300
**** v1    0.2 CLI RX|Child in state stopped
**** v1    0.2 CLI TX|status
***  v1    0.2 CLI RX  200
**** v1    0.2 CLI RX|Child in state stopped
**** v1    0.2 STDOUT poll 0x10
**   v1    0.2 R 15196 Status: 0000 (u 0.009000 s 0.034000)
*    diag  0.0 ............................................................
#    top  TEST ../../../bin/varnishtest/tests/r01837.vtc TIMED OUT (kill -9)
#    top  TEST ../../../bin/varnishtest/tests/r01837.vtc FAILED (60.006) signal=9

1 @ Ubuntu LTS i686 1.04 fgs

*    top   0.0 TEST ../../../bin/varnishtest/tests/r01837.vtc starting
[...]
*    top   0.0 TEST Test VCC errors out if probe is used before it is defined
[...]
**** v1    0.1 CLI TX|vcl.inline vcl1 << %XJEIFLH|)Xspa8P
**** v1    0.1 CLI TX|vcl 4.0;
**** v1    0.1 CLI TX|
**** v1    0.1 CLI TX|\tbackend b {
**** v1    0.1 CLI TX|\t\t.host = "127.0.0.1";
**** v1    0.1 CLI TX|\t\t.probe = p;
**** v1    0.1 CLI TX|\t}
**** v1    0.1 CLI TX|\tprobe p {
**** v1    0.1 CLI TX|\t}
**** v1    0.1 CLI TX|
**** v1    0.1 CLI TX|%XJEIFLH|)Xspa8P
***  v1    0.1 CLI RX  106
**** v1    0.1 CLI RX|Message from VCC-compiler:
**** v1    0.1 CLI RX|Probe p not found
**** v1    0.1 CLI RX|('<vcl.inline>' Line 5 Pos 26)
**** v1    0.1 CLI RX|                .probe = p;
**** v1    0.1 CLI RX|-------------------------#-
**** v1    0.1 CLI RX|
**** v1    0.1 CLI RX|Running VCC-compiler failed, exited with 2
**** v1    0.1 CLI RX|VCL compilation failed
**   v1    0.1 VCL compilation failed (as expected)
***  v1    0.1 Found expected string: ("Probe p not found")
*    top   0.1 RESETTING after ../../../bin/varnishtest/tests/r01837.vtc
**   v1    0.1 Wait
**** v1    0.1 CLI TX|backend.list
***  v1    0.2 CLI RX  101
**** v1    0.2 CLI RX|Unknown request in manager process (child not running).
**** v1    0.2 CLI RX|Type 'help' for more info.
**   v1    0.2 Stop
**** v1    0.2 CLI TX|stop
***  v1    0.2 CLI RX  300
**** v1    0.2 CLI RX|Child in state stopped
**** v1    0.2 CLI TX|status
***  v1    0.2 CLI RX  200
**** v1    0.2 CLI RX|Child in state stopped
**** v1    0.2 STDOUT poll 0x10
**   v1    0.2 R 14083 Status: 0000 (u 0.000000 s 0.004000)
*    diag  0.0 ............................................................
#    top  TEST ../../../bin/varnishtest/tests/r01837.vtc TIMED OUT (kill -9)
#    top  TEST ../../../bin/varnishtest/tests/r01837.vtc FAILED (60.001) signal=9

1 @ SunOS 5.11 i86pc 1.04 32_gcc4.7 uplex

*    top   0.0 TEST ../../../bin/varnishtest/tests/r01837.vtc starting
[...]
*    top   0.0 TEST Test VCC errors out if probe is used before it is defined
[...]
**** v1    0.1 CLI TX|vcl 4.0;
**** v1    0.1 CLI TX|
**** v1    0.1 CLI TX|\tbackend b {
**** v1    0.1 CLI TX|\t\t.host = "127.0.0.1";
**** v1    0.1 CLI TX|\t\t.probe = p;
**** v1    0.1 CLI TX|\t}
**** v1    0.1 CLI TX|\tprobe p {
**** v1    0.1 CLI TX|\t}
**** v1    0.1 CLI TX|
**** v1    0.1 CLI TX|%XJEIFLH|)Xspa8P
***  v1    0.1 CLI RX  106
**** v1    0.1 CLI RX|Message from VCC-compiler:
**** v1    0.1 CLI RX|Security: Privilege proc_setid missing, will not change uid/gid
**** v1    0.1 CLI RX|Probe p not found
**** v1    0.1 CLI RX|('<vcl.inline>' Line 5 Pos 26)
**** v1    0.1 CLI RX|                .probe = p;
**** v1    0.1 CLI RX|-------------------------#-
**** v1    0.1 CLI RX|
**** v1    0.1 CLI RX|Running VCC-compiler failed, exited with 2
**** v1    0.1 CLI RX|VCL compilation failed
**   v1    0.1 VCL compilation failed (as expected)
***  v1    0.1 Found expected string: ("Probe p not found")
*    top   0.1 RESETTING after ../../../bin/varnishtest/tests/r01837.vtc
**   v1    0.1 Wait
**** v1    0.1 CLI TX|backend.list
***  v1    0.1 CLI RX  101
**** v1    0.1 CLI RX|Unknown request in manager process (child not running).
**** v1    0.1 CLI RX|Type 'help' for more info.
**   v1    0.1 Stop
**** v1    0.1 CLI TX|stop
***  v1    0.1 CLI RX  300
**** v1    0.1 CLI RX|Child in state stopped
**** v1    0.1 CLI TX|status
***  v1    0.1 CLI RX  200
**** v1    0.1 CLI RX|Child in state stopped
**** v1    0.1 STDOUT poll 0x10
**   v1    0.1 R 76667 Status: 0000 (u 0.004000 s 0.016000)
*    diag  0.0 ............................................................
#    top  TEST ../../../bin/varnishtest/tests/r01837.vtc TIMED OUT (kill -9)
#    top  TEST ../../../bin/varnishtest/tests/r01837.vtc FAILED (60.002) signal=9

1 @ SunOS 5.11 i86pc 1.04 32_gcc4.7 uplex

*    top   0.0 TEST ../../../bin/varnishtest/tests/r01837.vtc starting
[...]
*    top   0.0 TEST Test VCC errors out if probe is used before it is defined
[...]
**** v1    0.1 CLI TX|vcl 4.0;
**** v1    0.1 CLI TX|
**** v1    0.1 CLI TX|\tbackend b {
**** v1    0.1 CLI TX|\t\t.host = "127.0.0.1";
**** v1    0.1 CLI TX|\t\t.probe = p;
**** v1    0.1 CLI TX|\t}
**** v1    0.1 CLI TX|\tprobe p {
**** v1    0.1 CLI TX|\t}
**** v1    0.1 CLI TX|
**** v1    0.1 CLI TX|%XJEIFLH|)Xspa8P
***  v1    0.1 CLI RX  106
**** v1    0.1 CLI RX|Message from VCC-compiler:
**** v1    0.1 CLI RX|Security: Privilege proc_setid missing, will not change uid/gid
**** v1    0.1 CLI RX|Probe p not found
**** v1    0.1 CLI RX|('<vcl.inline>' Line 5 Pos 26)
**** v1    0.1 CLI RX|                .probe = p;
**** v1    0.1 CLI RX|-------------------------#-
**** v1    0.1 CLI RX|
**** v1    0.1 CLI RX|Running VCC-compiler failed, exited with 2
**** v1    0.1 CLI RX|VCL compilation failed
**   v1    0.1 VCL compilation failed (as expected)
***  v1    0.1 Found expected string: ("Probe p not found")
*    top   0.1 RESETTING after ../../../bin/varnishtest/tests/r01837.vtc
**   v1    0.1 Wait
**** v1    0.1 CLI TX|backend.list
***  v1    0.1 CLI RX  101
**** v1    0.1 CLI RX|Unknown request in manager process (child not running).
**** v1    0.1 CLI RX|Type 'help' for more info.
**   v1    0.1 Stop
**** v1    0.1 CLI TX|stop
***  v1    0.1 CLI RX  300
**** v1    0.1 CLI RX|Child in state stopped
**** v1    0.1 CLI TX|status
***  v1    0.1 CLI RX  200
**** v1    0.1 CLI RX|Child in state stopped
**** v1    0.1 STDOUT poll 0x10
**   v1    0.1 R 92815 Status: 0000 (u 0.004000 s 0.017000)
*    diag  0.0 ............................................................
#    top  TEST ../../../bin/varnishtest/tests/r01837.vtc TIMED OUT (kill -9)
#    top  TEST ../../../bin/varnishtest/tests/r01837.vtc FAILED (60.001) signal=9

1 @ SunOS 5.11 i86pc 1.04 32_gcc4.7 uplex

*    top   0.0 TEST ../../../bin/varnishtest/tests/r01837.vtc starting
[...]
*    top   0.0 TEST Test VCC errors out if probe is used before it is defined
[...]
**** v1    0.1 CLI TX|vcl 4.0;
**** v1    0.1 CLI TX|
**** v1    0.1 CLI TX|\tbackend b {
**** v1    0.1 CLI TX|\t\t.host = "127.0.0.1";
**** v1    0.1 CLI TX|\t\t.probe = p;
**** v1    0.1 CLI TX|\t}
**** v1    0.1 CLI TX|\tprobe p {
**** v1    0.1 CLI TX|\t}
**** v1    0.1 CLI TX|
**** v1    0.1 CLI TX|%XJEIFLH|)Xspa8P
***  v1    0.1 CLI RX  106
**** v1    0.1 CLI RX|Message from VCC-compiler:
**** v1    0.1 CLI RX|Security: Privilege proc_setid missing, will not change uid/gid
**** v1    0.1 CLI RX|Probe p not found
**** v1    0.1 CLI RX|('<vcl.inline>' Line 5 Pos 26)
**** v1    0.1 CLI RX|                .probe = p;
**** v1    0.1 CLI RX|-------------------------#-
**** v1    0.1 CLI RX|
**** v1    0.1 CLI RX|Running VCC-compiler failed, exited with 2
**** v1    0.1 CLI RX|VCL compilation failed
**   v1    0.1 VCL compilation failed (as expected)
***  v1    0.1 Found expected string: ("Probe p not found")
*    top   0.1 RESETTING after ../../../bin/varnishtest/tests/r01837.vtc
**   v1    0.1 Wait
**** v1    0.1 CLI TX|backend.list
***  v1    0.1 CLI RX  101
**** v1    0.1 CLI RX|Unknown request in manager process (child not running).
**** v1    0.1 CLI RX|Type 'help' for more info.
**   v1    0.1 Stop
**** v1    0.1 CLI TX|stop
***  v1    0.1 CLI RX  300
**** v1    0.1 CLI RX|Child in state stopped
**** v1    0.1 CLI TX|status
***  v1    0.1 CLI RX  200
**** v1    0.1 CLI RX|Child in state stopped
**** v1    0.1 STDOUT poll 0x10
**   v1    0.1 R 25225 Status: 0000 (u 0.004000 s 0.018000)
*    diag  0.0 ............................................................
#    top  TEST ../../../bin/varnishtest/tests/r01837.vtc TIMED OUT (kill -9)
#    top  TEST ../../../bin/varnishtest/tests/r01837.vtc FAILED (60.003) signal=9

1 @ Linux 3.10.0 x86_64 1.02 mblissett

*    top   0.0 TEST ../../../bin/varnishtest/tests/r01837.vtc starting
[...]
*    top   0.0 TEST Test VCC errors out if probe is used before it is defined
[...]
**** v1    0.1 CLI TX|vcl.inline vcl1 << %XJEIFLH|)Xspa8P
**** v1    0.1 CLI TX|vcl 4.0;
**** v1    0.1 CLI TX|
**** v1    0.1 CLI TX|\tbackend b {
**** v1    0.1 CLI TX|\t\t.host = "127.0.0.1";
**** v1    0.1 CLI TX|\t\t.probe = p;
**** v1    0.1 CLI TX|\t}
**** v1    0.1 CLI TX|\tprobe p {
**** v1    0.1 CLI TX|\t}
**** v1    0.1 CLI TX|
**** v1    0.1 CLI TX|%XJEIFLH|)Xspa8P
***  v1    0.1 CLI RX  106
**** v1    0.1 CLI RX|Message from VCC-compiler:
**** v1    0.1 CLI RX|Probe p not found
**** v1    0.1 CLI RX|('<vcl.inline>' Line 5 Pos 26)
**** v1    0.1 CLI RX|                .probe = p;
**** v1    0.1 CLI RX|-------------------------#-
**** v1    0.1 CLI RX|
**** v1    0.1 CLI RX|Running VCC-compiler failed, exited with 2
**** v1    0.1 CLI RX|VCL compilation failed
**   v1    0.1 VCL compilation failed (as expected)
***  v1    0.1 Found expected string: ("Probe p not found")
*    top   0.1 RESETTING after ../../../bin/varnishtest/tests/r01837.vtc
**   v1    0.1 Wait
**** v1    0.1 CLI TX|backend.list
***  v1    0.2 CLI RX  101
**** v1    0.2 CLI RX|Unknown request in manager process (child not running).
**** v1    0.2 CLI RX|Type 'help' for more info.
**   v1    0.2 Stop
**** v1    0.2 CLI TX|stop
***  v1    0.2 CLI RX  300
**** v1    0.2 CLI RX|Child in state stopped
**** v1    0.2 CLI TX|status
***  v1    0.2 CLI RX  200
**** v1    0.2 CLI RX|Child in state stopped
**** v1    0.2 STDOUT poll 0x10
**   v1    0.2 R 26123 Status: 0000 (u 0.000000 s 0.012278)
*    diag  0.0 ............................................................
#    top  TEST ../../../bin/varnishtest/tests/r01837.vtc TIMED OUT (kill -9)
#    top  TEST ../../../bin/varnishtest/tests/r01837.vtc FAILED (60.002) signal=9

1 @ SunOS 5.11 i86pc 1.04 32_gcc4.7 uplex

*    top   0.0 TEST ../../../bin/varnishtest/tests/r01837.vtc starting
[...]
*    top   0.0 TEST Test VCC errors out if probe is used before it is defined
[...]
**** v1    0.1 CLI TX|vcl 4.0;
**** v1    0.1 CLI TX|
**** v1    0.1 CLI TX|\tbackend b {
**** v1    0.1 CLI TX|\t\t.host = "127.0.0.1";
**** v1    0.1 CLI TX|\t\t.probe = p;
**** v1    0.1 CLI TX|\t}
**** v1    0.1 CLI TX|\tprobe p {
**** v1    0.1 CLI TX|\t}
**** v1    0.1 CLI TX|
**** v1    0.1 CLI TX|%XJEIFLH|)Xspa8P
***  v1    0.1 CLI RX  106
**** v1    0.1 CLI RX|Message from VCC-compiler:
**** v1    0.1 CLI RX|Security: Privilege proc_setid missing, will not change uid/gid
**** v1    0.1 CLI RX|Probe p not found
**** v1    0.1 CLI RX|('<vcl.inline>' Line 5 Pos 26)
**** v1    0.1 CLI RX|                .probe = p;
**** v1    0.1 CLI RX|-------------------------#-
**** v1    0.1 CLI RX|
**** v1    0.1 CLI RX|Running VCC-compiler failed, exited with 2
**** v1    0.1 CLI RX|VCL compilation failed
**   v1    0.1 VCL compilation failed (as expected)
***  v1    0.1 Found expected string: ("Probe p not found")
*    top   0.1 RESETTING after ../../../bin/varnishtest/tests/r01837.vtc
**   v1    0.1 Wait
**** v1    0.1 CLI TX|backend.list
***  v1    0.1 CLI RX  101
**** v1    0.1 CLI RX|Unknown request in manager process (child not running).
**** v1    0.1 CLI RX|Type 'help' for more info.
**   v1    0.1 Stop
**** v1    0.1 CLI TX|stop
***  v1    0.1 CLI RX  300
**** v1    0.1 CLI RX|Child in state stopped
**** v1    0.1 CLI TX|status
***  v1    0.1 CLI RX  200
**** v1    0.1 CLI RX|Child in state stopped
**** v1    0.1 STDOUT poll 0x10
**   v1    0.1 R 42866 Status: 0000 (u 0.004000 s 0.019000)
*    diag  0.0 ............................................................
#    top  TEST ../../../bin/varnishtest/tests/r01837.vtc TIMED OUT (kill -9)
#    top  TEST ../../../bin/varnishtest/tests/r01837.vtc FAILED (60.002) signal=9

1 @ SunOS 5.11 i86pc 1.04 64_sun12.4 uplex

*    top   0.0 TEST ../../../bin/varnishtest/tests/r01837.vtc starting
[...]
*    top   0.0 TEST Test VCC errors out if probe is used before it is defined
[...]
**** v1    0.1 CLI TX|vcl 4.0;
**** v1    0.1 CLI TX|
**** v1    0.1 CLI TX|\tbackend b {
**** v1    0.1 CLI TX|\t\t.host = "127.0.0.1";
**** v1    0.1 CLI TX|\t\t.probe = p;
**** v1    0.1 CLI TX|\t}
**** v1    0.1 CLI TX|\tprobe p {
**** v1    0.1 CLI TX|\t}
**** v1    0.1 CLI TX|
**** v1    0.1 CLI TX|%XJEIFLH|)Xspa8P
***  v1    0.1 CLI RX  106
**** v1    0.1 CLI RX|Message from VCC-compiler:
**** v1    0.1 CLI RX|Security: Privilege proc_setid missing, will not change uid/gid
**** v1    0.1 CLI RX|Probe p not found
**** v1    0.1 CLI RX|('<vcl.inline>' Line 5 Pos 26)
**** v1    0.1 CLI RX|                .probe = p;
**** v1    0.1 CLI RX|-------------------------#-
**** v1    0.1 CLI RX|
**** v1    0.1 CLI RX|Running VCC-compiler failed, exited with 2
**** v1    0.1 CLI RX|VCL compilation failed
**   v1    0.1 VCL compilation failed (as expected)
***  v1    0.1 Found expected string: ("Probe p not found")
*    top   0.1 RESETTING after ../../../bin/varnishtest/tests/r01837.vtc
**   v1    0.1 Wait
**** v1    0.1 CLI TX|backend.list
***  v1    0.1 CLI RX  101
**** v1    0.1 CLI RX|Unknown request in manager process (child not running).
**** v1    0.1 CLI RX|Type 'help' for more info.
**   v1    0.1 Stop
**** v1    0.1 CLI TX|stop
***  v1    0.1 CLI RX  300
**** v1    0.1 CLI RX|Child in state stopped
**** v1    0.1 CLI TX|status
***  v1    0.1 CLI RX  200
**** v1    0.1 CLI RX|Child in state stopped
**** v1    0.1 STDOUT poll 0x10
**   v1    0.1 R 3181 Status: 0000 (u 0.007000 s 0.022000)
*    diag  0.0 ............................................................
#    top  TEST ../../../bin/varnishtest/tests/r01837.vtc TIMED OUT (kill -9)
#    top  TEST ../../../bin/varnishtest/tests/r01837.vtc FAILED (60.004) signal=9

1 @ SunOS 5.11 i86pc 1.04 64_sun12.4 uplex

*    top   0.0 TEST ../../../bin/varnishtest/tests/r01837.vtc starting
[...]
*    top   0.0 TEST Test VCC errors out if probe is used before it is defined
[...]
**** v1    0.1 CLI TX|vcl 4.0;
**** v1    0.1 CLI TX|
**** v1    0.1 CLI TX|\tbackend b {
**** v1    0.1 CLI TX|\t\t.host = "127.0.0.1";
**** v1    0.1 CLI TX|\t\t.probe = p;
**** v1    0.1 CLI TX|\t}
**** v1    0.1 CLI TX|\tprobe p {
**** v1    0.1 CLI TX|\t}
**** v1    0.1 CLI TX|
**** v1    0.1 CLI TX|%XJEIFLH|)Xspa8P
***  v1    0.1 CLI RX  106
**** v1    0.1 CLI RX|Message from VCC-compiler:
**** v1    0.1 CLI RX|Security: Privilege proc_setid missing, will not change uid/gid
**** v1    0.1 CLI RX|Probe p not found
**** v1    0.1 CLI RX|('<vcl.inline>' Line 5 Pos 26)
**** v1    0.1 CLI RX|                .probe = p;
**** v1    0.1 CLI RX|-------------------------#-
**** v1    0.1 CLI RX|
**** v1    0.1 CLI RX|Running VCC-compiler failed, exited with 2
**** v1    0.1 CLI RX|VCL compilation failed
**   v1    0.1 VCL compilation failed (as expected)
***  v1    0.1 Found expected string: ("Probe p not found")
*    top   0.1 RESETTING after ../../../bin/varnishtest/tests/r01837.vtc
**   v1    0.1 Wait
**** v1    0.1 CLI TX|backend.list
***  v1    0.1 CLI RX  101
**** v1    0.1 CLI RX|Unknown request in manager process (child not running).
**** v1    0.1 CLI RX|Type 'help' for more info.
**   v1    0.1 Stop
**** v1    0.1 CLI TX|stop
***  v1    0.1 CLI RX  300
**** v1    0.1 CLI RX|Child in state stopped
**** v1    0.1 CLI TX|status
***  v1    0.1 CLI RX  200
**** v1    0.1 CLI RX|Child in state stopped
**** v1    0.1 STDOUT poll 0x10
**   v1    0.1 R 82025 Status: 0000 (u 0.007000 s 0.022000)
*    diag  0.0 ............................................................
#    top  TEST ../../../bin/varnishtest/tests/r01837.vtc TIMED OUT (kill -9)
#    top  TEST ../../../bin/varnishtest/tests/r01837.vtc FAILED (60.003) signal=9

1 @ SunOS 5.11 i86pc 1.04 32_gcc4.7 uplex

*    top   0.0 TEST ../../../bin/varnishtest/tests/r01837.vtc starting
[...]
*    top   0.0 TEST Test VCC errors out if probe is used before it is defined
[...]
**** v1    0.1 CLI TX|vcl 4.0;
**** v1    0.1 CLI TX|
**** v1    0.1 CLI TX|\tbackend b {
**** v1    0.1 CLI TX|\t\t.host = "127.0.0.1";
**** v1    0.1 CLI TX|\t\t.probe = p;
**** v1    0.1 CLI TX|\t}
**** v1    0.1 CLI TX|\tprobe p {
**** v1    0.1 CLI TX|\t}
**** v1    0.1 CLI TX|
**** v1    0.1 CLI TX|%XJEIFLH|)Xspa8P
***  v1    0.1 CLI RX  106
**** v1    0.1 CLI RX|Message from VCC-compiler:
**** v1    0.1 CLI RX|Security: Privilege proc_setid missing, will not change uid/gid
**** v1    0.1 CLI RX|Probe p not found
**** v1    0.1 CLI RX|('<vcl.inline>' Line 5 Pos 26)
**** v1    0.1 CLI RX|                .probe = p;
**** v1    0.1 CLI RX|-------------------------#-
**** v1    0.1 CLI RX|
**** v1    0.1 CLI RX|Running VCC-compiler failed, exited with 2
**** v1    0.1 CLI RX|VCL compilation failed
**   v1    0.1 VCL compilation failed (as expected)
***  v1    0.1 Found expected string: ("Probe p not found")
*    top   0.1 RESETTING after ../../../bin/varnishtest/tests/r01837.vtc
**   v1    0.1 Wait
**** v1    0.1 CLI TX|backend.list
***  v1    0.1 CLI RX  101
**** v1    0.1 CLI RX|Unknown request in manager process (child not running).
**** v1    0.1 CLI RX|Type 'help' for more info.
**   v1    0.1 Stop
**** v1    0.1 CLI TX|stop
***  v1    0.1 CLI RX  300
**** v1    0.1 CLI RX|Child in state stopped
**** v1    0.1 CLI TX|status
***  v1    0.1 CLI RX  200
**** v1    0.1 CLI RX|Child in state stopped
**** v1    0.1 STDOUT poll 0x10
**   v1    0.1 R 93888 Status: 0000 (u 0.006000 s 0.026000)
*    diag  0.0 ............................................................
#    top  TEST ../../../bin/varnishtest/tests/r01837.vtc TIMED OUT (kill -9)
#    top  TEST ../../../bin/varnishtest/tests/r01837.vtc FAILED (60.002) signal=9

1 @ SunOS 5.11 i86pc 1.04 32_gcc4.7 uplex

*    top   0.0 TEST ../../../bin/varnishtest/tests/r01837.vtc starting
[...]
*    top   0.0 TEST Test VCC errors out if probe is used before it is defined
[...]
**** v1    0.1 CLI TX|vcl 4.0;
**** v1    0.1 CLI TX|
**** v1    0.1 CLI TX|\tbackend b {
**** v1    0.1 CLI TX|\t\t.host = "127.0.0.1";
**** v1    0.1 CLI TX|\t\t.probe = p;
**** v1    0.1 CLI TX|\t}
**** v1    0.1 CLI TX|\tprobe p {
**** v1    0.1 CLI TX|\t}
**** v1    0.1 CLI TX|
**** v1    0.1 CLI TX|%XJEIFLH|)Xspa8P
***  v1    0.1 CLI RX  106
**** v1    0.1 CLI RX|Message from VCC-compiler:
**** v1    0.1 CLI RX|Security: Privilege proc_setid missing, will not change uid/gid
**** v1    0.1 CLI RX|Probe p not found
**** v1    0.1 CLI RX|('<vcl.inline>' Line 5 Pos 26)
**** v1    0.1 CLI RX|                .probe = p;
**** v1    0.1 CLI RX|-------------------------#-
**** v1    0.1 CLI RX|
**** v1    0.1 CLI RX|Running VCC-compiler failed, exited with 2
**** v1    0.1 CLI RX|VCL compilation failed
**   v1    0.1 VCL compilation failed (as expected)
***  v1    0.1 Found expected string: ("Probe p not found")
*    top   0.1 RESETTING after ../../../bin/varnishtest/tests/r01837.vtc
**   v1    0.1 Wait
**** v1    0.1 CLI TX|backend.list
***  v1    0.1 CLI RX  101
**** v1    0.1 CLI RX|Unknown request in manager process (child not running).
**** v1    0.1 CLI RX|Type 'help' for more info.
**   v1    0.1 Stop
**** v1    0.1 CLI TX|stop
***  v1    0.1 CLI RX  300
**** v1    0.1 CLI RX|Child in state stopped
**** v1    0.1 CLI TX|status
***  v1    0.1 CLI RX  200
**** v1    0.1 CLI RX|Child in state stopped
**** v1    0.1 STDOUT poll 0x10
**   v1    0.1 R 19321 Status: 0000 (u 0.004000 s 0.018000)
*    diag  0.0 ............................................................
#    top  TEST ../../../bin/varnishtest/tests/r01837.vtc TIMED OUT (kill -9)
#    top  TEST ../../../bin/varnishtest/tests/r01837.vtc FAILED (60.002) signal=9

1 @ Linux 3.10.0 x86_64 1.02 mblissett

*    top   0.0 TEST ../../../bin/varnishtest/tests/r01837.vtc starting
[...]
*    top   0.0 TEST Test VCC errors out if probe is used before it is defined
[...]
**** v1    0.1 CLI TX|vcl.inline vcl1 << %XJEIFLH|)Xspa8P
**** v1    0.1 CLI TX|vcl 4.0;
**** v1    0.1 CLI TX|
**** v1    0.1 CLI TX|\tbackend b {
**** v1    0.1 CLI TX|\t\t.host = "127.0.0.1";
**** v1    0.1 CLI TX|\t\t.probe = p;
**** v1    0.1 CLI TX|\t}
**** v1    0.1 CLI TX|\tprobe p {
**** v1    0.1 CLI TX|\t}
**** v1    0.1 CLI TX|
**** v1    0.1 CLI TX|%XJEIFLH|)Xspa8P
***  v1    0.1 CLI RX  106
**** v1    0.1 CLI RX|Message from VCC-compiler:
**** v1    0.1 CLI RX|Probe p not found
**** v1    0.1 CLI RX|('<vcl.inline>' Line 5 Pos 26)
**** v1    0.1 CLI RX|                .probe = p;
**** v1    0.1 CLI RX|-------------------------#-
**** v1    0.1 CLI RX|
**** v1    0.1 CLI RX|Running VCC-compiler failed, exited with 2
**** v1    0.1 CLI RX|VCL compilation failed
**   v1    0.1 VCL compilation failed (as expected)
***  v1    0.1 Found expected string: ("Probe p not found")
*    top   0.1 RESETTING after ../../../bin/varnishtest/tests/r01837.vtc
**   v1    0.1 Wait
**** v1    0.1 CLI TX|backend.list
***  v1    0.2 CLI RX  101
**** v1    0.2 CLI RX|Unknown request in manager process (child not running).
**** v1    0.2 CLI RX|Type 'help' for more info.
**   v1    0.2 Stop
**** v1    0.2 CLI TX|stop
***  v1    0.2 CLI RX  300
**** v1    0.2 CLI RX|Child in state stopped
**** v1    0.2 CLI TX|status
***  v1    0.2 CLI RX  200
**** v1    0.2 CLI RX|Child in state stopped
**** v1    0.2 STDOUT poll 0x10
**   v1    0.2 R 3885 Status: 0000 (u 0.004212 s 0.011671)
*    diag  0.0 ............................................................
#    top  TEST ../../../bin/varnishtest/tests/r01837.vtc TIMED OUT (kill -9)
#    top  TEST ../../../bin/varnishtest/tests/r01837.vtc FAILED (60.002) signal=9

1 @ Ubuntu LTS i686 1.04 fgs

*    top   0.0 TEST ../../../bin/varnishtest/tests/r01837.vtc starting
[...]
*    top   0.0 TEST Test VCC errors out if probe is used before it is defined
[...]
**** v1    0.1 CLI TX|vcl.inline vcl1 << %XJEIFLH|)Xspa8P
**** v1    0.1 CLI TX|vcl 4.0;
**** v1    0.1 CLI TX|
**** v1    0.1 CLI TX|\tbackend b {
**** v1    0.1 CLI TX|\t\t.host = "127.0.0.1";
**** v1    0.1 CLI TX|\t\t.probe = p;
**** v1    0.1 CLI TX|\t}
**** v1    0.1 CLI TX|\tprobe p {
**** v1    0.1 CLI TX|\t}
**** v1    0.1 CLI TX|
**** v1    0.1 CLI TX|%XJEIFLH|)Xspa8P
***  v1    0.1 CLI RX  106
**** v1    0.1 CLI RX|Message from VCC-compiler:
**** v1    0.1 CLI RX|Probe p not found
**** v1    0.1 CLI RX|('<vcl.inline>' Line 5 Pos 26)
**** v1    0.1 CLI RX|                .probe = p;
**** v1    0.1 CLI RX|-------------------------#-
**** v1    0.1 CLI RX|
**** v1    0.1 CLI RX|Running VCC-compiler failed, exited with 2
**** v1    0.1 CLI RX|VCL compilation failed
**   v1    0.1 VCL compilation failed (as expected)
***  v1    0.1 Found expected string: ("Probe p not found")
*    top   0.1 RESETTING after ../../../bin/varnishtest/tests/r01837.vtc
**   v1    0.1 Wait
**** v1    0.1 CLI TX|backend.list
***  v1    0.1 CLI RX  101
**** v1    0.1 CLI RX|Unknown request in manager process (child not running).
**** v1    0.1 CLI RX|Type 'help' for more info.
**   v1    0.1 Stop
**** v1    0.1 CLI TX|stop
***  v1    0.2 CLI RX  300
**** v1    0.2 CLI RX|Child in state stopped
**** v1    0.2 CLI TX|status
***  v1    0.2 CLI RX  200
**** v1    0.2 CLI RX|Child in state stopped
**** v1    0.2 STDOUT poll 0x10
**   v1    0.2 R 20318 Status: 0000 (u 0.004000 s 0.000000)
*    diag  0.0 ............................................................
#    top  TEST ../../../bin/varnishtest/tests/r01837.vtc TIMED OUT (kill -9)
#    top  TEST ../../../bin/varnishtest/tests/r01837.vtc FAILED (60.001) signal=9

1 @ SunOS 5.11 i86pc 1.04 64_gcc4.7 uplex

*    top   0.0 TEST ../../../bin/varnishtest/tests/r01837.vtc starting
[...]
*    top   0.0 TEST Test VCC errors out if probe is used before it is defined
[...]
**** v1    0.1 CLI TX|vcl 4.0;
**** v1    0.1 CLI TX|
**** v1    0.1 CLI TX|\tbackend b {
**** v1    0.1 CLI TX|\t\t.host = "127.0.0.1";
**** v1    0.1 CLI TX|\t\t.probe = p;
**** v1    0.1 CLI TX|\t}
**** v1    0.1 CLI TX|\tprobe p {
**** v1    0.1 CLI TX|\t}
**** v1    0.1 CLI TX|
**** v1    0.1 CLI TX|%XJEIFLH|)Xspa8P
***  v1    0.1 CLI RX  106
**** v1    0.1 CLI RX|Message from VCC-compiler:
**** v1    0.1 CLI RX|Security: Privilege proc_setid missing, will not change uid/gid
**** v1    0.1 CLI RX|Probe p not found
**** v1    0.1 CLI RX|('<vcl.inline>' Line 5 Pos 26)
**** v1    0.1 CLI RX|                .probe = p;
**** v1    0.1 CLI RX|-------------------------#-
**** v1    0.1 CLI RX|
**** v1    0.1 CLI RX|Running VCC-compiler failed, exited with 2
**** v1    0.1 CLI RX|VCL compilation failed
**   v1    0.1 VCL compilation failed (as expected)
***  v1    0.1 Found expected string: ("Probe p not found")
*    top   0.1 RESETTING after ../../../bin/varnishtest/tests/r01837.vtc
**   v1    0.1 Wait
**** v1    0.1 CLI TX|backend.list
***  v1    0.1 CLI RX  101
**** v1    0.1 CLI RX|Unknown request in manager process (child not running).
**** v1    0.1 CLI RX|Type 'help' for more info.
**   v1    0.1 Stop
**** v1    0.1 CLI TX|stop
***  v1    0.1 CLI RX  300
**** v1    0.1 CLI RX|Child in state stopped
**** v1    0.1 CLI TX|status
***  v1    0.1 CLI RX  200
**** v1    0.1 CLI RX|Child in state stopped
**** v1    0.1 STDOUT poll 0x10
**   v1    0.1 R 51026 Status: 0000 (u 0.006000 s 0.021000)
*    diag  0.0 ............................................................
#    top  TEST ../../../bin/varnishtest/tests/r01837.vtc TIMED OUT (kill -9)
#    top  TEST ../../../bin/varnishtest/tests/r01837.vtc FAILED (60.004) signal=9

1 @ SunOS 5.11 i86pc 1.04 32_sun12.4 uplex

*    top   0.0 TEST ../../../bin/varnishtest/tests/r01837.vtc starting
[...]
*    top   0.0 TEST Test VCC errors out if probe is used before it is defined
[...]
**** v1    0.1 CLI TX|vcl 4.0;
**** v1    0.1 CLI TX|
**** v1    0.1 CLI TX|\tbackend b {
**** v1    0.1 CLI TX|\t\t.host = "127.0.0.1";
**** v1    0.1 CLI TX|\t\t.probe = p;
**** v1    0.1 CLI TX|\t}
**** v1    0.1 CLI TX|\tprobe p {
**** v1    0.1 CLI TX|\t}
**** v1    0.1 CLI TX|
**** v1    0.1 CLI TX|%XJEIFLH|)Xspa8P
***  v1    0.1 CLI RX  106
**** v1    0.1 CLI RX|Message from VCC-compiler:
**** v1    0.1 CLI RX|Security: Privilege proc_setid missing, will not change uid/gid
**** v1    0.1 CLI RX|Probe p not found
**** v1    0.1 CLI RX|('<vcl.inline>' Line 5 Pos 26)
**** v1    0.1 CLI RX|                .probe = p;
**** v1    0.1 CLI RX|-------------------------#-
**** v1    0.1 CLI RX|
**** v1    0.1 CLI RX|Running VCC-compiler failed, exited with 2
**** v1    0.1 CLI RX|VCL compilation failed
**   v1    0.1 VCL compilation failed (as expected)
***  v1    0.1 Found expected string: ("Probe p not found")
*    top   0.1 RESETTING after ../../../bin/varnishtest/tests/r01837.vtc
**   v1    0.1 Wait
**** v1    0.1 CLI TX|backend.list
***  v1    0.1 CLI RX  101
**** v1    0.1 CLI RX|Unknown request in manager process (child not running).
**** v1    0.1 CLI RX|Type 'help' for more info.
**   v1    0.1 Stop
**** v1    0.1 CLI TX|stop
***  v1    0.1 CLI RX  300
**** v1    0.1 CLI RX|Child in state stopped
**** v1    0.1 CLI TX|status
***  v1    0.1 CLI RX  200
**** v1    0.1 CLI RX|Child in state stopped
**** v1    0.1 STDOUT poll 0x10
**   v1    0.1 R 45412 Status: 0000 (u 0.004000 s 0.018000)
*    diag  0.0 ............................................................
#    top  TEST ../../../bin/varnishtest/tests/r01837.vtc TIMED OUT (kill -9)
#    top  TEST ../../../bin/varnishtest/tests/r01837.vtc FAILED (60.002) signal=9

1 @ SunOS 5.11 i86pc 1.04 64_gcc4.7 uplex

*    top   0.0 TEST ../../../bin/varnishtest/tests/r01837.vtc starting
[...]
*    top   0.0 TEST Test VCC errors out if probe is used before it is defined
[...]
**** v1    0.1 CLI TX|vcl 4.0;
**** v1    0.1 CLI TX|
**** v1    0.1 CLI TX|\tbackend b {
**** v1    0.1 CLI TX|\t\t.host = "127.0.0.1";
**** v1    0.1 CLI TX|\t\t.probe = p;
**** v1    0.1 CLI TX|\t}
**** v1    0.1 CLI TX|\tprobe p {
**** v1    0.1 CLI TX|\t}
**** v1    0.1 CLI TX|
**** v1    0.1 CLI TX|%XJEIFLH|)Xspa8P
***  v1    0.1 CLI RX  106
**** v1    0.1 CLI RX|Message from VCC-compiler:
**** v1    0.1 CLI RX|Security: Privilege proc_setid missing, will not change uid/gid
**** v1    0.1 CLI RX|Probe p not found
**** v1    0.1 CLI RX|('<vcl.inline>' Line 5 Pos 26)
**** v1    0.1 CLI RX|                .probe = p;
**** v1    0.1 CLI RX|-------------------------#-
**** v1    0.1 CLI RX|
**** v1    0.1 CLI RX|Running VCC-compiler failed, exited with 2
**** v1    0.1 CLI RX|VCL compilation failed
**   v1    0.1 VCL compilation failed (as expected)
***  v1    0.1 Found expected string: ("Probe p not found")
*    top   0.1 RESETTING after ../../../bin/varnishtest/tests/r01837.vtc
**   v1    0.1 Wait
**** v1    0.1 CLI TX|backend.list
***  v1    0.1 CLI RX  101
**** v1    0.1 CLI RX|Unknown request in manager process (child not running).
**** v1    0.1 CLI RX|Type 'help' for more info.
**   v1    0.1 Stop
**** v1    0.1 CLI TX|stop
***  v1    0.1 CLI RX  300
**** v1    0.1 CLI RX|Child in state stopped
**** v1    0.1 CLI TX|status
***  v1    0.1 CLI RX  200
**** v1    0.1 CLI RX|Child in state stopped
**** v1    0.1 STDOUT poll 0x10
**   v1    0.1 R 41200 Status: 0000 (u 0.007000 s 0.022000)
*    diag  0.0 ............................................................
#    top  TEST ../../../bin/varnishtest/tests/r01837.vtc TIMED OUT (kill -9)
#    top  TEST ../../../bin/varnishtest/tests/r01837.vtc FAILED (60.004) signal=9

1 @ SunOS 5.11 i86pc 1.04 64_gcc4.7 uplex

*    top   0.0 TEST ../../../bin/varnishtest/tests/r01837.vtc starting
[...]
*    top   0.0 TEST Test VCC errors out if probe is used before it is defined
[...]
**** v1    0.1 CLI TX|vcl 4.0;
**** v1    0.1 CLI TX|
**** v1    0.1 CLI TX|\tbackend b {
**** v1    0.1 CLI TX|\t\t.host = "127.0.0.1";
**** v1    0.1 CLI TX|\t\t.probe = p;
**** v1    0.1 CLI TX|\t}
**** v1    0.1 CLI TX|\tprobe p {
**** v1    0.1 CLI TX|\t}
**** v1    0.1 CLI TX|
**** v1    0.1 CLI TX|%XJEIFLH|)Xspa8P
***  v1    0.1 CLI RX  106
**** v1    0.1 CLI RX|Message from VCC-compiler:
**** v1    0.1 CLI RX|Security: Privilege proc_setid missing, will not change uid/gid
**** v1    0.1 CLI RX|Probe p not found
**** v1    0.1 CLI RX|('<vcl.inline>' Line 5 Pos 26)
**** v1    0.1 CLI RX|                .probe = p;
**** v1    0.1 CLI RX|-------------------------#-
**** v1    0.1 CLI RX|
**** v1    0.1 CLI RX|Running VCC-compiler failed, exited with 2
**** v1    0.1 CLI RX|VCL compilation failed
**   v1    0.1 VCL compilation failed (as expected)
***  v1    0.1 Found expected string: ("Probe p not found")
*    top   0.1 RESETTING after ../../../bin/varnishtest/tests/r01837.vtc
**   v1    0.1 Wait
**** v1    0.1 CLI TX|backend.list
***  v1    0.1 CLI RX  101
**** v1    0.1 CLI RX|Unknown request in manager process (child not running).
**** v1    0.1 CLI RX|Type 'help' for more info.
**   v1    0.1 Stop
**** v1    0.1 CLI TX|stop
***  v1    0.1 CLI RX  300
**** v1    0.1 CLI RX|Child in state stopped
**** v1    0.1 CLI TX|status
***  v1    0.1 CLI RX  200
**** v1    0.1 CLI RX|Child in state stopped
**** v1    0.1 STDOUT poll 0x10
**   v1    0.1 R 42265 Status: 0000 (u 0.007000 s 0.021000)
*    diag  0.0 ............................................................
#    top  TEST ../../../bin/varnishtest/tests/r01837.vtc TIMED OUT (kill -9)
#    top  TEST ../../../bin/varnishtest/tests/r01837.vtc FAILED (60.004) signal=9

1 @ SunOS 5.11 i86pc 1.04 32_gcc4.7 uplex

*    top   0.0 TEST ../../../bin/varnishtest/tests/r01837.vtc starting
[...]
*    top   0.0 TEST Test VCC errors out if probe is used before it is defined
[...]
**** v1    0.1 CLI TX|vcl 4.0;
**** v1    0.1 CLI TX|
**** v1    0.1 CLI TX|\tbackend b {
**** v1    0.1 CLI TX|\t\t.host = "127.0.0.1";
**** v1    0.1 CLI TX|\t\t.probe = p;
**** v1    0.1 CLI TX|\t}
**** v1    0.1 CLI TX|\tprobe p {
**** v1    0.1 CLI TX|\t}
**** v1    0.1 CLI TX|
**** v1    0.1 CLI TX|%XJEIFLH|)Xspa8P
***  v1    0.1 CLI RX  106
**** v1    0.1 CLI RX|Message from VCC-compiler:
**** v1    0.1 CLI RX|Security: Privilege proc_setid missing, will not change uid/gid
**** v1    0.1 CLI RX|Probe p not found
**** v1    0.1 CLI RX|('<vcl.inline>' Line 5 Pos 26)
**** v1    0.1 CLI RX|                .probe = p;
**** v1    0.1 CLI RX|-------------------------#-
**** v1    0.1 CLI RX|
**** v1    0.1 CLI RX|Running VCC-compiler failed, exited with 2
**** v1    0.1 CLI RX|VCL compilation failed
**   v1    0.1 VCL compilation failed (as expected)
***  v1    0.1 Found expected string: ("Probe p not found")
*    top   0.1 RESETTING after ../../../bin/varnishtest/tests/r01837.vtc
**   v1    0.1 Wait
**** v1    0.1 CLI TX|backend.list
***  v1    0.1 CLI RX  101
**** v1    0.1 CLI RX|Unknown request in manager process (child not running).
**** v1    0.1 CLI RX|Type 'help' for more info.
**   v1    0.1 Stop
**** v1    0.1 CLI TX|stop
***  v1    0.1 CLI RX  300
**** v1    0.1 CLI RX|Child in state stopped
**** v1    0.1 CLI TX|status
***  v1    0.1 CLI RX  200
**** v1    0.1 CLI RX|Child in state stopped
**** v1    0.1 STDOUT poll 0x10
**   v1    0.1 R 23932 Status: 0000 (u 0.005000 s 0.018000)
*    diag  0.0 ............................................................
#    top  TEST ../../../bin/varnishtest/tests/r01837.vtc TIMED OUT (kill -9)
#    top  TEST ../../../bin/varnishtest/tests/r01837.vtc FAILED (60.002) signal=9

1 @ Linux 3.10.0 x86_64 1.02 mblissett

*    top   0.0 TEST ../../../bin/varnishtest/tests/r01837.vtc starting
[...]
*    top   0.0 TEST Test VCC errors out if probe is used before it is defined
[...]
**** v1    0.1 CLI TX|vcl.inline vcl1 << %XJEIFLH|)Xspa8P
**** v1    0.1 CLI TX|vcl 4.0;
**** v1    0.1 CLI TX|
**** v1    0.1 CLI TX|\tbackend b {
**** v1    0.1 CLI TX|\t\t.host = "127.0.0.1";
**** v1    0.1 CLI TX|\t\t.probe = p;
**** v1    0.1 CLI TX|\t}
**** v1    0.1 CLI TX|\tprobe p {
**** v1    0.1 CLI TX|\t}
**** v1    0.1 CLI TX|
**** v1    0.1 CLI TX|%XJEIFLH|)Xspa8P
***  v1    0.1 CLI RX  106
**** v1    0.1 CLI RX|Message from VCC-compiler:
**** v1    0.1 CLI RX|Probe p not found
**** v1    0.1 CLI RX|('<vcl.inline>' Line 5 Pos 26)
**** v1    0.1 CLI RX|                .probe = p;
**** v1    0.1 CLI RX|-------------------------#-
**** v1    0.1 CLI RX|
**** v1    0.1 CLI RX|Running VCC-compiler failed, exited with 2
**** v1    0.1 CLI RX|VCL compilation failed
**   v1    0.1 VCL compilation failed (as expected)
***  v1    0.1 Found expected string: ("Probe p not found")
*    top   0.1 RESETTING after ../../../bin/varnishtest/tests/r01837.vtc
**   v1    0.1 Wait
**** v1    0.1 CLI TX|backend.list
***  v1    0.2 CLI RX  101
**** v1    0.2 CLI RX|Unknown request in manager process (child not running).
**** v1    0.2 CLI RX|Type 'help' for more info.
**   v1    0.2 Stop
**** v1    0.2 CLI TX|stop
***  v1    0.2 CLI RX  300
**** v1    0.2 CLI RX|Child in state stopped
**** v1    0.2 CLI TX|status
***  v1    0.2 CLI RX  200
**** v1    0.2 CLI RX|Child in state stopped
**** v1    0.2 STDOUT poll 0x10
**   v1    0.2 R 6999 Status: 0000 (u 0.001305 s 0.012387)
*    diag  0.0 ............................................................
#    top  TEST ../../../bin/varnishtest/tests/r01837.vtc TIMED OUT (kill -9)
#    top  TEST ../../../bin/varnishtest/tests/r01837.vtc FAILED (60.001) signal=9

1 @ SunOS 5.11 i86pc 1.04 64_gcc4.7 uplex

*    top   0.0 TEST ../../../bin/varnishtest/tests/r01837.vtc starting
[...]
*    top   0.0 TEST Test VCC errors out if probe is used before it is defined
[...]
**** v1    0.1 CLI TX|vcl 4.0;
**** v1    0.1 CLI TX|
**** v1    0.1 CLI TX|\tbackend b {
**** v1    0.1 CLI TX|\t\t.host = "127.0.0.1";
**** v1    0.1 CLI TX|\t\t.probe = p;
**** v1    0.1 CLI TX|\t}
**** v1    0.1 CLI TX|\tprobe p {
**** v1    0.1 CLI TX|\t}
**** v1    0.1 CLI TX|
**** v1    0.1 CLI TX|%XJEIFLH|)Xspa8P
***  v1    0.1 CLI RX  106
**** v1    0.1 CLI RX|Message from VCC-compiler:
**** v1    0.1 CLI RX|Security: Privilege proc_setid missing, will not change uid/gid
**** v1    0.1 CLI RX|Probe p not found
**** v1    0.1 CLI RX|('<vcl.inline>' Line 5 Pos 26)
**** v1    0.1 CLI RX|                .probe = p;
**** v1    0.1 CLI RX|-------------------------#-
**** v1    0.1 CLI RX|
**** v1    0.1 CLI RX|Running VCC-compiler failed, exited with 2
**** v1    0.1 CLI RX|VCL compilation failed
**   v1    0.1 VCL compilation failed (as expected)
***  v1    0.1 Found expected string: ("Probe p not found")
*    top   0.1 RESETTING after ../../../bin/varnishtest/tests/r01837.vtc
**   v1    0.1 Wait
**** v1    0.1 CLI TX|backend.list
***  v1    0.1 CLI RX  101
**** v1    0.1 CLI RX|Unknown request in manager process (child not running).
**** v1    0.1 CLI RX|Type 'help' for more info.
**   v1    0.1 Stop
**** v1    0.1 CLI TX|stop
***  v1    0.1 CLI RX  300
**** v1    0.1 CLI RX|Child in state stopped
**** v1    0.1 CLI TX|status
***  v1    0.1 CLI RX  200
**** v1    0.1 CLI RX|Child in state stopped
**** v1    0.1 STDOUT poll 0x10
**   v1    0.1 R 5795 Status: 0000 (u 0.007000 s 0.022000)
*    diag  0.0 ............................................................
#    top  TEST ../../../bin/varnishtest/tests/r01837.vtc TIMED OUT (kill -9)
#    top  TEST ../../../bin/varnishtest/tests/r01837.vtc FAILED (60.004) signal=9

1 @ Ubuntu LTS i686 1.04 fgs

*    top   0.0 TEST ../../../bin/varnishtest/tests/r01837.vtc starting
[...]
*    top   0.0 TEST Test VCC errors out if probe is used before it is defined
[...]
**** v1    0.1 CLI TX|vcl.inline vcl1 << %XJEIFLH|)Xspa8P
**** v1    0.1 CLI TX|vcl 4.0;
**** v1    0.1 CLI TX|
**** v1    0.1 CLI TX|\tbackend b {
**** v1    0.1 CLI TX|\t\t.host = "127.0.0.1";
**** v1    0.1 CLI TX|\t\t.probe = p;
**** v1    0.1 CLI TX|\t}
**** v1    0.1 CLI TX|\tprobe p {
**** v1    0.1 CLI TX|\t}
**** v1    0.1 CLI TX|
**** v1    0.1 CLI TX|%XJEIFLH|)Xspa8P
***  v1    0.1 CLI RX  106
**** v1    0.1 CLI RX|Message from VCC-compiler:
**** v1    0.1 CLI RX|Probe p not found
**** v1    0.1 CLI RX|('<vcl.inline>' Line 5 Pos 26)
**** v1    0.1 CLI RX|                .probe = p;
**** v1    0.1 CLI RX|-------------------------#-
**** v1    0.1 CLI RX|
**** v1    0.1 CLI RX|Running VCC-compiler failed, exited with 2
**** v1    0.1 CLI RX|VCL compilation failed
**   v1    0.1 VCL compilation failed (as expected)
***  v1    0.1 Found expected string: ("Probe p not found")
*    top   0.1 RESETTING after ../../../bin/varnishtest/tests/r01837.vtc
**   v1    0.1 Wait
**** v1    0.1 CLI TX|backend.list
***  v1    0.1 CLI RX  101
**** v1    0.1 CLI RX|Unknown request in manager process (child not running).
**** v1    0.1 CLI RX|Type 'help' for more info.
**   v1    0.1 Stop
**** v1    0.1 CLI TX|stop
***  v1    0.2 CLI RX  300
**** v1    0.2 CLI RX|Child in state stopped
**** v1    0.2 CLI TX|status
***  v1    0.2 CLI RX  200
**** v1    0.2 CLI RX|Child in state stopped
**** v1    0.2 STDOUT poll 0x10
**   v1    0.2 R 22246 Status: 0000 (u 0.000000 s 0.004000)
*    diag  0.0 ............................................................
#    top  TEST ../../../bin/varnishtest/tests/r01837.vtc TIMED OUT (kill -9)
#    top  TEST ../../../bin/varnishtest/tests/r01837.vtc FAILED (60.001) signal=9

1 @ SunOS 5.11 i86pc 1.04 64_gcc4.7 uplex

*    top   0.0 TEST ../../../bin/varnishtest/tests/r01837.vtc starting
[...]
*    top   0.0 TEST Test VCC errors out if probe is used before it is defined
[...]
**** v1    0.1 CLI TX|vcl 4.0;
**** v1    0.1 CLI TX|
**** v1    0.1 CLI TX|\tbackend b {
**** v1    0.1 CLI TX|\t\t.host = "127.0.0.1";
**** v1    0.1 CLI TX|\t\t.probe = p;
**** v1    0.1 CLI TX|\t}
**** v1    0.1 CLI TX|\tprobe p {
**** v1    0.1 CLI TX|\t}
**** v1    0.1 CLI TX|
**** v1    0.1 CLI TX|%XJEIFLH|)Xspa8P
***  v1    0.1 CLI RX  106
**** v1    0.1 CLI RX|Message from VCC-compiler:
**** v1    0.1 CLI RX|Security: Privilege proc_setid missing, will not change uid/gid
**** v1    0.1 CLI RX|Probe p not found
**** v1    0.1 CLI RX|('<vcl.inline>' Line 5 Pos 26)
**** v1    0.1 CLI RX|                .probe = p;
**** v1    0.1 CLI RX|-------------------------#-
**** v1    0.1 CLI RX|
**** v1    0.1 CLI RX|Running VCC-compiler failed, exited with 2
**** v1    0.1 CLI RX|VCL compilation failed
**   v1    0.1 VCL compilation failed (as expected)
***  v1    0.1 Found expected string: ("Probe p not found")
*    top   0.1 RESETTING after ../../../bin/varnishtest/tests/r01837.vtc
**   v1    0.1 Wait
**** v1    0.1 CLI TX|backend.list
***  v1    0.1 CLI RX  101
**** v1    0.1 CLI RX|Unknown request in manager process (child not running).
**** v1    0.1 CLI RX|Type 'help' for more info.
**   v1    0.1 Stop
**** v1    0.1 CLI TX|stop
***  v1    0.1 CLI RX  300
**** v1    0.1 CLI RX|Child in state stopped
**** v1    0.1 CLI TX|status
***  v1    0.1 CLI RX  200
**** v1    0.1 CLI RX|Child in state stopped
**** v1    0.1 STDOUT poll 0x10
**   v1    0.1 R 30484 Status: 0000 (u 0.007000 s 0.023000)
*    diag  0.0 ............................................................
#    top  TEST ../../../bin/varnishtest/tests/r01837.vtc TIMED OUT (kill -9)
#    top  TEST ../../../bin/varnishtest/tests/r01837.vtc FAILED (60.004) signal=9

1 @ SunOS 5.11 i86pc 1.04 32_gcc4.7 uplex

*    top   0.0 TEST ../../../bin/varnishtest/tests/r01837.vtc starting
[...]
*    top   0.0 TEST Test VCC errors out if probe is used before it is defined
[...]
**** v1    0.1 CLI TX|vcl 4.0;
**** v1    0.1 CLI TX|
**** v1    0.1 CLI TX|\tbackend b {
**** v1    0.1 CLI TX|\t\t.host = "127.0.0.1";
**** v1    0.1 CLI TX|\t\t.probe = p;
**** v1    0.1 CLI TX|\t}
**** v1    0.1 CLI TX|\tprobe p {
**** v1    0.1 CLI TX|\t}
**** v1    0.1 CLI TX|
**** v1    0.1 CLI TX|%XJEIFLH|)Xspa8P
***  v1    0.1 CLI RX  106
**** v1    0.1 CLI RX|Message from VCC-compiler:
**** v1    0.1 CLI RX|Security: Privilege proc_setid missing, will not change uid/gid
**** v1    0.1 CLI RX|Probe p not found
**** v1    0.1 CLI RX|('<vcl.inline>' Line 5 Pos 26)
**** v1    0.1 CLI RX|                .probe = p;
**** v1    0.1 CLI RX|-------------------------#-
**** v1    0.1 CLI RX|
**** v1    0.1 CLI RX|Running VCC-compiler failed, exited with 2
**** v1    0.1 CLI RX|VCL compilation failed
**   v1    0.1 VCL compilation failed (as expected)
***  v1    0.1 Found expected string: ("Probe p not found")
*    top   0.1 RESETTING after ../../../bin/varnishtest/tests/r01837.vtc
**   v1    0.1 Wait
**** v1    0.1 CLI TX|backend.list
***  v1    0.1 CLI RX  101
**** v1    0.1 CLI RX|Unknown request in manager process (child not running).
**** v1    0.1 CLI RX|Type 'help' for more info.
**   v1    0.1 Stop
**** v1    0.1 CLI TX|stop
***  v1    0.1 CLI RX  300
**** v1    0.1 CLI RX|Child in state stopped
**** v1    0.1 CLI TX|status
***  v1    0.1 CLI RX  200
**** v1    0.1 CLI RX|Child in state stopped
**** v1    0.1 STDOUT poll 0x10
**   v1    0.1 R 41777 Status: 0000 (u 0.006000 s 0.023000)
*    diag  0.0 ............................................................
#    top  TEST ../../../bin/varnishtest/tests/r01837.vtc TIMED OUT (kill -9)
#    top  TEST ../../../bin/varnishtest/tests/r01837.vtc FAILED (60.002) signal=9

1 @ SunOS 5.11 i86pc 1.04 64_sun12.4 uplex

*    top   0.0 TEST ../../../bin/varnishtest/tests/r01837.vtc starting
[...]
*    top   0.0 TEST Test VCC errors out if probe is used before it is defined
[...]
**** v1    0.1 CLI TX|vcl 4.0;
**** v1    0.1 CLI TX|
**** v1    0.1 CLI TX|\tbackend b {
**** v1    0.1 CLI TX|\t\t.host = "127.0.0.1";
**** v1    0.1 CLI TX|\t\t.probe = p;
**** v1    0.1 CLI TX|\t}
**** v1    0.1 CLI TX|\tprobe p {
**** v1    0.1 CLI TX|\t}
**** v1    0.1 CLI TX|
**** v1    0.1 CLI TX|%XJEIFLH|)Xspa8P
***  v1    0.1 CLI RX  106
**** v1    0.1 CLI RX|Message from VCC-compiler:
**** v1    0.1 CLI RX|Security: Privilege proc_setid missing, will not change uid/gid
**** v1    0.1 CLI RX|Probe p not found
**** v1    0.1 CLI RX|('<vcl.inline>' Line 5 Pos 26)
**** v1    0.1 CLI RX|                .probe = p;
**** v1    0.1 CLI RX|-------------------------#-
**** v1    0.1 CLI RX|
**** v1    0.1 CLI RX|Running VCC-compiler failed, exited with 2
**** v1    0.1 CLI RX|VCL compilation failed
**   v1    0.1 VCL compilation failed (as expected)
***  v1    0.1 Found expected string: ("Probe p not found")
*    top   0.1 RESETTING after ../../../bin/varnishtest/tests/r01837.vtc
**   v1    0.1 Wait
**** v1    0.1 CLI TX|backend.list
***  v1    0.1 CLI RX  101
**** v1    0.1 CLI RX|Unknown request in manager process (child not running).
**** v1    0.1 CLI RX|Type 'help' for more info.
**   v1    0.1 Stop
**** v1    0.1 CLI TX|stop
***  v1    0.1 CLI RX  300
**** v1    0.1 CLI RX|Child in state stopped
**** v1    0.1 CLI TX|status
***  v1    0.1 CLI RX  200
**** v1    0.1 CLI RX|Child in state stopped
**** v1    0.1 STDOUT poll 0x10
**   v1    0.1 R 27878 Status: 0000 (u 0.007000 s 0.022000)
*    diag  0.0 ............................................................
#    top  TEST ../../../bin/varnishtest/tests/r01837.vtc TIMED OUT (kill -9)
#    top  TEST ../../../bin/varnishtest/tests/r01837.vtc FAILED (60.004) signal=9

1 @ Linux 3.10.0 x86_64 1.02 mblissett

*    top   0.0 TEST ../../../bin/varnishtest/tests/r01837.vtc starting
[...]
*    top   0.0 TEST Test VCC errors out if probe is used before it is defined
[...]
**** v1    0.1 CLI TX|vcl.inline vcl1 << %XJEIFLH|)Xspa8P
**** v1    0.1 CLI TX|vcl 4.0;
**** v1    0.1 CLI TX|
**** v1    0.1 CLI TX|\tbackend b {
**** v1    0.1 CLI TX|\t\t.host = "127.0.0.1";
**** v1    0.1 CLI TX|\t\t.probe = p;
**** v1    0.1 CLI TX|\t}
**** v1    0.1 CLI TX|\tprobe p {
**** v1    0.1 CLI TX|\t}
**** v1    0.1 CLI TX|
**** v1    0.1 CLI TX|%XJEIFLH|)Xspa8P
***  v1    0.1 CLI RX  106
**** v1    0.1 CLI RX|Message from VCC-compiler:
**** v1    0.1 CLI RX|Probe p not found
**** v1    0.1 CLI RX|('<vcl.inline>' Line 5 Pos 26)
**** v1    0.1 CLI RX|                .probe = p;
**** v1    0.1 CLI RX|-------------------------#-
**** v1    0.1 CLI RX|
**** v1    0.1 CLI RX|Running VCC-compiler failed, exited with 2
**** v1    0.1 CLI RX|VCL compilation failed
**   v1    0.1 VCL compilation failed (as expected)
***  v1    0.1 Found expected string: ("Probe p not found")
*    top   0.1 RESETTING after ../../../bin/varnishtest/tests/r01837.vtc
**   v1    0.1 Wait
**** v1    0.1 CLI TX|backend.list
***  v1    0.2 CLI RX  101
**** v1    0.2 CLI RX|Unknown request in manager process (child not running).
**** v1    0.2 CLI RX|Type 'help' for more info.
**   v1    0.2 Stop
**** v1    0.2 CLI TX|stop
***  v1    0.2 CLI RX  300
**** v1    0.2 CLI RX|Child in state stopped
**** v1    0.2 CLI TX|status
***  v1    0.2 CLI RX  200
**** v1    0.2 CLI RX|Child in state stopped
**** v1    0.2 STDOUT poll 0x10
**   v1    0.2 R 23625 Status: 0000 (u 0.002958 s 0.013250)
*    diag  0.0 ............................................................
#    top  TEST ../../../bin/varnishtest/tests/r01837.vtc TIMED OUT (kill -9)
#    top  TEST ../../../bin/varnishtest/tests/r01837.vtc FAILED (60.001) signal=9

1 @ Linux 3.10.0 x86_64 1.02 mblissett

*    top   0.0 TEST ../../../bin/varnishtest/tests/r01837.vtc starting
[...]
*    top   0.0 TEST Test VCC errors out if probe is used before it is defined
[...]
**** v1    0.1 CLI TX|vcl.inline vcl1 << %XJEIFLH|)Xspa8P
**** v1    0.1 CLI TX|vcl 4.0;
**** v1    0.1 CLI TX|
**** v1    0.1 CLI TX|\tbackend b {
**** v1    0.1 CLI TX|\t\t.host = "127.0.0.1";
**** v1    0.1 CLI TX|\t\t.probe = p;
**** v1    0.1 CLI TX|\t}
**** v1    0.1 CLI TX|\tprobe p {
**** v1    0.1 CLI TX|\t}
**** v1    0.1 CLI TX|
**** v1    0.1 CLI TX|%XJEIFLH|)Xspa8P
***  v1    0.1 CLI RX  106
**** v1    0.1 CLI RX|Message from VCC-compiler:
**** v1    0.1 CLI RX|Probe p not found
**** v1    0.1 CLI RX|('<vcl.inline>' Line 5 Pos 26)
**** v1    0.1 CLI RX|                .probe = p;
**** v1    0.1 CLI RX|-------------------------#-
**** v1    0.1 CLI RX|
**** v1    0.1 CLI RX|Running VCC-compiler failed, exited with 2
**** v1    0.1 CLI RX|VCL compilation failed
**   v1    0.1 VCL compilation failed (as expected)
***  v1    0.1 Found expected string: ("Probe p not found")
*    top   0.1 RESETTING after ../../../bin/varnishtest/tests/r01837.vtc
**   v1    0.1 Wait
**** v1    0.1 CLI TX|backend.list
***  v1    0.2 CLI RX  101
**** v1    0.2 CLI RX|Unknown request in manager process (child not running).
**** v1    0.2 CLI RX|Type 'help' for more info.
**   v1    0.2 Stop
**** v1    0.2 CLI TX|stop
***  v1    0.2 CLI RX  300
**** v1    0.2 CLI RX|Child in state stopped
**** v1    0.2 CLI TX|status
***  v1    0.2 CLI RX  200
**** v1    0.2 CLI RX|Child in state stopped
**** v1    0.2 STDOUT poll 0x10
**   v1    0.2 R 16729 Status: 0000 (u 0.003195 s 0.017987)
*    diag  0.0 ............................................................
#    top  TEST ../../../bin/varnishtest/tests/r01837.vtc TIMED OUT (kill -9)
#    top  TEST ../../../bin/varnishtest/tests/r01837.vtc FAILED (60.001) signal=9

1 @ Ubuntu LTS i686 1.04 fgs

*    top   0.0 TEST ../../../bin/varnishtest/tests/r01837.vtc starting
[...]
*    top   0.0 TEST Test VCC errors out if probe is used before it is defined
[...]
**** v1    0.1 CLI TX|vcl.inline vcl1 << %XJEIFLH|)Xspa8P
**** v1    0.1 CLI TX|vcl 4.0;
**** v1    0.1 CLI TX|
**** v1    0.1 CLI TX|\tbackend b {
**** v1    0.1 CLI TX|\t\t.host = "127.0.0.1";
**** v1    0.1 CLI TX|\t\t.probe = p;
**** v1    0.1 CLI TX|\t}
**** v1    0.1 CLI TX|\tprobe p {
**** v1    0.1 CLI TX|\t}
**** v1    0.1 CLI TX|
**** v1    0.1 CLI TX|%XJEIFLH|)Xspa8P
***  v1    0.1 CLI RX  106
**** v1    0.1 CLI RX|Message from VCC-compiler:
**** v1    0.1 CLI RX|Probe p not found
**** v1    0.1 CLI RX|('<vcl.inline>' Line 5 Pos 26)
**** v1    0.1 CLI RX|                .probe = p;
**** v1    0.1 CLI RX|-------------------------#-
**** v1    0.1 CLI RX|
**** v1    0.1 CLI RX|Running VCC-compiler failed, exited with 2
**** v1    0.1 CLI RX|VCL compilation failed
**   v1    0.1 VCL compilation failed (as expected)
***  v1    0.1 Found expected string: ("Probe p not found")
*    top   0.1 RESETTING after ../../../bin/varnishtest/tests/r01837.vtc
**   v1    0.1 Wait
**** v1    0.1 CLI TX|backend.list
***  v1    0.1 CLI RX  101
**** v1    0.1 CLI RX|Unknown request in manager process (child not running).
**** v1    0.1 CLI RX|Type 'help' for more info.
**   v1    0.1 Stop
**** v1    0.1 CLI TX|stop
***  v1    0.2 CLI RX  300
**** v1    0.2 CLI RX|Child in state stopped
**** v1    0.2 CLI TX|status
***  v1    0.2 CLI RX  200
**** v1    0.2 CLI RX|Child in state stopped
**** v1    0.2 STDOUT poll 0x10
**   v1    0.2 R 1634 Status: 0000 (u 0.000000 s 0.004000)
*    diag  0.0 ............................................................
#    top  TEST ../../../bin/varnishtest/tests/r01837.vtc TIMED OUT (kill -9)
#    top  TEST ../../../bin/varnishtest/tests/r01837.vtc FAILED (60.001) signal=9

1 @ SunOS 5.11 i86pc 1.04 32_gcc4.7 uplex

*    top   0.0 TEST ../../../bin/varnishtest/tests/r01837.vtc starting
[...]
*    top   0.0 TEST Test VCC errors out if probe is used before it is defined
[...]
**** v1    0.1 CLI TX|vcl 4.0;
**** v1    0.1 CLI TX|
**** v1    0.1 CLI TX|\tbackend b {
**** v1    0.1 CLI TX|\t\t.host = "127.0.0.1";
**** v1    0.1 CLI TX|\t\t.probe = p;
**** v1    0.1 CLI TX|\t}
**** v1    0.1 CLI TX|\tprobe p {
**** v1    0.1 CLI TX|\t}
**** v1    0.1 CLI TX|
**** v1    0.1 CLI TX|%XJEIFLH|)Xspa8P
***  v1    0.1 CLI RX  106
**** v1    0.1 CLI RX|Message from VCC-compiler:
**** v1    0.1 CLI RX|Security: Privilege proc_setid missing, will not change uid/gid
**** v1    0.1 CLI RX|Probe p not found
**** v1    0.1 CLI RX|('<vcl.inline>' Line 5 Pos 26)
**** v1    0.1 CLI RX|                .probe = p;
**** v1    0.1 CLI RX|-------------------------#-
**** v1    0.1 CLI RX|
**** v1    0.1 CLI RX|Running VCC-compiler failed, exited with 2
**** v1    0.1 CLI RX|VCL compilation failed
**   v1    0.1 VCL compilation failed (as expected)
***  v1    0.1 Found expected string: ("Probe p not found")
*    top   0.1 RESETTING after ../../../bin/varnishtest/tests/r01837.vtc
**   v1    0.1 Wait
**** v1    0.1 CLI TX|backend.list
***  v1    0.1 CLI RX  101
**** v1    0.1 CLI RX|Unknown request in manager process (child not running).
**** v1    0.1 CLI RX|Type 'help' for more info.
**   v1    0.1 Stop
**** v1    0.1 CLI TX|stop
***  v1    0.1 CLI RX  300
**** v1    0.1 CLI RX|Child in state stopped
**** v1    0.1 CLI TX|status
***  v1    0.1 CLI RX  200
**** v1    0.1 CLI RX|Child in state stopped
**** v1    0.1 STDOUT poll 0x10
**   v1    0.1 R 61873 Status: 0000 (u 0.004000 s 0.016000)
*    diag  0.0 ............................................................
#    top  TEST ../../../bin/varnishtest/tests/r01837.vtc TIMED OUT (kill -9)
#    top  TEST ../../../bin/varnishtest/tests/r01837.vtc FAILED (60.002) signal=9

1 @ Linux 3.10.0 x86_64 1.02 mblissett

*    top   0.0 TEST ../../../bin/varnishtest/tests/r01837.vtc starting
[...]
*    top   0.0 TEST Test VCC errors out if probe is used before it is defined
[...]
**** v1    0.1 CLI TX|vcl.inline vcl1 << %XJEIFLH|)Xspa8P
**** v1    0.1 CLI TX|vcl 4.0;
**** v1    0.1 CLI TX|
**** v1    0.1 CLI TX|\tbackend b {
**** v1    0.1 CLI TX|\t\t.host = "127.0.0.1";
**** v1    0.1 CLI TX|\t\t.probe = p;
**** v1    0.1 CLI TX|\t}
**** v1    0.1 CLI TX|\tprobe p {
**** v1    0.1 CLI TX|\t}
**** v1    0.1 CLI TX|
**** v1    0.1 CLI TX|%XJEIFLH|)Xspa8P
***  v1    0.1 CLI RX  106
**** v1    0.1 CLI RX|Message from VCC-compiler:
**** v1    0.1 CLI RX|Probe p not found
**** v1    0.1 CLI RX|('<vcl.inline>' Line 5 Pos 26)
**** v1    0.1 CLI RX|                .probe = p;
**** v1    0.1 CLI RX|-------------------------#-
**** v1    0.1 CLI RX|
**** v1    0.1 CLI RX|Running VCC-compiler failed, exited with 2
**** v1    0.1 CLI RX|VCL compilation failed
**   v1    0.1 VCL compilation failed (as expected)
***  v1    0.1 Found expected string: ("Probe p not found")
*    top   0.1 RESETTING after ../../../bin/varnishtest/tests/r01837.vtc
**   v1    0.1 Wait
**** v1    0.1 CLI TX|backend.list
***  v1    0.2 CLI RX  101
**** v1    0.2 CLI RX|Unknown request in manager process (child not running).
**** v1    0.2 CLI RX|Type 'help' for more info.
**   v1    0.2 Stop
**** v1    0.2 CLI TX|stop
***  v1    0.2 CLI RX  300
**** v1    0.2 CLI RX|Child in state stopped
**** v1    0.2 CLI TX|status
***  v1    0.2 CLI RX  200
**** v1    0.2 CLI RX|Child in state stopped
**** v1    0.2 STDOUT poll 0x10
**   v1    0.2 R 22993 Status: 0000 (u 0.003215 s 0.014445)
*    diag  0.0 ............................................................
#    top  TEST ../../../bin/varnishtest/tests/r01837.vtc TIMED OUT (kill -9)
#    top  TEST ../../../bin/varnishtest/tests/r01837.vtc FAILED (60.001) signal=9

1 @ SunOS 5.11 i86pc 1.04 64_sun12.4 uplex

*    top   0.0 TEST ../../../bin/varnishtest/tests/r01837.vtc starting
[...]
*    top   0.0 TEST Test VCC errors out if probe is used before it is defined
[...]
**** v1    0.1 CLI TX|vcl 4.0;
**** v1    0.1 CLI TX|
**** v1    0.1 CLI TX|\tbackend b {
**** v1    0.1 CLI TX|\t\t.host = "127.0.0.1";
**** v1    0.1 CLI TX|\t\t.probe = p;
**** v1    0.1 CLI TX|\t}
**** v1    0.1 CLI TX|\tprobe p {
**** v1    0.1 CLI TX|\t}
**** v1    0.1 CLI TX|
**** v1    0.1 CLI TX|%XJEIFLH|)Xspa8P
***  v1    0.1 CLI RX  106
**** v1    0.1 CLI RX|Message from VCC-compiler:
**** v1    0.1 CLI RX|Security: Privilege proc_setid missing, will not change uid/gid
**** v1    0.1 CLI RX|Probe p not found
**** v1    0.1 CLI RX|('<vcl.inline>' Line 5 Pos 26)
**** v1    0.1 CLI RX|                .probe = p;
**** v1    0.1 CLI RX|-------------------------#-
**** v1    0.1 CLI RX|
**** v1    0.1 CLI RX|Running VCC-compiler failed, exited with 2
**** v1    0.1 CLI RX|VCL compilation failed
**   v1    0.1 VCL compilation failed (as expected)
***  v1    0.1 Found expected string: ("Probe p not found")
*    top   0.1 RESETTING after ../../../bin/varnishtest/tests/r01837.vtc
**   v1    0.1 Wait
**** v1    0.1 CLI TX|backend.list
***  v1    0.1 CLI RX  101
**** v1    0.1 CLI RX|Unknown request in manager process (child not running).
**** v1    0.1 CLI RX|Type 'help' for more info.
**   v1    0.1 Stop
**** v1    0.1 CLI TX|stop
***  v1    0.1 CLI RX  300
**** v1    0.1 CLI RX|Child in state stopped
**** v1    0.1 CLI TX|status
***  v1    0.1 CLI RX  200
**** v1    0.1 CLI RX|Child in state stopped
**** v1    0.1 STDOUT poll 0x10
**   v1    0.1 R 27329 Status: 0000 (u 0.007000 s 0.025000)
*    diag  0.0 ............................................................
#    top  TEST ../../../bin/varnishtest/tests/r01837.vtc TIMED OUT (kill -9)
#    top  TEST ../../../bin/varnishtest/tests/r01837.vtc FAILED (60.004) signal=9

1 @ SunOS 5.11 i86pc 1.04 32_sun12.4 uplex

*    top   0.0 TEST ../../../bin/varnishtest/tests/r01837.vtc starting
[...]
*    top   0.0 TEST Test VCC errors out if probe is used before it is defined
[...]
**** v1    0.1 CLI TX|vcl 4.0;
**** v1    0.1 CLI TX|
**** v1    0.1 CLI TX|\tbackend b {
**** v1    0.1 CLI TX|\t\t.host = "127.0.0.1";
**** v1    0.1 CLI TX|\t\t.probe = p;
**** v1    0.1 CLI TX|\t}
**** v1    0.1 CLI TX|\tprobe p {
**** v1    0.1 CLI TX|\t}
**** v1    0.1 CLI TX|
**** v1    0.1 CLI TX|%XJEIFLH|)Xspa8P
***  v1    0.1 CLI RX  106
**** v1    0.1 CLI RX|Message from VCC-compiler:
**** v1    0.1 CLI RX|Security: Privilege proc_setid missing, will not change uid/gid
**** v1    0.1 CLI RX|Probe p not found
**** v1    0.1 CLI RX|('<vcl.inline>' Line 5 Pos 26)
**** v1    0.1 CLI RX|                .probe = p;
**** v1    0.1 CLI RX|-------------------------#-
**** v1    0.1 CLI RX|
**** v1    0.1 CLI RX|Running VCC-compiler failed, exited with 2
**** v1    0.1 CLI RX|VCL compilation failed
**   v1    0.1 VCL compilation failed (as expected)
***  v1    0.1 Found expected string: ("Probe p not found")
*    top   0.1 RESETTING after ../../../bin/varnishtest/tests/r01837.vtc
**   v1    0.1 Wait
**** v1    0.1 CLI TX|backend.list
***  v1    0.1 CLI RX  101
**** v1    0.1 CLI RX|Unknown request in manager process (child not running).
**** v1    0.1 CLI RX|Type 'help' for more info.
**   v1    0.1 Stop
**** v1    0.1 CLI TX|stop
***  v1    0.1 CLI RX  300
**** v1    0.1 CLI RX|Child in state stopped
**** v1    0.1 CLI TX|status
***  v1    0.1 CLI RX  200
**** v1    0.1 CLI RX|Child in state stopped
**** v1    0.1 STDOUT poll 0x10
**   v1    0.1 R 88270 Status: 0000 (u 0.006000 s 0.025000)
*    diag  0.0 ............................................................
#    top  TEST ../../../bin/varnishtest/tests/r01837.vtc TIMED OUT (kill -9)
#    top  TEST ../../../bin/varnishtest/tests/r01837.vtc FAILED (60.003) signal=9

1 @ SunOS 5.11 i86pc 1.04 64_gcc4.7 uplex

*    top   0.0 TEST ../../../bin/varnishtest/tests/r01837.vtc starting
[...]
*    top   0.0 TEST Test VCC errors out if probe is used before it is defined
[...]
**** v1    0.1 CLI TX|vcl 4.0;
**** v1    0.1 CLI TX|
**** v1    0.1 CLI TX|\tbackend b {
**** v1    0.1 CLI TX|\t\t.host = "127.0.0.1";
**** v1    0.1 CLI TX|\t\t.probe = p;
**** v1    0.1 CLI TX|\t}
**** v1    0.1 CLI TX|\tprobe p {
**** v1    0.1 CLI TX|\t}
**** v1    0.1 CLI TX|
**** v1    0.1 CLI TX|%XJEIFLH|)Xspa8P
***  v1    0.1 CLI RX  106
**** v1    0.1 CLI RX|Message from VCC-compiler:
**** v1    0.1 CLI RX|Security: Privilege proc_setid missing, will not change uid/gid
**** v1    0.1 CLI RX|Probe p not found
**** v1    0.1 CLI RX|('<vcl.inline>' Line 5 Pos 26)
**** v1    0.1 CLI RX|                .probe = p;
**** v1    0.1 CLI RX|-------------------------#-
**** v1    0.1 CLI RX|
**** v1    0.1 CLI RX|Running VCC-compiler failed, exited with 2
**** v1    0.1 CLI RX|VCL compilation failed
**   v1    0.1 VCL compilation failed (as expected)
***  v1    0.1 Found expected string: ("Probe p not found")
*    top   0.1 RESETTING after ../../../bin/varnishtest/tests/r01837.vtc
**   v1    0.1 Wait
**** v1    0.1 CLI TX|backend.list
***  v1    0.1 CLI RX  101
**** v1    0.1 CLI RX|Unknown request in manager process (child not running).
**** v1    0.1 CLI RX|Type 'help' for more info.
**   v1    0.1 Stop
**** v1    0.1 CLI TX|stop
***  v1    0.1 CLI RX  300
**** v1    0.1 CLI RX|Child in state stopped
**** v1    0.1 CLI TX|status
***  v1    0.1 CLI RX  200
**** v1    0.1 CLI RX|Child in state stopped
**** v1    0.1 STDOUT poll 0x10
**   v1    0.1 R 18018 Status: 0000 (u 0.007000 s 0.022000)
*    diag  0.0 ............................................................
#    top  TEST ../../../bin/varnishtest/tests/r01837.vtc TIMED OUT (kill -9)
#    top  TEST ../../../bin/varnishtest/tests/r01837.vtc FAILED (60.003) signal=9

1 @ SunOS 5.11 i86pc 1.04 32_gcc4.7 uplex

*    top   0.0 TEST ../../../bin/varnishtest/tests/r01837.vtc starting
[...]
*    top   0.0 TEST Test VCC errors out if probe is used before it is defined
[...]
**** v1    0.1 CLI TX|vcl 4.0;
**** v1    0.1 CLI TX|
**** v1    0.1 CLI TX|\tbackend b {
**** v1    0.1 CLI TX|\t\t.host = "127.0.0.1";
**** v1    0.1 CLI TX|\t\t.probe = p;
**** v1    0.1 CLI TX|\t}
**** v1    0.1 CLI TX|\tprobe p {
**** v1    0.1 CLI TX|\t}
**** v1    0.1 CLI TX|
**** v1    0.1 CLI TX|%XJEIFLH|)Xspa8P
***  v1    0.1 CLI RX  106
**** v1    0.1 CLI RX|Message from VCC-compiler:
**** v1    0.1 CLI RX|Security: Privilege proc_setid missing, will not change uid/gid
**** v1    0.1 CLI RX|Probe p not found
**** v1    0.1 CLI RX|('<vcl.inline>' Line 5 Pos 26)
**** v1    0.1 CLI RX|                .probe = p;
**** v1    0.1 CLI RX|-------------------------#-
**** v1    0.1 CLI RX|
**** v1    0.1 CLI RX|Running VCC-compiler failed, exited with 2
**** v1    0.1 CLI RX|VCL compilation failed
**   v1    0.1 VCL compilation failed (as expected)
***  v1    0.1 Found expected string: ("Probe p not found")
*    top   0.1 RESETTING after ../../../bin/varnishtest/tests/r01837.vtc
**   v1    0.1 Wait
**** v1    0.1 CLI TX|backend.list
***  v1    0.1 CLI RX  101
**** v1    0.1 CLI RX|Unknown request in manager process (child not running).
**** v1    0.1 CLI RX|Type 'help' for more info.
**   v1    0.1 Stop
**** v1    0.1 CLI TX|stop
***  v1    0.1 CLI RX  300
**** v1    0.1 CLI RX|Child in state stopped
**** v1    0.1 CLI TX|status
***  v1    0.1 CLI RX  200
**** v1    0.1 CLI RX|Child in state stopped
**** v1    0.1 STDOUT poll 0x10
**   v1    0.1 R 29377 Status: 0000 (u 0.004000 s 0.016000)
*    diag  0.0 ............................................................
#    top  TEST ../../../bin/varnishtest/tests/r01837.vtc TIMED OUT (kill -9)
#    top  TEST ../../../bin/varnishtest/tests/r01837.vtc FAILED (60.002) signal=9

1 @ Linux 3.10.0 x86_64 1.02 mblissett

*    top   0.0 TEST ../../../bin/varnishtest/tests/r01837.vtc starting
[...]
*    top   0.0 TEST Test VCC errors out if probe is used before it is defined
[...]
**** v1    0.1 CLI TX|vcl.inline vcl1 << %XJEIFLH|)Xspa8P
**** v1    0.1 CLI TX|vcl 4.0;
**** v1    0.1 CLI TX|
**** v1    0.1 CLI TX|\tbackend b {
**** v1    0.1 CLI TX|\t\t.host = "127.0.0.1";
**** v1    0.1 CLI TX|\t\t.probe = p;
**** v1    0.1 CLI TX|\t}
**** v1    0.1 CLI TX|\tprobe p {
**** v1    0.1 CLI TX|\t}
**** v1    0.1 CLI TX|
**** v1    0.1 CLI TX|%XJEIFLH|)Xspa8P
***  v1    0.1 CLI RX  106
**** v1    0.1 CLI RX|Message from VCC-compiler:
**** v1    0.1 CLI RX|Probe p not found
**** v1    0.1 CLI RX|('<vcl.inline>' Line 5 Pos 26)
**** v1    0.1 CLI RX|                .probe = p;
**** v1    0.1 CLI RX|-------------------------#-
**** v1    0.1 CLI RX|
**** v1    0.1 CLI RX|Running VCC-compiler failed, exited with 2
**** v1    0.1 CLI RX|VCL compilation failed
**   v1    0.1 VCL compilation failed (as expected)
***  v1    0.1 Found expected string: ("Probe p not found")
*    top   0.1 RESETTING after ../../../bin/varnishtest/tests/r01837.vtc
**   v1    0.1 Wait
**** v1    0.1 CLI TX|backend.list
***  v1    0.2 CLI RX  101
**** v1    0.2 CLI RX|Unknown request in manager process (child not running).
**** v1    0.2 CLI RX|Type 'help' for more info.
**   v1    0.2 Stop
**** v1    0.2 CLI TX|stop
***  v1    0.2 CLI RX  300
**** v1    0.2 CLI RX|Child in state stopped
**** v1    0.2 CLI TX|status
***  v1    0.2 CLI RX  200
**** v1    0.2 CLI RX|Child in state stopped
**** v1    0.2 STDOUT poll 0x10
**   v1    0.2 R 19878 Status: 0000 (u 0.002093 s 0.008962)
*    diag  0.0 ............................................................
#    top  TEST ../../../bin/varnishtest/tests/r01837.vtc TIMED OUT (kill -9)
#    top  TEST ../../../bin/varnishtest/tests/r01837.vtc FAILED (60.001) signal=9

1 @ SunOS 5.11 i86pc 1.04 32_gcc4.7 uplex

*    top   0.0 TEST ../../../bin/varnishtest/tests/r01837.vtc starting
[...]
*    top   0.0 TEST Test VCC errors out if probe is used before it is defined
[...]
**** v1    0.1 CLI TX|vcl 4.0;
**** v1    0.1 CLI TX|
**** v1    0.1 CLI TX|\tbackend b {
**** v1    0.1 CLI TX|\t\t.host = "127.0.0.1";
**** v1    0.1 CLI TX|\t\t.probe = p;
**** v1    0.1 CLI TX|\t}
**** v1    0.1 CLI TX|\tprobe p {
**** v1    0.1 CLI TX|\t}
**** v1    0.1 CLI TX|
**** v1    0.1 CLI TX|%XJEIFLH|)Xspa8P
***  v1    0.1 CLI RX  106
**** v1    0.1 CLI RX|Message from VCC-compiler:
**** v1    0.1 CLI RX|Security: Privilege proc_setid missing, will not change uid/gid
**** v1    0.1 CLI RX|Probe p not found
**** v1    0.1 CLI RX|('<vcl.inline>' Line 5 Pos 26)
**** v1    0.1 CLI RX|                .probe = p;
**** v1    0.1 CLI RX|-------------------------#-
**** v1    0.1 CLI RX|
**** v1    0.1 CLI RX|Running VCC-compiler failed, exited with 2
**** v1    0.1 CLI RX|VCL compilation failed
**   v1    0.1 VCL compilation failed (as expected)
***  v1    0.1 Found expected string: ("Probe p not found")
*    top   0.1 RESETTING after ../../../bin/varnishtest/tests/r01837.vtc
**   v1    0.1 Wait
**** v1    0.1 CLI TX|backend.list
***  v1    0.1 CLI RX  101
**** v1    0.1 CLI RX|Unknown request in manager process (child not running).
**** v1    0.1 CLI RX|Type 'help' for more info.
**   v1    0.1 Stop
**** v1    0.1 CLI TX|stop
***  v1    0.1 CLI RX  300
**** v1    0.1 CLI RX|Child in state stopped
**** v1    0.1 CLI TX|status
***  v1    0.1 CLI RX  200
**** v1    0.1 CLI RX|Child in state stopped
**** v1    0.1 STDOUT poll 0x10
**   v1    0.1 R 135 Status: 0000 (u 0.004000 s 0.017000)
*    diag  0.0 ............................................................
#    top  TEST ../../../bin/varnishtest/tests/r01837.vtc TIMED OUT (kill -9)
#    top  TEST ../../../bin/varnishtest/tests/r01837.vtc FAILED (60.001) signal=9

1 @ SunOS 5.11 i86pc 1.04 64_gcc4.7 uplex

*    top   0.0 TEST ../../../bin/varnishtest/tests/r01837.vtc starting
[...]
*    top   0.0 TEST Test VCC errors out if probe is used before it is defined
[...]
**** v1    0.1 CLI TX|vcl 4.0;
**** v1    0.1 CLI TX|
**** v1    0.1 CLI TX|\tbackend b {
**** v1    0.1 CLI TX|\t\t.host = "127.0.0.1";
**** v1    0.1 CLI TX|\t\t.probe = p;
**** v1    0.1 CLI TX|\t}
**** v1    0.1 CLI TX|\tprobe p {
**** v1    0.1 CLI TX|\t}
**** v1    0.1 CLI TX|
**** v1    0.1 CLI TX|%XJEIFLH|)Xspa8P
***  v1    0.2 CLI RX  106
**** v1    0.2 CLI RX|Message from VCC-compiler:
**** v1    0.2 CLI RX|Security: Privilege proc_setid missing, will not change uid/gid
**** v1    0.2 CLI RX|Probe p not found
**** v1    0.2 CLI RX|('<vcl.inline>' Line 5 Pos 26)
**** v1    0.2 CLI RX|                .probe = p;
**** v1    0.2 CLI RX|-------------------------#-
**** v1    0.2 CLI RX|
**** v1    0.2 CLI RX|Running VCC-compiler failed, exited with 2
**** v1    0.2 CLI RX|VCL compilation failed
**   v1    0.2 VCL compilation failed (as expected)
***  v1    0.2 Found expected string: ("Probe p not found")
*    top   0.2 RESETTING after ../../../bin/varnishtest/tests/r01837.vtc
**   v1    0.2 Wait
**** v1    0.2 CLI TX|backend.list
***  v1    0.2 CLI RX  101
**** v1    0.2 CLI RX|Unknown request in manager process (child not running).
**** v1    0.2 CLI RX|Type 'help' for more info.
**   v1    0.2 Stop
**** v1    0.2 CLI TX|stop
***  v1    0.2 CLI RX  300
**** v1    0.2 CLI RX|Child in state stopped
**** v1    0.2 CLI TX|status
***  v1    0.2 CLI RX  200
**** v1    0.2 CLI RX|Child in state stopped
**** v1    0.2 STDOUT poll 0x10
**   v1    0.2 R 82820 Status: 0000 (u 0.010000 s 0.032000)
*    diag  0.0 ............................................................
#    top  TEST ../../../bin/varnishtest/tests/r01837.vtc TIMED OUT (kill -9)
#    top  TEST ../../../bin/varnishtest/tests/r01837.vtc FAILED (60.006) signal=9

1 @ SunOS 5.11 i86pc 1.04 64_gcc4.7 uplex

*    top   0.0 TEST ../../../bin/varnishtest/tests/r01837.vtc starting
[...]
*    top   0.0 TEST Test VCC errors out if probe is used before it is defined
[...]
**** v1    0.1 CLI TX|vcl 4.0;
**** v1    0.1 CLI TX|
**** v1    0.1 CLI TX|\tbackend b {
**** v1    0.1 CLI TX|\t\t.host = "127.0.0.1";
**** v1    0.1 CLI TX|\t\t.probe = p;
**** v1    0.1 CLI TX|\t}
**** v1    0.1 CLI TX|\tprobe p {
**** v1    0.1 CLI TX|\t}
**** v1    0.1 CLI TX|
**** v1    0.1 CLI TX|%XJEIFLH|)Xspa8P
***  v1    0.1 CLI RX  106
**** v1    0.1 CLI RX|Message from VCC-compiler:
**** v1    0.1 CLI RX|Security: Privilege proc_setid missing, will not change uid/gid
**** v1    0.1 CLI RX|Probe p not found
**** v1    0.1 CLI RX|('<vcl.inline>' Line 5 Pos 26)
**** v1    0.1 CLI RX|                .probe = p;
**** v1    0.1 CLI RX|-------------------------#-
**** v1    0.1 CLI RX|
**** v1    0.1 CLI RX|Running VCC-compiler failed, exited with 2
**** v1    0.1 CLI RX|VCL compilation failed
**   v1    0.1 VCL compilation failed (as expected)
***  v1    0.1 Found expected string: ("Probe p not found")
*    top   0.1 RESETTING after ../../../bin/varnishtest/tests/r01837.vtc
**   v1    0.1 Wait
**** v1    0.1 CLI TX|backend.list
***  v1    0.1 CLI RX  101
**** v1    0.1 CLI RX|Unknown request in manager process (child not running).
**** v1    0.1 CLI RX|Type 'help' for more info.
**   v1    0.1 Stop
**** v1    0.1 CLI TX|stop
***  v1    0.1 CLI RX  300
**** v1    0.1 CLI RX|Child in state stopped
**** v1    0.1 CLI TX|status
***  v1    0.1 CLI RX  200
**** v1    0.1 CLI RX|Child in state stopped
**** v1    0.1 STDOUT poll 0x10
**   v1    0.1 R 24540 Status: 0000 (u 0.007000 s 0.022000)
*    diag  0.0 ............................................................
#    top  TEST ../../../bin/varnishtest/tests/r01837.vtc TIMED OUT (kill -9)
#    top  TEST ../../../bin/varnishtest/tests/r01837.vtc FAILED (60.004) signal=9

1 @ Ubuntu LTS i686 1.04 fgs

*    top   0.0 TEST ../../../bin/varnishtest/tests/r01837.vtc starting
[...]
*    top   0.0 TEST Test VCC errors out if probe is used before it is defined
[...]
**** v1    0.1 CLI TX|vcl.inline vcl1 << %XJEIFLH|)Xspa8P
**** v1    0.1 CLI TX|vcl 4.0;
**** v1    0.1 CLI TX|
**** v1    0.1 CLI TX|\tbackend b {
**** v1    0.1 CLI TX|\t\t.host = "127.0.0.1";
**** v1    0.1 CLI TX|\t\t.probe = p;
**** v1    0.1 CLI TX|\t}
**** v1    0.1 CLI TX|\tprobe p {
**** v1    0.1 CLI TX|\t}
**** v1    0.1 CLI TX|
**** v1    0.1 CLI TX|%XJEIFLH|)Xspa8P
***  v1    0.1 CLI RX  106
**** v1    0.1 CLI RX|Message from VCC-compiler:
**** v1    0.1 CLI RX|Probe p not found
**** v1    0.1 CLI RX|('<vcl.inline>' Line 5 Pos 26)
**** v1    0.1 CLI RX|                .probe = p;
**** v1    0.1 CLI RX|-------------------------#-
**** v1    0.1 CLI RX|
**** v1    0.1 CLI RX|Running VCC-compiler failed, exited with 2
**** v1    0.1 CLI RX|VCL compilation failed
**   v1    0.1 VCL compilation failed (as expected)
***  v1    0.1 Found expected string: ("Probe p not found")
*    top   0.1 RESETTING after ../../../bin/varnishtest/tests/r01837.vtc
**   v1    0.1 Wait
**** v1    0.1 CLI TX|backend.list
***  v1    0.2 CLI RX  101
**** v1    0.2 CLI RX|Unknown request in manager process (child not running).
**** v1    0.2 CLI RX|Type 'help' for more info.
**   v1    0.2 Stop
**** v1    0.2 CLI TX|stop
***  v1    0.2 CLI RX  300
**** v1    0.2 CLI RX|Child in state stopped
**** v1    0.2 CLI TX|status
***  v1    0.2 CLI RX  200
**** v1    0.2 CLI RX|Child in state stopped
**** v1    0.2 STDOUT poll 0x10
**   v1    0.2 R 28131 Status: 0000 (u 0.000000 s 0.004000)
*    diag  0.0 ............................................................
#    top  TEST ../../../bin/varnishtest/tests/r01837.vtc TIMED OUT (kill -9)
#    top  TEST ../../../bin/varnishtest/tests/r01837.vtc FAILED (60.001) signal=9

1 @ Ubuntu LTS i686 1.04 fgs

*    top   0.0 TEST ../../../bin/varnishtest/tests/r01837.vtc starting
[...]
*    top   0.0 TEST Test VCC errors out if probe is used before it is defined
[...]
**** v1    0.1 CLI TX|vcl.inline vcl1 << %XJEIFLH|)Xspa8P
**** v1    0.1 CLI TX|vcl 4.0;
**** v1    0.1 CLI TX|
**** v1    0.1 CLI TX|\tbackend b {
**** v1    0.1 CLI TX|\t\t.host = "127.0.0.1";
**** v1    0.1 CLI TX|\t\t.probe = p;
**** v1    0.1 CLI TX|\t}
**** v1    0.1 CLI TX|\tprobe p {
**** v1    0.1 CLI TX|\t}
**** v1    0.1 CLI TX|
**** v1    0.1 CLI TX|%XJEIFLH|)Xspa8P
***  v1    0.1 CLI RX  106
**** v1    0.1 CLI RX|Message from VCC-compiler:
**** v1    0.1 CLI RX|Probe p not found
**** v1    0.1 CLI RX|('<vcl.inline>' Line 5 Pos 26)
**** v1    0.1 CLI RX|                .probe = p;
**** v1    0.1 CLI RX|-------------------------#-
**** v1    0.1 CLI RX|
**** v1    0.1 CLI RX|Running VCC-compiler failed, exited with 2
**** v1    0.1 CLI RX|VCL compilation failed
**   v1    0.1 VCL compilation failed (as expected)
***  v1    0.1 Found expected string: ("Probe p not found")
*    top   0.1 RESETTING after ../../../bin/varnishtest/tests/r01837.vtc
**   v1    0.1 Wait
**** v1    0.1 CLI TX|backend.list
***  v1    0.1 CLI RX  101
**** v1    0.1 CLI RX|Unknown request in manager process (child not running).
**** v1    0.1 CLI RX|Type 'help' for more info.
**   v1    0.1 Stop
**** v1    0.1 CLI TX|stop
***  v1    0.2 CLI RX  300
**** v1    0.2 CLI RX|Child in state stopped
**** v1    0.2 CLI TX|status
***  v1    0.2 CLI RX  200
**** v1    0.2 CLI RX|Child in state stopped
**** v1    0.2 STDOUT poll 0x10
**   v1    0.2 R 19259 Status: 0000 (u 0.004000 s 0.004000)
*    diag  0.0 ............................................................
#    top  TEST ../../../bin/varnishtest/tests/r01837.vtc TIMED OUT (kill -9)
#    top  TEST ../../../bin/varnishtest/tests/r01837.vtc FAILED (60.001) signal=9

1 @ Linux 3.10.0 x86_64 1.02 mblissett

*    top   0.0 TEST ../../../bin/varnishtest/tests/r01837.vtc starting
[...]
*    top   0.0 TEST Test VCC errors out if probe is used before it is defined
[...]
**** v1    0.1 CLI TX|vcl.inline vcl1 << %XJEIFLH|)Xspa8P
**** v1    0.1 CLI TX|vcl 4.0;
**** v1    0.1 CLI TX|
**** v1    0.1 CLI TX|\tbackend b {
**** v1    0.1 CLI TX|\t\t.host = "127.0.0.1";
**** v1    0.1 CLI TX|\t\t.probe = p;
**** v1    0.1 CLI TX|\t}
**** v1    0.1 CLI TX|\tprobe p {
**** v1    0.1 CLI TX|\t}
**** v1    0.1 CLI TX|
**** v1    0.1 CLI TX|%XJEIFLH|)Xspa8P
***  v1    0.1 CLI RX  106
**** v1    0.1 CLI RX|Message from VCC-compiler:
**** v1    0.1 CLI RX|Probe p not found
**** v1    0.1 CLI RX|('<vcl.inline>' Line 5 Pos 26)
**** v1    0.1 CLI RX|                .probe = p;
**** v1    0.1 CLI RX|-------------------------#-
**** v1    0.1 CLI RX|
**** v1    0.1 CLI RX|Running VCC-compiler failed, exited with 2
**** v1    0.1 CLI RX|VCL compilation failed
**   v1    0.1 VCL compilation failed (as expected)
***  v1    0.1 Found expected string: ("Probe p not found")
*    top   0.1 RESETTING after ../../../bin/varnishtest/tests/r01837.vtc
**   v1    0.1 Wait
**** v1    0.1 CLI TX|backend.list
***  v1    0.2 CLI RX  101
**** v1    0.2 CLI RX|Unknown request in manager process (child not running).
**** v1    0.2 CLI RX|Type 'help' for more info.
**   v1    0.2 Stop
**** v1    0.2 CLI TX|stop
***  v1    0.2 CLI RX  300
**** v1    0.2 CLI RX|Child in state stopped
**** v1    0.2 CLI TX|status
***  v1    0.2 CLI RX  200
**** v1    0.2 CLI RX|Child in state stopped
**** v1    0.2 STDOUT poll 0x10
**   v1    0.2 R 13547 Status: 0000 (u 0.005148 s 0.018955)
*    diag  0.0 ............................................................
#    top  TEST ../../../bin/varnishtest/tests/r01837.vtc TIMED OUT (kill -9)
#    top  TEST ../../../bin/varnishtest/tests/r01837.vtc FAILED (60.002) signal=9

1 @ Ubuntu LTS i686 1.04 fgs

*    top   0.0 TEST ../../../bin/varnishtest/tests/r01837.vtc starting
[...]
*    top   0.0 TEST Test VCC errors out if probe is used before it is defined
[...]
**** v1    0.1 CLI TX|vcl.inline vcl1 << %XJEIFLH|)Xspa8P
**** v1    0.1 CLI TX|vcl 4.0;
**** v1    0.1 CLI TX|
**** v1    0.1 CLI TX|\tbackend b {
**** v1    0.1 CLI TX|\t\t.host = "127.0.0.1";
**** v1    0.1 CLI TX|\t\t.probe = p;
**** v1    0.1 CLI TX|\t}
**** v1    0.1 CLI TX|\tprobe p {
**** v1    0.1 CLI TX|\t}
**** v1    0.1 CLI TX|
**** v1    0.1 CLI TX|%XJEIFLH|)Xspa8P
***  v1    0.1 CLI RX  106
**** v1    0.1 CLI RX|Message from VCC-compiler:
**** v1    0.1 CLI RX|Probe p not found
**** v1    0.1 CLI RX|('<vcl.inline>' Line 5 Pos 26)
**** v1    0.1 CLI RX|                .probe = p;
**** v1    0.1 CLI RX|-------------------------#-
**** v1    0.1 CLI RX|
**** v1    0.1 CLI RX|Running VCC-compiler failed, exited with 2
**** v1    0.1 CLI RX|VCL compilation failed
**   v1    0.1 VCL compilation failed (as expected)
***  v1    0.1 Found expected string: ("Probe p not found")
*    top   0.1 RESETTING after ../../../bin/varnishtest/tests/r01837.vtc
**   v1    0.1 Wait
**** v1    0.1 CLI TX|backend.list
***  v1    0.1 CLI RX  101
**** v1    0.1 CLI RX|Unknown request in manager process (child not running).
**** v1    0.1 CLI RX|Type 'help' for more info.
**   v1    0.1 Stop
**** v1    0.1 CLI TX|stop
***  v1    0.2 CLI RX  300
**** v1    0.2 CLI RX|Child in state stopped
**** v1    0.2 CLI TX|status
***  v1    0.2 CLI RX  200
**** v1    0.2 CLI RX|Child in state stopped
**** v1    0.2 STDOUT poll 0x10
**   v1    0.2 R 31115 Status: 0000 (u 0.004000 s 0.000000)
*    diag  0.0 ............................................................
#    top  TEST ../../../bin/varnishtest/tests/r01837.vtc TIMED OUT (kill -9)
#    top  TEST ../../../bin/varnishtest/tests/r01837.vtc FAILED (60.001) signal=9

1 @ SunOS 5.11 i86pc 1.04 32_gcc4.7 uplex

*    top   0.0 TEST ../../../bin/varnishtest/tests/r01837.vtc starting
[...]
*    top   0.0 TEST Test VCC errors out if probe is used before it is defined
[...]
**** v1    0.1 CLI TX|vcl 4.0;
**** v1    0.1 CLI TX|
**** v1    0.1 CLI TX|\tbackend b {
**** v1    0.1 CLI TX|\t\t.host = "127.0.0.1";
**** v1    0.1 CLI TX|\t\t.probe = p;
**** v1    0.1 CLI TX|\t}
**** v1    0.1 CLI TX|\tprobe p {
**** v1    0.1 CLI TX|\t}
**** v1    0.1 CLI TX|
**** v1    0.1 CLI TX|%XJEIFLH|)Xspa8P
***  v1    0.1 CLI RX  106
**** v1    0.1 CLI RX|Message from VCC-compiler:
**** v1    0.1 CLI RX|Security: Privilege proc_setid missing, will not change uid/gid
**** v1    0.1 CLI RX|Probe p not found
**** v1    0.1 CLI RX|('<vcl.inline>' Line 5 Pos 26)
**** v1    0.1 CLI RX|                .probe = p;
**** v1    0.1 CLI RX|-------------------------#-
**** v1    0.1 CLI RX|
**** v1    0.1 CLI RX|Running VCC-compiler failed, exited with 2
**** v1    0.1 CLI RX|VCL compilation failed
**   v1    0.1 VCL compilation failed (as expected)
***  v1    0.1 Found expected string: ("Probe p not found")
*    top   0.1 RESETTING after ../../../bin/varnishtest/tests/r01837.vtc
**   v1    0.1 Wait
**** v1    0.1 CLI TX|backend.list
***  v1    0.1 CLI RX  101
**** v1    0.1 CLI RX|Unknown request in manager process (child not running).
**** v1    0.1 CLI RX|Type 'help' for more info.
**   v1    0.1 Stop
**** v1    0.1 CLI TX|stop
***  v1    0.1 CLI RX  300
**** v1    0.1 CLI RX|Child in state stopped
**** v1    0.1 CLI TX|status
***  v1    0.1 CLI RX  200
**** v1    0.1 CLI RX|Child in state stopped
**** v1    0.1 STDOUT poll 0x10
**   v1    0.1 R 53067 Status: 0000 (u 0.004000 s 0.017000)
*    diag  0.0 ............................................................
#    top  TEST ../../../bin/varnishtest/tests/r01837.vtc TIMED OUT (kill -9)
#    top  TEST ../../../bin/varnishtest/tests/r01837.vtc FAILED (60.002) signal=9

1 @ Ubuntu LTS i686 1.04 fgs

*    top   0.0 TEST ../../../bin/varnishtest/tests/r01837.vtc starting
[...]
*    top   0.0 TEST Test VCC errors out if probe is used before it is defined
[...]
**** v1    0.1 CLI TX|vcl.inline vcl1 << %XJEIFLH|)Xspa8P
**** v1    0.1 CLI TX|vcl 4.0;
**** v1    0.1 CLI TX|
**** v1    0.1 CLI TX|\tbackend b {
**** v1    0.1 CLI TX|\t\t.host = "127.0.0.1";
**** v1    0.1 CLI TX|\t\t.probe = p;
**** v1    0.1 CLI TX|\t}
**** v1    0.1 CLI TX|\tprobe p {
**** v1    0.1 CLI TX|\t}
**** v1    0.1 CLI TX|
**** v1    0.1 CLI TX|%XJEIFLH|)Xspa8P
***  v1    0.1 CLI RX  106
**** v1    0.1 CLI RX|Message from VCC-compiler:
**** v1    0.1 CLI RX|Probe p not found
**** v1    0.1 CLI RX|('<vcl.inline>' Line 5 Pos 26)
**** v1    0.1 CLI RX|                .probe = p;
**** v1    0.1 CLI RX|-------------------------#-
**** v1    0.1 CLI RX|
**** v1    0.1 CLI RX|Running VCC-compiler failed, exited with 2
**** v1    0.1 CLI RX|VCL compilation failed
**   v1    0.1 VCL compilation failed (as expected)
***  v1    0.1 Found expected string: ("Probe p not found")
*    top   0.1 RESETTING after ../../../bin/varnishtest/tests/r01837.vtc
**   v1    0.1 Wait
**** v1    0.1 CLI TX|backend.list
***  v1    0.1 CLI RX  101
**** v1    0.1 CLI RX|Unknown request in manager process (child not running).
**** v1    0.1 CLI RX|Type 'help' for more info.
**   v1    0.1 Stop
**** v1    0.1 CLI TX|stop
***  v1    0.2 CLI RX  300
**** v1    0.2 CLI RX|Child in state stopped
**** v1    0.2 CLI TX|status
***  v1    0.2 CLI RX  200
**** v1    0.2 CLI RX|Child in state stopped
**** v1    0.2 STDOUT poll 0x10
**   v1    0.2 R 4763 Status: 0000 (u 0.004000 s 0.000000)
*    diag  0.0 ............................................................
#    top  TEST ../../../bin/varnishtest/tests/r01837.vtc TIMED OUT (kill -9)
#    top  TEST ../../../bin/varnishtest/tests/r01837.vtc FAILED (60.002) signal=9

1 @ SunOS 5.11 i86pc 1.04 32_gcc4.7 uplex

*    top   0.0 TEST ../../../bin/varnishtest/tests/r01837.vtc starting
[...]
*    top   0.0 TEST Test VCC errors out if probe is used before it is defined
[...]
**** v1    0.1 CLI TX|vcl 4.0;
**** v1    0.1 CLI TX|
**** v1    0.1 CLI TX|\tbackend b {
**** v1    0.1 CLI TX|\t\t.host = "127.0.0.1";
**** v1    0.1 CLI TX|\t\t.probe = p;
**** v1    0.1 CLI TX|\t}
**** v1    0.1 CLI TX|\tprobe p {
**** v1    0.1 CLI TX|\t}
**** v1    0.1 CLI TX|
**** v1    0.1 CLI TX|%XJEIFLH|)Xspa8P
***  v1    0.1 CLI RX  106
**** v1    0.1 CLI RX|Message from VCC-compiler:
**** v1    0.1 CLI RX|Security: Privilege proc_setid missing, will not change uid/gid
**** v1    0.1 CLI RX|Probe p not found
**** v1    0.1 CLI RX|('<vcl.inline>' Line 5 Pos 26)
**** v1    0.1 CLI RX|                .probe = p;
**** v1    0.1 CLI RX|-------------------------#-
**** v1    0.1 CLI RX|
**** v1    0.1 CLI RX|Running VCC-compiler failed, exited with 2
**** v1    0.1 CLI RX|VCL compilation failed
**   v1    0.1 VCL compilation failed (as expected)
***  v1    0.1 Found expected string: ("Probe p not found")
*    top   0.1 RESETTING after ../../../bin/varnishtest/tests/r01837.vtc
**   v1    0.1 Wait
**** v1    0.1 CLI TX|backend.list
***  v1    0.1 CLI RX  101
**** v1    0.1 CLI RX|Unknown request in manager process (child not running).
**** v1    0.1 CLI RX|Type 'help' for more info.
**   v1    0.1 Stop
**** v1    0.1 CLI TX|stop
***  v1    0.1 CLI RX  300
**** v1    0.1 CLI RX|Child in state stopped
**** v1    0.1 CLI TX|status
***  v1    0.1 CLI RX  200
**** v1    0.1 CLI RX|Child in state stopped
**** v1    0.1 STDOUT poll 0x10
**   v1    0.1 R 89880 Status: 0000 (u 0.004000 s 0.016000)
*    diag  0.0 ............................................................
#    top  TEST ../../../bin/varnishtest/tests/r01837.vtc TIMED OUT (kill -9)
#    top  TEST ../../../bin/varnishtest/tests/r01837.vtc FAILED (60.001) signal=9

1 @ SunOS 5.11 i86pc 1.04 64_sun12.4 uplex

*    top   0.0 TEST ../../../bin/varnishtest/tests/r01837.vtc starting
[...]
*    top   0.0 TEST Test VCC errors out if probe is used before it is defined
[...]
**** v1    0.1 CLI TX|vcl 4.0;
**** v1    0.1 CLI TX|
**** v1    0.1 CLI TX|\tbackend b {
**** v1    0.1 CLI TX|\t\t.host = "127.0.0.1";
**** v1    0.1 CLI TX|\t\t.probe = p;
**** v1    0.1 CLI TX|\t}
**** v1    0.1 CLI TX|\tprobe p {
**** v1    0.1 CLI TX|\t}
**** v1    0.1 CLI TX|
**** v1    0.1 CLI TX|%XJEIFLH|)Xspa8P
***  v1    0.1 CLI RX  106
**** v1    0.1 CLI RX|Message from VCC-compiler:
**** v1    0.1 CLI RX|Security: Privilege proc_setid missing, will not change uid/gid
**** v1    0.1 CLI RX|Probe p not found
**** v1    0.1 CLI RX|('<vcl.inline>' Line 5 Pos 26)
**** v1    0.1 CLI RX|                .probe = p;
**** v1    0.1 CLI RX|-------------------------#-
**** v1    0.1 CLI RX|
**** v1    0.1 CLI RX|Running VCC-compiler failed, exited with 2
**** v1    0.1 CLI RX|VCL compilation failed
**   v1    0.1 VCL compilation failed (as expected)
***  v1    0.1 Found expected string: ("Probe p not found")
*    top   0.1 RESETTING after ../../../bin/varnishtest/tests/r01837.vtc
**   v1    0.1 Wait
**** v1    0.1 CLI TX|backend.list
***  v1    0.1 CLI RX  101
**** v1    0.1 CLI RX|Unknown request in manager process (child not running).
**** v1    0.1 CLI RX|Type 'help' for more info.
**   v1    0.1 Stop
**** v1    0.1 CLI TX|stop
***  v1    0.1 CLI RX  300
**** v1    0.1 CLI RX|Child in state stopped
**** v1    0.1 CLI TX|status
***  v1    0.1 CLI RX  200
**** v1    0.1 CLI RX|Child in state stopped
**** v1    0.1 STDOUT poll 0x10
**   v1    0.1 R 94440 Status: 0000 (u 0.007000 s 0.023000)
*    diag  0.0 ............................................................
#    top  TEST ../../../bin/varnishtest/tests/r01837.vtc TIMED OUT (kill -9)
#    top  TEST ../../../bin/varnishtest/tests/r01837.vtc FAILED (60.004) signal=9

1 @ SunOS 5.11 i86pc 1.04 64_gcc4.7 uplex

*    top   0.0 TEST ../../../bin/varnishtest/tests/r01837.vtc starting
[...]
*    top   0.0 TEST Test VCC errors out if probe is used before it is defined
[...]
**** v1    0.1 CLI TX|vcl 4.0;
**** v1    0.1 CLI TX|
**** v1    0.1 CLI TX|\tbackend b {
**** v1    0.1 CLI TX|\t\t.host = "127.0.0.1";
**** v1    0.1 CLI TX|\t\t.probe = p;
**** v1    0.1 CLI TX|\t}
**** v1    0.1 CLI TX|\tprobe p {
**** v1    0.1 CLI TX|\t}
**** v1    0.1 CLI TX|
**** v1    0.1 CLI TX|%XJEIFLH|)Xspa8P
***  v1    0.1 CLI RX  106
**** v1    0.1 CLI RX|Message from VCC-compiler:
**** v1    0.1 CLI RX|Security: Privilege proc_setid missing, will not change uid/gid
**** v1    0.1 CLI RX|Probe p not found
**** v1    0.1 CLI RX|('<vcl.inline>' Line 5 Pos 26)
**** v1    0.1 CLI RX|                .probe = p;
**** v1    0.1 CLI RX|-------------------------#-
**** v1    0.1 CLI RX|
**** v1    0.1 CLI RX|Running VCC-compiler failed, exited with 2
**** v1    0.1 CLI RX|VCL compilation failed
**   v1    0.1 VCL compilation failed (as expected)
***  v1    0.1 Found expected string: ("Probe p not found")
*    top   0.1 RESETTING after ../../../bin/varnishtest/tests/r01837.vtc
**   v1    0.1 Wait
**** v1    0.1 CLI TX|backend.list
***  v1    0.1 CLI RX  101
**** v1    0.1 CLI RX|Unknown request in manager process (child not running).
**** v1    0.1 CLI RX|Type 'help' for more info.
**   v1    0.1 Stop
**** v1    0.1 CLI TX|stop
***  v1    0.1 CLI RX  300
**** v1    0.1 CLI RX|Child in state stopped
**** v1    0.1 CLI TX|status
***  v1    0.1 CLI RX  200
**** v1    0.1 CLI RX|Child in state stopped
**** v1    0.1 STDOUT poll 0x10
**   v1    0.1 R 2391 Status: 0000 (u 0.007000 s 0.021000)
*    diag  0.0 ............................................................
#    top  TEST ../../../bin/varnishtest/tests/r01837.vtc TIMED OUT (kill -9)
#    top  TEST ../../../bin/varnishtest/tests/r01837.vtc FAILED (60.004) signal=9

1 @ SunOS 5.11 i86pc 1.04 64_gcc4.7 uplex

*    top   0.0 TEST ../../../bin/varnishtest/tests/r01837.vtc starting
[...]
*    top   0.0 TEST Test VCC errors out if probe is used before it is defined
[...]
**** v1    0.1 CLI TX|vcl 4.0;
**** v1    0.1 CLI TX|
**** v1    0.1 CLI TX|\tbackend b {
**** v1    0.1 CLI TX|\t\t.host = "127.0.0.1";
**** v1    0.1 CLI TX|\t\t.probe = p;
**** v1    0.1 CLI TX|\t}
**** v1    0.1 CLI TX|\tprobe p {
**** v1    0.1 CLI TX|\t}
**** v1    0.1 CLI TX|
**** v1    0.1 CLI TX|%XJEIFLH|)Xspa8P
***  v1    0.1 CLI RX  106
**** v1    0.1 CLI RX|Message from VCC-compiler:
**** v1    0.1 CLI RX|Security: Privilege proc_setid missing, will not change uid/gid
**** v1    0.1 CLI RX|Probe p not found
**** v1    0.1 CLI RX|('<vcl.inline>' Line 5 Pos 26)
**** v1    0.1 CLI RX|                .probe = p;
**** v1    0.1 CLI RX|-------------------------#-
**** v1    0.1 CLI RX|
**** v1    0.1 CLI RX|Running VCC-compiler failed, exited with 2
**** v1    0.1 CLI RX|VCL compilation failed
**   v1    0.1 VCL compilation failed (as expected)
***  v1    0.1 Found expected string: ("Probe p not found")
*    top   0.1 RESETTING after ../../../bin/varnishtest/tests/r01837.vtc
**   v1    0.1 Wait
**** v1    0.1 CLI TX|backend.list
***  v1    0.1 CLI RX  101
**** v1    0.1 CLI RX|Unknown request in manager process (child not running).
**** v1    0.1 CLI RX|Type 'help' for more info.
**   v1    0.1 Stop
**** v1    0.1 CLI TX|stop
***  v1    0.1 CLI RX  300
**** v1    0.1 CLI RX|Child in state stopped
**** v1    0.1 CLI TX|status
***  v1    0.1 CLI RX  200
**** v1    0.1 CLI RX|Child in state stopped
**** v1    0.1 STDOUT poll 0x10
**   v1    0.1 R 62612 Status: 0000 (u 0.007000 s 0.024000)
*    diag  0.0 ............................................................
#    top  TEST ../../../bin/varnishtest/tests/r01837.vtc TIMED OUT (kill -9)
#    top  TEST ../../../bin/varnishtest/tests/r01837.vtc FAILED (60.004) signal=9

1 @ SunOS 5.11 i86pc 1.04 64_gcc4.7 uplex

*    top   0.0 TEST ../../../bin/varnishtest/tests/r01837.vtc starting
[...]
*    top   0.0 TEST Test VCC errors out if probe is used before it is defined
[...]
**** v1    0.1 CLI TX|vcl 4.0;
**** v1    0.1 CLI TX|
**** v1    0.1 CLI TX|\tbackend b {
**** v1    0.1 CLI TX|\t\t.host = "127.0.0.1";
**** v1    0.1 CLI TX|\t\t.probe = p;
**** v1    0.1 CLI TX|\t}
**** v1    0.1 CLI TX|\tprobe p {
**** v1    0.1 CLI TX|\t}
**** v1    0.1 CLI TX|
**** v1    0.1 CLI TX|%XJEIFLH|)Xspa8P
***  v1    0.1 CLI RX  106
**** v1    0.1 CLI RX|Message from VCC-compiler:
**** v1    0.1 CLI RX|Security: Privilege proc_setid missing, will not change uid/gid
**** v1    0.1 CLI RX|Probe p not found
**** v1    0.1 CLI RX|('<vcl.inline>' Line 5 Pos 26)
**** v1    0.1 CLI RX|                .probe = p;
**** v1    0.1 CLI RX|-------------------------#-
**** v1    0.1 CLI RX|
**** v1    0.1 CLI RX|Running VCC-compiler failed, exited with 2
**** v1    0.1 CLI RX|VCL compilation failed
**   v1    0.1 VCL compilation failed (as expected)
***  v1    0.1 Found expected string: ("Probe p not found")
*    top   0.1 RESETTING after ../../../bin/varnishtest/tests/r01837.vtc
**   v1    0.1 Wait
**** v1    0.1 CLI TX|backend.list
***  v1    0.1 CLI RX  101
**** v1    0.1 CLI RX|Unknown request in manager process (child not running).
**** v1    0.1 CLI RX|Type 'help' for more info.
**   v1    0.1 Stop
**** v1    0.1 CLI TX|stop
***  v1    0.1 CLI RX  300
**** v1    0.1 CLI RX|Child in state stopped
**** v1    0.1 CLI TX|status
***  v1    0.1 CLI RX  200
**** v1    0.1 CLI RX|Child in state stopped
**** v1    0.1 STDOUT poll 0x10
**   v1    0.1 R 57837 Status: 0000 (u 0.007000 s 0.022000)
*    diag  0.0 ............................................................
#    top  TEST ../../../bin/varnishtest/tests/r01837.vtc TIMED OUT (kill -9)
#    top  TEST ../../../bin/varnishtest/tests/r01837.vtc FAILED (60.004) signal=9

1 @ SunOS 5.11 i86pc 1.04 32_gcc4.7 uplex

*    top   0.0 TEST ../../../bin/varnishtest/tests/r01837.vtc starting
[...]
*    top   0.0 TEST Test VCC errors out if probe is used before it is defined
[...]
**** v1    0.1 CLI TX|vcl 4.0;
**** v1    0.1 CLI TX|
**** v1    0.1 CLI TX|\tbackend b {
**** v1    0.1 CLI TX|\t\t.host = "127.0.0.1";
**** v1    0.1 CLI TX|\t\t.probe = p;
**** v1    0.1 CLI TX|\t}
**** v1    0.1 CLI TX|\tprobe p {
**** v1    0.1 CLI TX|\t}
**** v1    0.1 CLI TX|
**** v1    0.1 CLI TX|%XJEIFLH|)Xspa8P
***  v1    0.1 CLI RX  106
**** v1    0.1 CLI RX|Message from VCC-compiler:
**** v1    0.1 CLI RX|Security: Privilege proc_setid missing, will not change uid/gid
**** v1    0.1 CLI RX|Probe p not found
**** v1    0.1 CLI RX|('<vcl.inline>' Line 5 Pos 26)
**** v1    0.1 CLI RX|                .probe = p;
**** v1    0.1 CLI RX|-------------------------#-
**** v1    0.1 CLI RX|
**** v1    0.1 CLI RX|Running VCC-compiler failed, exited with 2
**** v1    0.1 CLI RX|VCL compilation failed
**   v1    0.1 VCL compilation failed (as expected)
***  v1    0.1 Found expected string: ("Probe p not found")
*    top   0.1 RESETTING after ../../../bin/varnishtest/tests/r01837.vtc
**   v1    0.1 Wait
**** v1    0.1 CLI TX|backend.list
***  v1    0.1 CLI RX  101
**** v1    0.1 CLI RX|Unknown request in manager process (child not running).
**** v1    0.1 CLI RX|Type 'help' for more info.
**   v1    0.1 Stop
**** v1    0.1 CLI TX|stop
***  v1    0.1 CLI RX  300
**** v1    0.1 CLI RX|Child in state stopped
**** v1    0.1 CLI TX|status
***  v1    0.1 CLI RX  200
**** v1    0.1 CLI RX|Child in state stopped
**** v1    0.1 STDOUT poll 0x10
**   v1    0.1 R 33363 Status: 0000 (u 0.004000 s 0.018000)
*    diag  0.0 ............................................................
#    top  TEST ../../../bin/varnishtest/tests/r01837.vtc TIMED OUT (kill -9)
#    top  TEST ../../../bin/varnishtest/tests/r01837.vtc FAILED (60.002) signal=9

1 @ SunOS 5.11 i86pc 1.04 64_sun12.4 uplex

*    top   0.0 TEST ../../../bin/varnishtest/tests/r01837.vtc starting
[...]
*    top   0.0 TEST Test VCC errors out if probe is used before it is defined
[...]
**** v1    0.1 CLI TX|vcl 4.0;
**** v1    0.1 CLI TX|
**** v1    0.1 CLI TX|\tbackend b {
**** v1    0.1 CLI TX|\t\t.host = "127.0.0.1";
**** v1    0.1 CLI TX|\t\t.probe = p;
**** v1    0.1 CLI TX|\t}
**** v1    0.1 CLI TX|\tprobe p {
**** v1    0.1 CLI TX|\t}
**** v1    0.1 CLI TX|
**** v1    0.1 CLI TX|%XJEIFLH|)Xspa8P
***  v1    0.1 CLI RX  106
**** v1    0.1 CLI RX|Message from VCC-compiler:
**** v1    0.1 CLI RX|Security: Privilege proc_setid missing, will not change uid/gid
**** v1    0.1 CLI RX|Probe p not found
**** v1    0.1 CLI RX|('<vcl.inline>' Line 5 Pos 26)
**** v1    0.1 CLI RX|                .probe = p;
**** v1    0.1 CLI RX|-------------------------#-
**** v1    0.1 CLI RX|
**** v1    0.1 CLI RX|Running VCC-compiler failed, exited with 2
**** v1    0.1 CLI RX|VCL compilation failed
**   v1    0.1 VCL compilation failed (as expected)
***  v1    0.1 Found expected string: ("Probe p not found")
*    top   0.1 RESETTING after ../../../bin/varnishtest/tests/r01837.vtc
**   v1    0.1 Wait
**** v1    0.1 CLI TX|backend.list
***  v1    0.1 CLI RX  101
**** v1    0.1 CLI RX|Unknown request in manager process (child not running).
**** v1    0.1 CLI RX|Type 'help' for more info.
**   v1    0.1 Stop
**** v1    0.1 CLI TX|stop
***  v1    0.1 CLI RX  300
**** v1    0.1 CLI RX|Child in state stopped
**** v1    0.1 CLI TX|status
***  v1    0.1 CLI RX  200
**** v1    0.1 CLI RX|Child in state stopped
**** v1    0.1 STDOUT poll 0x10
**   v1    0.1 R 87164 Status: 0000 (u 0.007000 s 0.022000)
*    diag  0.0 ............................................................
#    top  TEST ../../../bin/varnishtest/tests/r01837.vtc TIMED OUT (kill -9)
#    top  TEST ../../../bin/varnishtest/tests/r01837.vtc FAILED (60.004) signal=9

1 @ Ubuntu LTS i686 1.04 fgs

*    top   0.0 TEST ../../../bin/varnishtest/tests/r01837.vtc starting
[...]
*    top   0.0 TEST Test VCC errors out if probe is used before it is defined
[...]
**** v1    0.1 CLI TX|vcl.inline vcl1 << %XJEIFLH|)Xspa8P
**** v1    0.1 CLI TX|vcl 4.0;
**** v1    0.1 CLI TX|
**** v1    0.1 CLI TX|\tbackend b {
**** v1    0.1 CLI TX|\t\t.host = "127.0.0.1";
**** v1    0.1 CLI TX|\t\t.probe = p;
**** v1    0.1 CLI TX|\t}
**** v1    0.1 CLI TX|\tprobe p {
**** v1    0.1 CLI TX|\t}
**** v1    0.1 CLI TX|
**** v1    0.1 CLI TX|%XJEIFLH|)Xspa8P
***  v1    0.1 CLI RX  106
**** v1    0.1 CLI RX|Message from VCC-compiler:
**** v1    0.1 CLI RX|Probe p not found
**** v1    0.1 CLI RX|('<vcl.inline>' Line 5 Pos 26)
**** v1    0.1 CLI RX|                .probe = p;
**** v1    0.1 CLI RX|-------------------------#-
**** v1    0.1 CLI RX|
**** v1    0.1 CLI RX|Running VCC-compiler failed, exited with 2
**** v1    0.1 CLI RX|VCL compilation failed
**   v1    0.1 VCL compilation failed (as expected)
***  v1    0.1 Found expected string: ("Probe p not found")
*    top   0.1 RESETTING after ../../../bin/varnishtest/tests/r01837.vtc
**   v1    0.1 Wait
**** v1    0.1 CLI TX|backend.list
***  v1    0.1 CLI RX  101
**** v1    0.1 CLI RX|Unknown request in manager process (child not running).
**** v1    0.1 CLI RX|Type 'help' for more info.
**   v1    0.1 Stop
**** v1    0.1 CLI TX|stop
***  v1    0.2 CLI RX  300
**** v1    0.2 CLI RX|Child in state stopped
**** v1    0.2 CLI TX|status
***  v1    0.2 CLI RX  200
**** v1    0.2 CLI RX|Child in state stopped
**** v1    0.2 STDOUT poll 0x10
**   v1    0.2 R 25257 Status: 0000 (u 0.000000 s 0.004000)
*    diag  0.0 ............................................................
#    top  TEST ../../../bin/varnishtest/tests/r01837.vtc TIMED OUT (kill -9)
#    top  TEST ../../../bin/varnishtest/tests/r01837.vtc FAILED (60.001) signal=9

1 @ SunOS 5.11 i86pc 1.04 64_gcc4.7 uplex

*    top   0.0 TEST ../../../bin/varnishtest/tests/r01837.vtc starting
[...]
*    top   0.0 TEST Test VCC errors out if probe is used before it is defined
[...]
**** v1    0.1 CLI TX|vcl 4.0;
**** v1    0.1 CLI TX|
**** v1    0.1 CLI TX|\tbackend b {
**** v1    0.1 CLI TX|\t\t.host = "127.0.0.1";
**** v1    0.1 CLI TX|\t\t.probe = p;
**** v1    0.1 CLI TX|\t}
**** v1    0.1 CLI TX|\tprobe p {
**** v1    0.1 CLI TX|\t}
**** v1    0.1 CLI TX|
**** v1    0.1 CLI TX|%XJEIFLH|)Xspa8P
***  v1    0.1 CLI RX  106
**** v1    0.1 CLI RX|Message from VCC-compiler:
**** v1    0.1 CLI RX|Security: Privilege proc_setid missing, will not change uid/gid
**** v1    0.1 CLI RX|Probe p not found
**** v1    0.1 CLI RX|('<vcl.inline>' Line 5 Pos 26)
**** v1    0.1 CLI RX|                .probe = p;
**** v1    0.1 CLI RX|-------------------------#-
**** v1    0.1 CLI RX|
**** v1    0.1 CLI RX|Running VCC-compiler failed, exited with 2
**** v1    0.1 CLI RX|VCL compilation failed
**   v1    0.1 VCL compilation failed (as expected)
***  v1    0.1 Found expected string: ("Probe p not found")
*    top   0.1 RESETTING after ../../../bin/varnishtest/tests/r01837.vtc
**   v1    0.1 Wait
**** v1    0.1 CLI TX|backend.list
***  v1    0.1 CLI RX  101
**** v1    0.1 CLI RX|Unknown request in manager process (child not running).
**** v1    0.1 CLI RX|Type 'help' for more info.
**   v1    0.1 Stop
**** v1    0.1 CLI TX|stop
***  v1    0.1 CLI RX  300
**** v1    0.1 CLI RX|Child in state stopped
**** v1    0.1 CLI TX|status
***  v1    0.1 CLI RX  200
**** v1    0.1 CLI RX|Child in state stopped
**** v1    0.1 STDOUT poll 0x10
**   v1    0.1 R 3558 Status: 0000 (u 0.007000 s 0.024000)
*    diag  0.0 ............................................................
#    top  TEST ../../../bin/varnishtest/tests/r01837.vtc TIMED OUT (kill -9)
#    top  TEST ../../../bin/varnishtest/tests/r01837.vtc FAILED (60.004) signal=9

1 @ SunOS 5.11 i86pc 1.04 64_gcc4.7 uplex

*    top   0.0 TEST ../../../bin/varnishtest/tests/r01837.vtc starting
[...]
*    top   0.0 TEST Test VCC errors out if probe is used before it is defined
[...]
**** v1    0.1 CLI TX|vcl 4.0;
**** v1    0.1 CLI TX|
**** v1    0.1 CLI TX|\tbackend b {
**** v1    0.1 CLI TX|\t\t.host = "127.0.0.1";
**** v1    0.1 CLI TX|\t\t.probe = p;
**** v1    0.1 CLI TX|\t}
**** v1    0.1 CLI TX|\tprobe p {
**** v1    0.1 CLI TX|\t}
**** v1    0.1 CLI TX|
**** v1    0.1 CLI TX|%XJEIFLH|)Xspa8P
***  v1    0.1 CLI RX  106
**** v1    0.1 CLI RX|Message from VCC-compiler:
**** v1    0.1 CLI RX|Security: Privilege proc_setid missing, will not change uid/gid
**** v1    0.1 CLI RX|Probe p not found
**** v1    0.1 CLI RX|('<vcl.inline>' Line 5 Pos 26)
**** v1    0.1 CLI RX|                .probe = p;
**** v1    0.1 CLI RX|-------------------------#-
**** v1    0.1 CLI RX|
**** v1    0.1 CLI RX|Running VCC-compiler failed, exited with 2
**** v1    0.1 CLI RX|VCL compilation failed
**   v1    0.1 VCL compilation failed (as expected)
***  v1    0.1 Found expected string: ("Probe p not found")
*    top   0.1 RESETTING after ../../../bin/varnishtest/tests/r01837.vtc
**   v1    0.1 Wait
**** v1    0.1 CLI TX|backend.list
***  v1    0.1 CLI RX  101
**** v1    0.1 CLI RX|Unknown request in manager process (child not running).
**** v1    0.1 CLI RX|Type 'help' for more info.
**   v1    0.1 Stop
**** v1    0.1 CLI TX|stop
***  v1    0.1 CLI RX  300
**** v1    0.1 CLI RX|Child in state stopped
**** v1    0.1 CLI TX|status
***  v1    0.1 CLI RX  200
**** v1    0.1 CLI RX|Child in state stopped
**** v1    0.1 STDOUT poll 0x10
**   v1    0.1 R 18000 Status: 0000 (u 0.006000 s 0.022000)
*    diag  0.0 ............................................................
#    top  TEST ../../../bin/varnishtest/tests/r01837.vtc TIMED OUT (kill -9)
#    top  TEST ../../../bin/varnishtest/tests/r01837.vtc FAILED (60.004) signal=9

1 @ SunOS 5.11 i86pc 1.04 64_sun12.4 uplex

*    top   0.0 TEST ../../../bin/varnishtest/tests/r01837.vtc starting
[...]
*    top   0.0 TEST Test VCC errors out if probe is used before it is defined
[...]
**** v1    0.1 CLI TX|vcl 4.0;
**** v1    0.1 CLI TX|
**** v1    0.1 CLI TX|\tbackend b {
**** v1    0.1 CLI TX|\t\t.host = "127.0.0.1";
**** v1    0.1 CLI TX|\t\t.probe = p;
**** v1    0.1 CLI TX|\t}
**** v1    0.1 CLI TX|\tprobe p {
**** v1    0.1 CLI TX|\t}
**** v1    0.1 CLI TX|
**** v1    0.1 CLI TX|%XJEIFLH|)Xspa8P
***  v1    0.1 CLI RX  106
**** v1    0.1 CLI RX|Message from VCC-compiler:
**** v1    0.1 CLI RX|Security: Privilege proc_setid missing, will not change uid/gid
**** v1    0.1 CLI RX|Probe p not found
**** v1    0.1 CLI RX|('<vcl.inline>' Line 5 Pos 26)
**** v1    0.1 CLI RX|                .probe = p;
**** v1    0.1 CLI RX|-------------------------#-
**** v1    0.1 CLI RX|
**** v1    0.1 CLI RX|Running VCC-compiler failed, exited with 2
**** v1    0.1 CLI RX|VCL compilation failed
**   v1    0.1 VCL compilation failed (as expected)
***  v1    0.1 Found expected string: ("Probe p not found")
*    top   0.1 RESETTING after ../../../bin/varnishtest/tests/r01837.vtc
**   v1    0.1 Wait
**** v1    0.1 CLI TX|backend.list
***  v1    0.1 CLI RX  101
**** v1    0.1 CLI RX|Unknown request in manager process (child not running).
**** v1    0.1 CLI RX|Type 'help' for more info.
**   v1    0.1 Stop
**** v1    0.1 CLI TX|stop
***  v1    0.1 CLI RX  300
**** v1    0.1 CLI RX|Child in state stopped
**** v1    0.1 CLI TX|status
***  v1    0.1 CLI RX  200
**** v1    0.1 CLI RX|Child in state stopped
**** v1    0.1 STDOUT poll 0x10
**   v1    0.1 R 13976 Status: 0000 (u 0.007000 s 0.024000)
*    diag  0.0 ............................................................
#    top  TEST ../../../bin/varnishtest/tests/r01837.vtc TIMED OUT (kill -9)
#    top  TEST ../../../bin/varnishtest/tests/r01837.vtc FAILED (60.004) signal=9