r02451

7251861

1 @ SunOS i86pc 5.11 1.04 32_sun12.4 uplex

*    top   0.0 TEST ../../../bin/varnishtest/tests/r02451.vtc starting
[...]
*    top   0.0 TEST test PRIV_TASK in vcl_init is per vmod
[...]
**** v1    0.2 CLI TX|
**** v1    0.2 CLI TX|\t\tstd.log("func " + debug.test_priv_task());
**** v1    0.2 CLI TX|\t\tstd.log("obj "\t+ objx.test_priv_task());
**** v1    0.2 CLI TX|\t}
**** v1    0.2 CLI TX|
**** v1    0.2 CLI TX|\tsub vcl_recv {
**** v1    0.2 CLI TX|\t\tset req.backend_hint = vd.backend();
**** v1    0.2 CLI TX|\t\treturn(pass);
**** v1    0.2 CLI TX|\t}
**** v1    0.2 CLI TX|
**** v1    0.2 CLI TX|
**** v1    0.2 CLI TX|%XJEIFLH|)Xspa8P
***  v1    0.2 CLI RX  106
**** v1    0.2 CLI RX|Message from VCC-compiler:
**** v1    0.2 CLI RX|Security: Privilege proc_setid missing, will not change uid/gid
**** v1    0.2 CLI RX|Could not load VMOD std
**** v1    0.2 CLI RX|\tFile name: /tmp/vtest.32_sun12.4/varnish-cache/varnish-trunk/_build/lib/libvmod_std/.libs/libvmod_std.so
**** v1    0.2 CLI RX|\tdlerror: ld.so.1: varnishd: fatal: relocation error: file /tmp/vtest.32_sun12.4/varnish-cache/varnish-trunk/_build/lib/libvmod_std/.libs/libvmod_std.so: symbol vmod_issyntax: referenced symbol not found
**** v1    0.2 CLI RX|('<vcl.inline>' Line 9 Pos 16)
**** v1    0.2 CLI RX|        import std;
**** v1    0.2 CLI RX|---------------###-
**** v1    0.2 CLI RX|
**** v1    0.2 CLI RX|Running VCC-compiler failed, exited with 2
**** v1    0.2 CLI RX|VCL compilation failed
---- v1    0.2 FAIL VCL does not compile
*    top   0.2 RESETTING after ../../../bin/varnishtest/tests/r02451.vtc
**   s1    0.2 Waiting for server (3/-1)
**   s2    0.2 Waiting for server (4/-1)
**   s3    0.2 Waiting for server (6/-1)
**   v1    0.2 Wait
**** v1    0.2 CLI TX|panic.clear
***  v1    0.2 CLI RX  300
**** v1    0.2 CLI RX|No panic to clear
***  v1    0.2 debug|Info: manager stopping child
***  v1    0.2 debug|Info: manager dies
**** v1    0.2 STDOUT poll 0x10
**   v1    0.2 R 32703 Status: 0000 (u 0.013000 s 0.033000)
***  v1    0.3 vsl|No VSL chunk found (child not started ?)
*    top   0.3 TEST ../../../bin/varnishtest/tests/r02451.vtc FAILED
#    top  TEST ../../../bin/varnishtest/tests/r02451.vtc FAILED (0.254) exit=2

1 @ SunOS i86pc 5.11 1.04 64_sun12.4 uplex

*    top   0.0 TEST ../../../bin/varnishtest/tests/r02451.vtc starting
[...]
*    top   0.0 TEST test PRIV_TASK in vcl_init is per vmod
[...]
**** v1    0.1 CLI TX|
**** v1    0.1 CLI TX|\t\tstd.log("func " + debug.test_priv_task());
**** v1    0.1 CLI TX|\t\tstd.log("obj "\t+ objx.test_priv_task());
**** v1    0.1 CLI TX|\t}
**** v1    0.1 CLI TX|
**** v1    0.1 CLI TX|\tsub vcl_recv {
**** v1    0.1 CLI TX|\t\tset req.backend_hint = vd.backend();
**** v1    0.1 CLI TX|\t\treturn(pass);
**** v1    0.1 CLI TX|\t}
**** v1    0.1 CLI TX|
**** v1    0.1 CLI TX|
**** v1    0.1 CLI TX|%XJEIFLH|)Xspa8P
***  v1    0.1 CLI RX  106
**** v1    0.1 CLI RX|Message from VCC-compiler:
**** v1    0.1 CLI RX|Security: Privilege proc_setid missing, will not change uid/gid
**** v1    0.1 CLI RX|Could not load VMOD std
**** v1    0.1 CLI RX|\tFile name: /tmp/vtest.64_sun12.4/varnish-cache/varnish-trunk/_build/lib/libvmod_std/.libs/libvmod_std.so
**** v1    0.1 CLI RX|\tdlerror: ld.so.1: varnishd: fatal: relocation error: file /tmp/vtest.64_sun12.4/varnish-cache/varnish-trunk/_build/lib/libvmod_std/.libs/libvmod_std.so: symbol vmod_issyntax: referenced symbol not found
**** v1    0.1 CLI RX|('<vcl.inline>' Line 9 Pos 16)
**** v1    0.1 CLI RX|        import std;
**** v1    0.1 CLI RX|---------------###-
**** v1    0.1 CLI RX|
**** v1    0.1 CLI RX|Running VCC-compiler failed, exited with 2
**** v1    0.1 CLI RX|VCL compilation failed
---- v1    0.1 FAIL VCL does not compile
*    top   0.1 RESETTING after ../../../bin/varnishtest/tests/r02451.vtc
**   s1    0.1 Waiting for server (3/-1)
**   s2    0.2 Waiting for server (4/-1)
**   s3    0.2 Waiting for server (6/-1)
**   v1    0.2 Wait
**** v1    0.2 CLI TX|panic.clear
***  v1    0.2 CLI RX  300
**** v1    0.2 CLI RX|No panic to clear
***  v1    0.2 debug|Info: manager stopping child
***  v1    0.2 debug|Info: manager dies
**** v1    0.2 STDOUT poll 0x10
**   v1    0.2 R 75806 Status: 0000 (u 0.009000 s 0.026000)
***  v1    0.2 vsl|No VSL chunk found (child not started ?)
*    top   0.2 TEST ../../../bin/varnishtest/tests/r02451.vtc FAILED
#    top  TEST ../../../bin/varnishtest/tests/r02451.vtc FAILED (0.245) exit=2

1 @ SunOS i86pc 5.11 1.04 64_sun12.4 uplex

*    top   0.0 TEST ../../../bin/varnishtest/tests/r02451.vtc starting
[...]
*    top   0.0 TEST test PRIV_TASK in vcl_init is per vmod
[...]
**** v1    0.1 CLI TX|
**** v1    0.1 CLI TX|\t\tstd.log("func " + debug.test_priv_task());
**** v1    0.1 CLI TX|\t\tstd.log("obj "\t+ objx.test_priv_task());
**** v1    0.1 CLI TX|\t}
**** v1    0.1 CLI TX|
**** v1    0.1 CLI TX|\tsub vcl_recv {
**** v1    0.1 CLI TX|\t\tset req.backend_hint = vd.backend();
**** v1    0.1 CLI TX|\t\treturn(pass);
**** v1    0.1 CLI TX|\t}
**** v1    0.1 CLI TX|
**** v1    0.1 CLI TX|
**** v1    0.1 CLI TX|%XJEIFLH|)Xspa8P
***  v1    0.2 CLI RX  106
**** v1    0.2 CLI RX|Message from VCC-compiler:
**** v1    0.2 CLI RX|Security: Privilege proc_setid missing, will not change uid/gid
**** v1    0.2 CLI RX|Could not load VMOD std
**** v1    0.2 CLI RX|\tFile name: /tmp/vtest.64_sun12.4/varnish-cache/varnish-trunk/_build/lib/libvmod_std/.libs/libvmod_std.so
**** v1    0.2 CLI RX|\tdlerror: ld.so.1: varnishd: fatal: relocation error: file /tmp/vtest.64_sun12.4/varnish-cache/varnish-trunk/_build/lib/libvmod_std/.libs/libvmod_std.so: symbol vmod_issyntax: referenced symbol not found
**** v1    0.2 CLI RX|('<vcl.inline>' Line 9 Pos 16)
**** v1    0.2 CLI RX|        import std;
**** v1    0.2 CLI RX|---------------###-
**** v1    0.2 CLI RX|
**** v1    0.2 CLI RX|Running VCC-compiler failed, exited with 2
**** v1    0.2 CLI RX|VCL compilation failed
---- v1    0.2 FAIL VCL does not compile
*    top   0.2 RESETTING after ../../../bin/varnishtest/tests/r02451.vtc
**   s1    0.2 Waiting for server (3/-1)
**   s2    0.2 Waiting for server (4/-1)
**   s3    0.2 Waiting for server (6/-1)
**   v1    0.2 Wait
**** v1    0.2 CLI TX|panic.clear
***  v1    0.2 CLI RX  300
**** v1    0.2 CLI RX|No panic to clear
***  v1    0.2 debug|Info: manager stopping child
***  v1    0.2 debug|Info: manager dies
**** v1    0.2 STDOUT poll 0x10
**   v1    0.2 R 31479 Status: 0000 (u 0.010000 s 0.033000)
***  v1    0.2 vsl|No VSL chunk found (child not started ?)
*    top   0.2 TEST ../../../bin/varnishtest/tests/r02451.vtc FAILED
#    top  TEST ../../../bin/varnishtest/tests/r02451.vtc FAILED (0.254) exit=2

1 @ SunOS i86pc 5.11 1.04 32_sun12.4 uplex

*    top   0.0 TEST ../../../bin/varnishtest/tests/r02451.vtc starting
[...]
*    top   0.0 TEST test PRIV_TASK in vcl_init is per vmod
[...]
**** v1    0.1 CLI TX|
**** v1    0.1 CLI TX|\t\tstd.log("func " + debug.test_priv_task());
**** v1    0.1 CLI TX|\t\tstd.log("obj "\t+ objx.test_priv_task());
**** v1    0.1 CLI TX|\t}
**** v1    0.1 CLI TX|
**** v1    0.1 CLI TX|\tsub vcl_recv {
**** v1    0.1 CLI TX|\t\tset req.backend_hint = vd.backend();
**** v1    0.1 CLI TX|\t\treturn(pass);
**** v1    0.1 CLI TX|\t}
**** v1    0.1 CLI TX|
**** v1    0.1 CLI TX|
**** v1    0.1 CLI TX|%XJEIFLH|)Xspa8P
***  v1    0.2 CLI RX  106
**** v1    0.2 CLI RX|Message from VCC-compiler:
**** v1    0.2 CLI RX|Security: Privilege proc_setid missing, will not change uid/gid
**** v1    0.2 CLI RX|Could not load VMOD std
**** v1    0.2 CLI RX|\tFile name: /tmp/vtest.32_sun12.4/varnish-cache/varnish-trunk/_build/lib/libvmod_std/.libs/libvmod_std.so
**** v1    0.2 CLI RX|\tdlerror: ld.so.1: varnishd: fatal: relocation error: file /tmp/vtest.32_sun12.4/varnish-cache/varnish-trunk/_build/lib/libvmod_std/.libs/libvmod_std.so: symbol vmod_issyntax: referenced symbol not found
**** v1    0.2 CLI RX|('<vcl.inline>' Line 9 Pos 16)
**** v1    0.2 CLI RX|        import std;
**** v1    0.2 CLI RX|---------------###-
**** v1    0.2 CLI RX|
**** v1    0.2 CLI RX|Running VCC-compiler failed, exited with 2
**** v1    0.2 CLI RX|VCL compilation failed
---- v1    0.2 FAIL VCL does not compile
*    top   0.2 RESETTING after ../../../bin/varnishtest/tests/r02451.vtc
**   s1    0.2 Waiting for server (3/-1)
**   s2    0.2 Waiting for server (4/-1)
**   s3    0.2 Waiting for server (6/-1)
**   v1    0.2 Wait
**** v1    0.2 CLI TX|panic.clear
***  v1    0.2 CLI RX  300
**** v1    0.2 CLI RX|No panic to clear
***  v1    0.2 debug|Info: manager stopping child
***  v1    0.2 debug|Info: manager dies
**** v1    0.2 STDOUT poll 0x10
**   v1    0.2 R 79947 Status: 0000 (u 0.011000 s 0.032000)
***  v1    0.3 vsl|No VSL chunk found (child not started ?)
*    top   0.3 TEST ../../../bin/varnishtest/tests/r02451.vtc FAILED
#    top  TEST ../../../bin/varnishtest/tests/r02451.vtc FAILED (0.253) exit=2

1 @ SunOS i86pc 5.11 1.04 32_sun12.4 uplex

*    top   0.0 TEST ../../../bin/varnishtest/tests/r02451.vtc starting
[...]
*    top   0.0 TEST test PRIV_TASK in vcl_init is per vmod
[...]
**** v1    0.1 CLI TX|
**** v1    0.1 CLI TX|\t\tstd.log("func " + debug.test_priv_task());
**** v1    0.1 CLI TX|\t\tstd.log("obj "\t+ objx.test_priv_task());
**** v1    0.1 CLI TX|\t}
**** v1    0.1 CLI TX|
**** v1    0.1 CLI TX|\tsub vcl_recv {
**** v1    0.1 CLI TX|\t\tset req.backend_hint = vd.backend();
**** v1    0.1 CLI TX|\t\treturn(pass);
**** v1    0.1 CLI TX|\t}
**** v1    0.1 CLI TX|
**** v1    0.1 CLI TX|
**** v1    0.1 CLI TX|%XJEIFLH|)Xspa8P
***  v1    0.2 CLI RX  106
**** v1    0.2 CLI RX|Message from VCC-compiler:
**** v1    0.2 CLI RX|Security: Privilege proc_setid missing, will not change uid/gid
**** v1    0.2 CLI RX|Could not load VMOD std
**** v1    0.2 CLI RX|\tFile name: /tmp/vtest.32_sun12.4/varnish-cache/varnish-trunk/_build/lib/libvmod_std/.libs/libvmod_std.so
**** v1    0.2 CLI RX|\tdlerror: ld.so.1: varnishd: fatal: relocation error: file /tmp/vtest.32_sun12.4/varnish-cache/varnish-trunk/_build/lib/libvmod_std/.libs/libvmod_std.so: symbol vmod_issyntax: referenced symbol not found
**** v1    0.2 CLI RX|('<vcl.inline>' Line 9 Pos 16)
**** v1    0.2 CLI RX|        import std;
**** v1    0.2 CLI RX|---------------###-
**** v1    0.2 CLI RX|
**** v1    0.2 CLI RX|Running VCC-compiler failed, exited with 2
**** v1    0.2 CLI RX|VCL compilation failed
---- v1    0.2 FAIL VCL does not compile
*    top   0.2 RESETTING after ../../../bin/varnishtest/tests/r02451.vtc
**   s1    0.2 Waiting for server (3/-1)
**   s2    0.2 Waiting for server (4/-1)
**   s3    0.2 Waiting for server (6/-1)
**   v1    0.2 Wait
**** v1    0.2 CLI TX|panic.clear
***  v1    0.2 CLI RX  300
**** v1    0.2 CLI RX|No panic to clear
***  v1    0.2 debug|Info: manager stopping child
***  v1    0.2 debug|Info: manager dies
**** v1    0.2 STDOUT poll 0x10
**   v1    0.2 R 55988 Status: 0000 (u 0.010000 s 0.028000)
***  v1    0.2 vsl|No VSL chunk found (child not started ?)
*    top   0.2 TEST ../../../bin/varnishtest/tests/r02451.vtc FAILED
#    top  TEST ../../../bin/varnishtest/tests/r02451.vtc FAILED (0.247) exit=2

1 @ SunOS i86pc 5.11 1.04 64_sun12.4 uplex

*    top   0.0 TEST ../../../bin/varnishtest/tests/r02451.vtc starting
[...]
*    top   0.0 TEST test PRIV_TASK in vcl_init is per vmod
[...]
**** v1    0.2 CLI TX|
**** v1    0.2 CLI TX|\t\tstd.log("func " + debug.test_priv_task());
**** v1    0.2 CLI TX|\t\tstd.log("obj "\t+ objx.test_priv_task());
**** v1    0.2 CLI TX|\t}
**** v1    0.2 CLI TX|
**** v1    0.2 CLI TX|\tsub vcl_recv {
**** v1    0.2 CLI TX|\t\tset req.backend_hint = vd.backend();
**** v1    0.2 CLI TX|\t\treturn(pass);
**** v1    0.2 CLI TX|\t}
**** v1    0.2 CLI TX|
**** v1    0.2 CLI TX|
**** v1    0.2 CLI TX|%XJEIFLH|)Xspa8P
***  v1    0.2 CLI RX  106
**** v1    0.2 CLI RX|Message from VCC-compiler:
**** v1    0.2 CLI RX|Security: Privilege proc_setid missing, will not change uid/gid
**** v1    0.2 CLI RX|Could not load VMOD std
**** v1    0.2 CLI RX|\tFile name: /tmp/vtest.64_sun12.4/varnish-cache/varnish-trunk/_build/lib/libvmod_std/.libs/libvmod_std.so
**** v1    0.2 CLI RX|\tdlerror: ld.so.1: varnishd: fatal: relocation error: file /tmp/vtest.64_sun12.4/varnish-cache/varnish-trunk/_build/lib/libvmod_std/.libs/libvmod_std.so: symbol vmod_issyntax: referenced symbol not found
**** v1    0.2 CLI RX|('<vcl.inline>' Line 9 Pos 16)
**** v1    0.2 CLI RX|        import std;
**** v1    0.2 CLI RX|---------------###-
**** v1    0.2 CLI RX|
**** v1    0.2 CLI RX|Running VCC-compiler failed, exited with 2
**** v1    0.2 CLI RX|VCL compilation failed
---- v1    0.2 FAIL VCL does not compile
*    top   0.2 RESETTING after ../../../bin/varnishtest/tests/r02451.vtc
**   s1    0.2 Waiting for server (3/-1)
**   s2    0.2 Waiting for server (4/-1)
**   s3    0.2 Waiting for server (6/-1)
**   v1    0.2 Wait
**** v1    0.2 CLI TX|panic.clear
***  v1    0.2 CLI RX  300
**** v1    0.2 CLI RX|No panic to clear
***  v1    0.2 debug|Info: manager stopping child
***  v1    0.2 debug|Info: manager dies
**** v1    0.2 STDOUT poll 0x10
**   v1    0.2 R 53812 Status: 0000 (u 0.013000 s 0.041000)
***  v1    0.3 vsl|No VSL chunk found (child not started ?)
*    top   0.3 TEST ../../../bin/varnishtest/tests/r02451.vtc FAILED
#    top  TEST ../../../bin/varnishtest/tests/r02451.vtc FAILED (0.269) exit=2

1 @ SunOS i86pc 5.11 1.04 32_sun12.4 uplex

*    top   0.0 TEST ../../../bin/varnishtest/tests/r02451.vtc starting
[...]
*    top   0.0 TEST test PRIV_TASK in vcl_init is per vmod
[...]
**** v1    0.1 CLI TX|
**** v1    0.1 CLI TX|\t\tstd.log("func " + debug.test_priv_task());
**** v1    0.1 CLI TX|\t\tstd.log("obj "\t+ objx.test_priv_task());
**** v1    0.1 CLI TX|\t}
**** v1    0.1 CLI TX|
**** v1    0.1 CLI TX|\tsub vcl_recv {
**** v1    0.1 CLI TX|\t\tset req.backend_hint = vd.backend();
**** v1    0.1 CLI TX|\t\treturn(pass);
**** v1    0.1 CLI TX|\t}
**** v1    0.1 CLI TX|
**** v1    0.1 CLI TX|
**** v1    0.1 CLI TX|%XJEIFLH|)Xspa8P
***  v1    0.1 CLI RX  106
**** v1    0.1 CLI RX|Message from VCC-compiler:
**** v1    0.1 CLI RX|Security: Privilege proc_setid missing, will not change uid/gid
**** v1    0.1 CLI RX|Could not load VMOD std
**** v1    0.1 CLI RX|\tFile name: /tmp/vtest.32_sun12.4/varnish-cache/varnish-trunk/_build/lib/libvmod_std/.libs/libvmod_std.so
**** v1    0.1 CLI RX|\tdlerror: ld.so.1: varnishd: fatal: relocation error: file /tmp/vtest.32_sun12.4/varnish-cache/varnish-trunk/_build/lib/libvmod_std/.libs/libvmod_std.so: symbol vmod_issyntax: referenced symbol not found
**** v1    0.1 CLI RX|('<vcl.inline>' Line 9 Pos 16)
**** v1    0.1 CLI RX|        import std;
**** v1    0.1 CLI RX|---------------###-
**** v1    0.1 CLI RX|
**** v1    0.1 CLI RX|Running VCC-compiler failed, exited with 2
**** v1    0.1 CLI RX|VCL compilation failed
---- v1    0.2 FAIL VCL does not compile
*    top   0.2 RESETTING after ../../../bin/varnishtest/tests/r02451.vtc
**   s1    0.2 Waiting for server (3/-1)
**   s2    0.2 Waiting for server (4/-1)
**   s3    0.2 Waiting for server (6/-1)
**   v1    0.2 Wait
**** v1    0.2 CLI TX|panic.clear
***  v1    0.2 CLI RX  300
**** v1    0.2 CLI RX|No panic to clear
***  v1    0.2 debug|Info: manager stopping child
***  v1    0.2 debug|Info: manager dies
**** v1    0.2 STDOUT poll 0x10
**   v1    0.2 R 78224 Status: 0000 (u 0.010000 s 0.026000)
***  v1    0.2 vsl|No VSL chunk found (child not started ?)
*    top   0.2 TEST ../../../bin/varnishtest/tests/r02451.vtc FAILED
#    top  TEST ../../../bin/varnishtest/tests/r02451.vtc FAILED (0.244) exit=2

1 @ SunOS i86pc 5.11 1.04 64_sun12.4 uplex

*    top   0.0 TEST ../../../bin/varnishtest/tests/r02451.vtc starting
[...]
*    top   0.0 TEST test PRIV_TASK in vcl_init is per vmod
[...]
**** v1    0.1 CLI TX|
**** v1    0.1 CLI TX|\t\tstd.log("func " + debug.test_priv_task());
**** v1    0.1 CLI TX|\t\tstd.log("obj "\t+ objx.test_priv_task());
**** v1    0.1 CLI TX|\t}
**** v1    0.1 CLI TX|
**** v1    0.1 CLI TX|\tsub vcl_recv {
**** v1    0.1 CLI TX|\t\tset req.backend_hint = vd.backend();
**** v1    0.1 CLI TX|\t\treturn(pass);
**** v1    0.1 CLI TX|\t}
**** v1    0.1 CLI TX|
**** v1    0.1 CLI TX|
**** v1    0.1 CLI TX|%XJEIFLH|)Xspa8P
***  v1    0.2 CLI RX  106
**** v1    0.2 CLI RX|Message from VCC-compiler:
**** v1    0.2 CLI RX|Security: Privilege proc_setid missing, will not change uid/gid
**** v1    0.2 CLI RX|Could not load VMOD std
**** v1    0.2 CLI RX|\tFile name: /tmp/vtest.64_sun12.4/varnish-cache/varnish-trunk/_build/lib/libvmod_std/.libs/libvmod_std.so
**** v1    0.2 CLI RX|\tdlerror: ld.so.1: varnishd: fatal: relocation error: file /tmp/vtest.64_sun12.4/varnish-cache/varnish-trunk/_build/lib/libvmod_std/.libs/libvmod_std.so: symbol vmod_issyntax: referenced symbol not found
**** v1    0.2 CLI RX|('<vcl.inline>' Line 9 Pos 16)
**** v1    0.2 CLI RX|        import std;
**** v1    0.2 CLI RX|---------------###-
**** v1    0.2 CLI RX|
**** v1    0.2 CLI RX|Running VCC-compiler failed, exited with 2
**** v1    0.2 CLI RX|VCL compilation failed
---- v1    0.2 FAIL VCL does not compile
*    top   0.2 RESETTING after ../../../bin/varnishtest/tests/r02451.vtc
**   s1    0.2 Waiting for server (3/-1)
**   s2    0.2 Waiting for server (4/-1)
**   s3    0.2 Waiting for server (6/-1)
**   v1    0.2 Wait
**** v1    0.2 CLI TX|panic.clear
***  v1    0.2 CLI RX  300
**** v1    0.2 CLI RX|No panic to clear
***  v1    0.2 debug|Info: manager stopping child
***  v1    0.2 debug|Info: manager dies
**** v1    0.2 STDOUT poll 0x10
**   v1    0.2 R 78145 Status: 0000 (u 0.010000 s 0.029000)
***  v1    0.2 vsl|No VSL chunk found (child not started ?)
*    top   0.2 TEST ../../../bin/varnishtest/tests/r02451.vtc FAILED
#    top  TEST ../../../bin/varnishtest/tests/r02451.vtc FAILED (0.250) exit=2