t02001

00f70d0

1 @ SunOS 5.11 i86pc 1.04 32_gcc4.7 uplex

*    top   0.0 TEST ../../../bin/varnishtest/tests/t02001.vtc starting
[...]
*    top   0.0 TEST H1->H2 Upgrade
[...]
**** v1    0.8 vsl|       1010 Timestamp       c Start: 1503779630.153140 0.000000 0.000000
**** v1    0.8 vsl|       1010 Timestamp       c Req: 1503779630.153140 0.000000 0.000000
**** v1    0.8 vsl|       1010 Debug           c H2 Optimistic Upgrade
**** v1    0.8 vsl|       1010 Debug           c H2CS #######
**** v1    0.8 vsl|       1009 Debug           c H2: Bad HTTP-Settings
**** v1    0.8 vsl|       1010 ReqAcct         c 81 0 81 0 0 0
**** v1    0.8 vsl|       1010 End             c
**** v1    0.8 vsl|       1009 ReqAcct         c 0 0 0 0 0 0
**** v1    0.8 vsl|       1009 End             c
**** v1    0.8 vsl|       1009 SessClose       c RX_JUNK 0.000
**** v1    0.8 vsl|       1009 End             c
**   top   0.8 === varnish v1 -expect MEMPOOL.req0.live == 0
**   v1    0.8 as expected: MEMPOOL.req0.live (0) == 0
**   top   0.8 === varnish v1 -expect MEMPOOL.req1.live == 0
**   v1    0.8 as expected: MEMPOOL.req1.live (0) == 0
**   top   0.8 === varnish v1 -expect MEMPOOL.sess0.live == 0
**   v1    0.8 as expected: MEMPOOL.sess0.live (0) == 0
**   top   0.8 === varnish v1 -expect MEMPOOL.sess1.live == 0
**   v1    0.8 as expected: MEMPOOL.sess1.live (0) == 0
**   top   0.8 === client c1 {
**   c1    0.8 Starting client
**   c1    0.8 Waiting for client
***  c1    0.8 Connect to 127.0.0.1 42969
---- c1    0.8 Failed to open 127.0.0.1 42969: (null)
*    top   0.8 RESETTING after ../../../bin/varnishtest/tests/t02001.vtc
**   s1    0.8 Waiting for server (3/-1)
**** s1    0.8 macro undef s1_addr
**** s1    0.8 macro undef s1_port
**** s1    0.8 macro undef s1_sock
**   v1    0.8 Wait
***  v1    0.8 debug|Debug: Stopping Child
**** v1    0.9 vsl|          0 CLI             - EOF on CLI connection, worker stops
***  v1    1.8 debug|Info: Child (94423) ended
***  v1    1.8 debug|Info: Child (94423) said Child dies
***  v1    1.8 debug|Debug:
***  v1    1.8 debug| Child cleanup complete
**** v1    1.8 STDOUT poll 0x10
**   v1    1.8 R 94337 Status: 0000 (u 0.073000 s 0.085000)
*    top   1.9 TEST ../../../bin/varnishtest/tests/t02001.vtc FAILED
#    top  TEST ../../../bin/varnishtest/tests/t02001.vtc FAILED (1.936) exit=2

1 @ SunOS 5.11 i86pc 1.04 64_gcc4.7 uplex

*    top   0.0 TEST ../../../bin/varnishtest/tests/t02001.vtc starting
[...]
*    top   0.0 TEST H1->H2 Upgrade
[...]
**** v1    1.1 vsl|       1010 Timestamp       c Start: 1503681542.092892 0.000000 0.000000
**** v1    1.1 vsl|       1010 Timestamp       c Req: 1503681542.092927 0.000035 0.000035
**** v1    1.1 vsl|       1010 Debug           c H2 Optimistic Upgrade
**** v1    1.1 vsl|       1010 Debug           c H2CS #######
**** v1    1.1 vsl|       1009 Debug           c H2: Bad HTTP-Settings
**** v1    1.1 vsl|       1010 ReqAcct         c 81 0 81 0 0 0
**** v1    1.1 vsl|       1010 End             c
**** v1    1.1 vsl|       1009 ReqAcct         c 0 0 0 0 0 0
**** v1    1.1 vsl|       1009 End             c
**** v1    1.1 vsl|       1009 SessClose       c RX_JUNK 0.000
**** v1    1.1 vsl|       1009 End             c
**   top   1.1 === varnish v1 -expect MEMPOOL.req0.live == 0
**   v1    1.1 as expected: MEMPOOL.req0.live (0) == 0
**   top   1.1 === varnish v1 -expect MEMPOOL.req1.live == 0
**   v1    1.1 as expected: MEMPOOL.req1.live (0) == 0
**   top   1.1 === varnish v1 -expect MEMPOOL.sess0.live == 0
**   v1    1.1 as expected: MEMPOOL.sess0.live (0) == 0
**   top   1.1 === varnish v1 -expect MEMPOOL.sess1.live == 0
**   v1    1.1 as expected: MEMPOOL.sess1.live (0) == 0
**   top   1.1 === client c1 {
**   c1    1.1 Starting client
**   c1    1.1 Waiting for client
***  c1    1.1 Connect to 127.0.0.1 43297
---- c1    1.1 Failed to open 127.0.0.1 43297: (null)
*    top   1.1 RESETTING after ../../../bin/varnishtest/tests/t02001.vtc
**   s1    1.1 Waiting for server (3/-1)
**** s1    1.1 macro undef s1_addr
**** s1    1.1 macro undef s1_port
**** s1    1.1 macro undef s1_sock
**   v1    1.1 Wait
***  v1    1.1 debug|Debug: Stopping Child
**** v1    1.2 vsl|          0 CLI             - EOF on CLI connection, worker stops
***  v1    2.1 debug|Info: Child (1143) ended
***  v1    2.1 debug|Info: Child (1143) said Child dies
***  v1    2.1 debug|Debug:
***  v1    2.1 debug| Child cleanup complete
**** v1    2.1 STDOUT poll 0x10
**   v1    2.1 R 947 Status: 0000 (u 0.225000 s 0.136000)
*    top   2.2 TEST ../../../bin/varnishtest/tests/t02001.vtc FAILED
#    top  TEST ../../../bin/varnishtest/tests/t02001.vtc FAILED (2.163) exit=2