t02003

d87b58e

Failed to open 127.0.0.1 35900: (null)

1 @ SunOS 5.11 i86pc 1.04 64_sun12.4 uplex

*    top   0.0 TEST ../../../bin/varnishtest/tests/t02003.vtc starting
[...]
*    top   0.0 TEST H2 Frame coverage/error conditions
[...]
**   c1    1.3 Starting stream 67c090
**   c1    1.3 Waiting for stream 0
**   c1    1.3 === sendhex "000004 03 00 00000007 00000008"
**** c1    1.3 sendhex|  00 00 04 03 00 00 00 00 07 00 00 00 08
**** c1    1.3 sendhex|\0\0\4\3\0\0\0\0\7\0\0\0\10
**   c1    1.3 === rxgoaway
***  c1    1.3 rx: stream: 0, type: GOAWAY (7), flags: 0x00, size: 8
***  c1    1.3 goaway->laststream: 0
***  c1    1.3 goaway->err: PROTOCOL_ERROR (1)
**   c1    1.3 === expect goaway.err == PROTOCOL_ERROR
**** c1    1.3 EXPECT goaway.err (1) == "1" match
**   c1    1.3 === expect goaway.laststream == 0
**** c1    1.3 EXPECT goaway.laststream (0) == "0" match
**   c1    1.3 Ending stream 0
***  c1    1.3 closing fd 4
**   c1    1.3 Ending
**   top   1.3 === client c1 {
**   c1    1.3 Starting client
**   c1    1.3 Waiting for client
***  c1    1.3 Connect to 127.0.0.1 35900
---- c1    1.3 Failed to open 127.0.0.1 35900: (null)
*    top   1.3 RESETTING after ../../../bin/varnishtest/tests/t02003.vtc
**   s1    1.3 Waiting for server (3/-1)
**** s1    1.3 macro undef s1_addr
**** s1    1.3 macro undef s1_port
**** s1    1.3 macro undef s1_sock
**   v1    1.3 Wait
***  v1    1.3 debug|Debug: Stopping Child
**** v1    1.3 vsl|       1010 ReqAcct         c 36 13 49 27 20 47
**** v1    1.3 vsl|       1010 End             c
**** v1    1.3 vsl|       1010 SessClose       c RX_JUNK 0.111
**** v1    1.3 vsl|       1010 End             c
**** v1    1.3 vsl|       1011 Begin           c sess 0 HTTP/1
**** v1    1.3 vsl|       1011 SessOpen        c 127.0.0.1 61266 127.0.0.1:35900 127.0.0.1 35900 1496047753.465408 17
**** v1    1.3 vsl|          0 Debug           - H2 Prior Knowledge Upgrade
**** v1    1.3 vsl|       1011 Debug           c H2: Got pu PRISM
**** v1    1.3 vsl|       1011 H2TxHdr         c 00000c040000000000
**** v1    1.3 vsl|       1011 H2TxBody        c 00030000006400040000ffff
**** v1    1.3 vsl|       1011 H2RxHdr         c 000000040000000000
**** v1    1.3 vsl|       1011 Debug           c H2RXF SETTINGS[0] 0x00 0x00000000

could not get frame header

1 @ SunOS 5.11 i86pc 1.04 32_sun12.4 uplex

*    top   0.0 TEST ../../../bin/varnishtest/tests/t02003.vtc starting
[...]
*    top   0.0 TEST H2 Frame coverage/error conditions
[...]
**** v1    3.2 vsl|          0 CLI             - Wr 200 19 PONG 1495985193 1.0
**** v1    6.2 vsl|          0 CLI             - Rd ping
**** v1    6.2 vsl|          0 CLI             - Wr 200 19 PONG 1495985196 1.0
**** v1    9.2 vsl|          0 CLI             - Rd ping
**** v1    9.2 vsl|          0 CLI             - Wr 200 19 PONG 1495985199 1.0
**** v1   12.2 vsl|          0 CLI             - Rd ping
**** v1   12.2 vsl|          0 CLI             - Wr 200 19 PONG 1495985202 1.0
**** v1   15.2 vsl|          0 CLI             - Rd ping
**** v1   15.2 vsl|          0 CLI             - Wr 200 19 PONG 1495985205 1.0
**** v1   18.2 vsl|          0 CLI             - Rd ping
**** v1   18.2 vsl|          0 CLI             - Wr 200 19 PONG 1495985208 1.0
**** v1   21.2 vsl|          0 CLI             - Rd ping
**** v1   21.2 vsl|          0 CLI             - Wr 200 19 PONG 1495985211 1.0
**** v1   24.2 vsl|          0 CLI             - Rd ping
**** v1   24.2 vsl|          0 CLI             - Wr 200 19 PONG 1495985214 1.0
**** v1   27.2 vsl|          0 CLI             - Rd ping
**** v1   27.2 vsl|          0 CLI             - Wr 200 19 PONG 1495985217 1.0
**** v1   30.2 vsl|          0 CLI             - Rd ping
**** v1   30.2 vsl|          0 CLI             - Wr 200 19 PONG 1495985220 1.0
***  c1   32.2 HTTP2 rx timeout (fd:4 30000 ms)
---- c1   32.2 could not get frame header
**   c1   32.2 Ending stream 3
***  c1   32.2 closing fd 4
**   c1   32.2 Ending
*    top  32.2 RESETTING after ../../../bin/varnishtest/tests/t02003.vtc
**   s1   32.2 Waiting for server (3/-1)
**** s1   32.2 macro undef s1_addr
**** s1   32.2 macro undef s1_port
**** s1   32.2 macro undef s1_sock
**   v1   32.2 Wait
***  v1   32.2 debug|Debug: Stopping Child
**** v1   32.2 vsl|          0 CLI             - EOF on CLI connection, worker stops
***  v1   33.2 debug|Info: Child (58229) ended
***  v1   33.2 debug|Info: Child (58229) said Child dies
***  v1   33.2 debug|Debug:
***  v1   33.2 debug|Child cleanup complete
**** v1   33.2 STDOUT poll 0x10
**   v1   33.2 R 58200 Status: 0000 (u 0.069000 s 0.097000)
*    top  33.2 TEST ../../../bin/varnishtest/tests/t02003.vtc FAILED
#    top  TEST ../../../bin/varnishtest/tests/t02003.vtc FAILED (33.228) exit=2

b82c6d2

1 @ SunOS 5.11 i86pc 1.04 64_gcc4.7 uplex

*    top   0.0 TEST ../../../bin/varnishtest/tests/t02003.vtc starting
[...]
*    top   0.0 TEST H2 Frame coverage/error conditions
[...]
**** v1    3.4 vsl|          0 CLI             - Rd ping
**** v1    3.4 vsl|          0 CLI             - Wr 200 19 PONG 1495958958 1.0
**** v1    6.4 vsl|          0 CLI             - Rd ping
**** v1    6.4 vsl|          0 CLI             - Wr 200 19 PONG 1495958961 1.0
**** v1    9.4 vsl|          0 CLI             - Rd ping
**** v1    9.4 vsl|          0 CLI             - Wr 200 19 PONG 1495958964 1.0
**** v1   12.4 vsl|          0 CLI             - Rd ping
**** v1   12.4 vsl|          0 CLI             - Wr 200 19 PONG 1495958967 1.0
**** v1   15.4 vsl|          0 CLI             - Rd ping
**** v1   15.4 vsl|          0 CLI             - Wr 200 19 PONG 1495958970 1.0
**** v1   18.4 vsl|          0 CLI             - Rd ping
**** v1   18.4 vsl|          0 CLI             - Wr 200 19 PONG 1495958973 1.0
**** v1   21.4 vsl|          0 CLI             - Rd ping
**** v1   21.4 vsl|          0 CLI             - Wr 200 19 PONG 1495958976 1.0
**** v1   24.4 vsl|          0 CLI             - Rd ping
**** v1   24.4 vsl|          0 CLI             - Wr 200 19 PONG 1495958979 1.0
**** v1   27.4 vsl|          0 CLI             - Rd ping
**** v1   27.4 vsl|          0 CLI             - Wr 200 19 PONG 1495958982 1.0
**** v1   30.4 vsl|          0 CLI             - Rd ping
**** v1   30.4 vsl|          0 CLI             - Wr 200 19 PONG 1495958985 1.0
***  c1   32.3 HTTP2 rx timeout (fd:4 30000 ms)
---- c1   32.3 could not get frame header
**   c1   32.3 Ending stream 3
***  c1   32.3 closing fd 4
**   c1   32.3 Ending
*    top  32.3 RESETTING after ../../../bin/varnishtest/tests/t02003.vtc
**   s1   32.3 Waiting for server (3/-1)
**** s1   32.3 macro undef s1_addr
**** s1   32.3 macro undef s1_port
**** s1   32.3 macro undef s1_sock
**   v1   32.3 Wait
***  v1   32.3 debug|Debug: Stopping Child
**** v1   32.3 vsl|          0 CLI             - EOF on CLI connection, worker stops
***  v1   33.3 debug|Info: Child (42608) ended
***  v1   33.3 debug|Info: Child (42608) said Child dies
***  v1   33.3 debug|Debug: Child cleanup complete
**** v1   33.3 STDOUT poll 0x10
**   v1   33.3 R 42551 Status: 0000 (u 0.151000 s 0.104000)
*    top  33.3 TEST ../../../bin/varnishtest/tests/t02003.vtc FAILED
#    top  TEST ../../../bin/varnishtest/tests/t02003.vtc FAILED (33.332) exit=2

8763a45

1 @ SunOS 5.11 i86pc 1.04 32_sun12.4 uplex

*    top   0.0 TEST ../../../bin/varnishtest/tests/t02003.vtc starting
[...]
*    top   0.0 TEST H2 Frame coverage/error conditions
[...]
**** v1    3.2 vsl|          0 CLI             - Rd ping
**** v1    3.2 vsl|          0 CLI             - Wr 200 19 PONG 1495930173 1.0
**** v1    6.2 vsl|          0 CLI             - Rd ping
**** v1    6.2 vsl|          0 CLI             - Wr 200 19 PONG 1495930176 1.0
**** v1    9.2 vsl|          0 CLI             - Rd ping
**** v1    9.2 vsl|          0 CLI             - Wr 200 19 PONG 1495930179 1.0
**** v1   12.2 vsl|          0 CLI             - Rd ping
**** v1   12.2 vsl|          0 CLI             - Wr 200 19 PONG 1495930182 1.0
**** v1   15.2 vsl|          0 CLI             - Rd ping
**** v1   15.2 vsl|          0 CLI             - Wr 200 19 PONG 1495930185 1.0
**** v1   18.2 vsl|          0 CLI             - Rd ping
**** v1   18.2 vsl|          0 CLI             - Wr 200 19 PONG 1495930188 1.0
**** v1   21.2 vsl|          0 CLI             - Rd ping
**** v1   21.2 vsl|          0 CLI             - Wr 200 19 PONG 1495930191 1.0
**** v1   24.2 vsl|          0 CLI             - Rd ping
**** v1   24.2 vsl|          0 CLI             - Wr 200 19 PONG 1495930194 1.0
**** v1   27.2 vsl|          0 CLI             - Rd ping
**** v1   27.2 vsl|          0 CLI             - Wr 200 19 PONG 1495930197 1.0
**** v1   30.2 vsl|          0 CLI             - Rd ping
**** v1   30.2 vsl|          0 CLI             - Wr 200 19 PONG 1495930200 1.0
***  c1   32.2 HTTP2 rx timeout (fd:4 30000 ms)
---- c1   32.2 could not get frame header
**   c1   32.2 Ending stream 3
***  c1   32.2 closing fd 4
**   c1   32.2 Ending
*    top  32.2 RESETTING after ../../../bin/varnishtest/tests/t02003.vtc
**   s1   32.2 Waiting for server (3/-1)
**** s1   32.2 macro undef s1_addr
**** s1   32.2 macro undef s1_port
**** s1   32.2 macro undef s1_sock
**   v1   32.2 Wait
***  v1   32.2 debug|Debug: Stopping Child
**** v1   32.2 vsl|          0 CLI             - EOF on CLI connection, worker stops
***  v1   33.2 debug|Info: Child (78226) ended
***  v1   33.2 debug|Info: Child (78226) said Child dies
***  v1   33.2 debug|Debug: Child cleanup complete
**** v1   33.2 STDOUT poll 0x10
**   v1   33.2 R 78181 Status: 0000 (u 0.069000 s 0.095000)
*    top  33.2 TEST ../../../bin/varnishtest/tests/t02003.vtc FAILED
#    top  TEST ../../../bin/varnishtest/tests/t02003.vtc FAILED (33.227) exit=2

1 @ SunOS 5.11 i86pc 1.04 32_sun12.4 uplex

*    top   0.0 TEST ../../../bin/varnishtest/tests/t02003.vtc starting
[...]
*    top   0.0 TEST H2 Frame coverage/error conditions
[...]
**** v1    3.3 vsl|          0 CLI             - Rd ping
**** v1    3.3 vsl|          0 CLI             - Wr 200 19 PONG 1495947571 1.0
**** v1    6.3 vsl|          0 CLI             - Rd ping
**** v1    6.3 vsl|          0 CLI             - Wr 200 19 PONG 1495947574 1.0
**** v1    9.3 vsl|          0 CLI             - Rd ping
**** v1    9.3 vsl|          0 CLI             - Wr 200 19 PONG 1495947577 1.0
**** v1   12.3 vsl|          0 CLI             - Rd ping
**** v1   12.3 vsl|          0 CLI             - Wr 200 19 PONG 1495947580 1.0
**** v1   15.3 vsl|          0 CLI             - Rd ping
**** v1   15.3 vsl|          0 CLI             - Wr 200 19 PONG 1495947583 1.0
**** v1   18.3 vsl|          0 CLI             - Rd ping
**** v1   18.3 vsl|          0 CLI             - Wr 200 19 PONG 1495947586 1.0
**** v1   21.3 vsl|          0 CLI             - Rd ping
**** v1   21.3 vsl|          0 CLI             - Wr 200 19 PONG 1495947589 1.0
**** v1   24.3 vsl|          0 CLI             - Rd ping
**** v1   24.3 vsl|          0 CLI             - Wr 200 19 PONG 1495947592 1.0
**** v1   27.3 vsl|          0 CLI             - Rd ping
**** v1   27.3 vsl|          0 CLI             - Wr 200 19 PONG 1495947595 1.0
**** v1   30.3 vsl|          0 CLI             - Rd ping
**** v1   30.3 vsl|          0 CLI             - Wr 200 19 PONG 1495947598 1.0
***  c1   32.3 HTTP2 rx timeout (fd:4 30000 ms)
---- c1   32.3 could not get frame header
**   c1   32.3 Ending stream 3
***  c1   32.3 closing fd 4
**   c1   32.3 Ending
*    top  32.3 RESETTING after ../../../bin/varnishtest/tests/t02003.vtc
**   s1   32.3 Waiting for server (3/-1)
**** s1   32.3 macro undef s1_addr
**** s1   32.3 macro undef s1_port
**** s1   32.3 macro undef s1_sock
**   v1   32.3 Wait
***  v1   32.3 debug|Debug: Stopping Child
**** v1   32.3 vsl|          0 CLI             - EOF on CLI connection, worker stops
***  v1   33.3 debug|Info: Child (15026) ended
***  v1   33.3 debug|Info: Child (15026) said Child dies
***  v1   33.3 debug|Debug: Child cleanup complete
**** v1   33.3 STDOUT poll 0x10
**   v1   33.3 R 14986 Status: 0000 (u 0.101000 s 0.148000)
*    top  33.3 TEST ../../../bin/varnishtest/tests/t02003.vtc FAILED
#    top  TEST ../../../bin/varnishtest/tests/t02003.vtc FAILED (33.345) exit=2

1 @ SunOS 5.11 i86pc 1.04 32_sun12.4 uplex

*    top   0.0 TEST ../../../bin/varnishtest/tests/t02003.vtc starting
[...]
*    top   0.0 TEST H2 Frame coverage/error conditions
[...]
**** v1    3.2 vsl|          0 CLI             - Rd ping
**** v1    3.2 vsl|          0 CLI             - Wr 200 19 PONG 1495952790 1.0
**** v1    6.2 vsl|          0 CLI             - Rd ping
**** v1    6.2 vsl|          0 CLI             - Wr 200 19 PONG 1495952793 1.0
**** v1    9.2 vsl|          0 CLI             - Rd ping
**** v1    9.2 vsl|          0 CLI             - Wr 200 19 PONG 1495952796 1.0
**** v1   12.2 vsl|          0 CLI             - Rd ping
**** v1   12.2 vsl|          0 CLI             - Wr 200 19 PONG 1495952799 1.0
**** v1   15.2 vsl|          0 CLI             - Rd ping
**** v1   15.2 vsl|          0 CLI             - Wr 200 19 PONG 1495952802 1.0
**** v1   18.2 vsl|          0 CLI             - Rd ping
**** v1   18.2 vsl|          0 CLI             - Wr 200 19 PONG 1495952805 1.0
**** v1   21.2 vsl|          0 CLI             - Rd ping
**** v1   21.2 vsl|          0 CLI             - Wr 200 19 PONG 1495952808 1.0
**** v1   24.2 vsl|          0 CLI             - Rd ping
**** v1   24.2 vsl|          0 CLI             - Wr 200 19 PONG 1495952811 1.0
**** v1   27.2 vsl|          0 CLI             - Rd ping
**** v1   27.2 vsl|          0 CLI             - Wr 200 19 PONG 1495952814 1.0
**** v1   30.2 vsl|          0 CLI             - Rd ping
**** v1   30.2 vsl|          0 CLI             - Wr 200 19 PONG 1495952817 1.0
***  c1   32.2 HTTP2 rx timeout (fd:4 30000 ms)
---- c1   32.2 could not get frame header
**   c1   32.2 Ending stream 3
***  c1   32.2 closing fd 4
**   c1   32.2 Ending
*    top  32.2 RESETTING after ../../../bin/varnishtest/tests/t02003.vtc
**   s1   32.2 Waiting for server (3/-1)
**** s1   32.2 macro undef s1_addr
**** s1   32.2 macro undef s1_port
**** s1   32.2 macro undef s1_sock
**   v1   32.2 Wait
***  v1   32.2 debug|Debug: Stopping Child
**** v1   32.2 vsl|          0 CLI             - EOF on CLI connection, worker stops
***  v1   33.2 debug|Info: Child (71764) ended
***  v1   33.2 debug|Info: Child (71764) said Child dies
***  v1   33.2 debug|Debug: Child cleanup complete
**** v1   33.2 STDOUT poll 0x10
**   v1   33.2 R 71712 Status: 0000 (u 0.071000 s 0.103000)
*    top  33.2 TEST ../../../bin/varnishtest/tests/t02003.vtc FAILED
#    top  TEST ../../../bin/varnishtest/tests/t02003.vtc FAILED (33.227) exit=2