v00016

8bbbdfa

1 @ SunOS 5.11 i86pc 1.04 32_sun12.4 uplex

*    top   0.0 TEST ../../../bin/varnishtest/tests/v00016.vtc starting
[...]
*    top   0.0 TEST Various VCL compiler coverage tests
[...]
**** v1    0.3 CLI TX|\tbackend b { .host = "127.0.0.1"; }
**** v1    0.3 CLI TX|\tsub vcl_recv {
**** v1    0.3 CLI TX|\t\tif (remote.ip == "varnish-cache.org") {}
**** v1    0.3 CLI TX|\t}
**** v1    0.3 CLI TX|
**** v1    0.3 CLI TX|%XJEIFLH|)Xspa8P
***  v1    0.3 CLI RX  106
**** v1    0.3 CLI RX|Message from VCC-compiler:
**** v1    0.3 CLI RX|Security: Privilege proc_setid missing, will not change uid/gid
**** v1    0.3 CLI RX|IP constant "varnish-cache.org": resolves to too many addresses.
**** v1    0.3 CLI RX|Only one IPv4 or IPv6 are allowed.
**** v1    0.3 CLI RX|Please specify which exact address you want to use, we found all of these:
**** v1    0.3 CLI RX|\t2a00:dd80:3e::255:80
**** v1    0.3 CLI RX|\t176.58.90.154:80
**** v1    0.3 CLI RX|('<vcl.inline>' Line 5 Pos 34)
**** v1    0.3 CLI RX|                if (remote.ip == "varnish-cache.org") {}
**** v1    0.3 CLI RX|---------------------------------###################----
**** v1    0.3 CLI RX|
**** v1    0.3 CLI RX|Running VCC-compiler failed, exited with 2
**** v1    0.3 CLI RX|VCL compilation failed
**   v1    0.3 VCL compilation failed (as expected)
***  v1    0.3 Found expected string: ("resolves to too many addresses")
*    top   0.3 RESETTING after ../../../bin/varnishtest/tests/v00016.vtc
**   v1    0.3 Wait
**** v1    0.3 CLI TX|backend.list
***  v1    0.3 CLI RX  101
**** v1    0.3 CLI RX|Unknown request in manager process (child not running).
**** v1    0.3 CLI RX|Type 'help' for more info.
**   v1    0.3 Stop
**** v1    0.3 CLI TX|stop
***  v1    0.3 CLI RX  300
**** v1    0.3 CLI RX|Child in state stopped
**** v1    0.3 CLI TX|status
***  v1    0.3 CLI RX  200
**** v1    0.3 CLI RX|Child in state stopped
**** v1    0.3 STDOUT poll 0x10
**   v1    0.3 R 60858 Status: 0000 (u 0.059000 s 0.092000)
*    diag  0.0 ............................................................
#    top  TEST ../../../bin/varnishtest/tests/v00016.vtc TIMED OUT (kill -9)
#    top  TEST ../../../bin/varnishtest/tests/v00016.vtc FAILED (60.002) signal=9

1 @ SunOS 5.11 i86pc 1.04 32_sun12.4 uplex

*    top   0.0 TEST ../../../bin/varnishtest/tests/v00016.vtc starting
[...]
*    top   0.0 TEST Various VCL compiler coverage tests
[...]
**** v1    0.3 CLI TX|\tbackend b { .host = "127.0.0.1"; }
**** v1    0.3 CLI TX|\tsub vcl_recv {
**** v1    0.3 CLI TX|\t\tif (remote.ip == "varnish-cache.org") {}
**** v1    0.3 CLI TX|\t}
**** v1    0.3 CLI TX|
**** v1    0.3 CLI TX|%XJEIFLH|)Xspa8P
***  v1    0.3 CLI RX  106
**** v1    0.3 CLI RX|Message from VCC-compiler:
**** v1    0.3 CLI RX|Security: Privilege proc_setid missing, will not change uid/gid
**** v1    0.3 CLI RX|IP constant "varnish-cache.org": resolves to too many addresses.
**** v1    0.3 CLI RX|Only one IPv4 or IPv6 are allowed.
**** v1    0.3 CLI RX|Please specify which exact address you want to use, we found all of these:
**** v1    0.3 CLI RX|\t2a00:dd80:3e::255:80
**** v1    0.3 CLI RX|\t176.58.90.154:80
**** v1    0.3 CLI RX|('<vcl.inline>' Line 5 Pos 34)
**** v1    0.3 CLI RX|                if (remote.ip == "varnish-cache.org") {}
**** v1    0.3 CLI RX|---------------------------------###################----
**** v1    0.3 CLI RX|
**** v1    0.3 CLI RX|Running VCC-compiler failed, exited with 2
**** v1    0.3 CLI RX|VCL compilation failed
**   v1    0.3 VCL compilation failed (as expected)
***  v1    0.3 Found expected string: ("resolves to too many addresses")
*    top   0.3 RESETTING after ../../../bin/varnishtest/tests/v00016.vtc
**   v1    0.3 Wait
**** v1    0.3 CLI TX|backend.list
***  v1    0.3 CLI RX  101
**** v1    0.3 CLI RX|Unknown request in manager process (child not running).
**** v1    0.3 CLI RX|Type 'help' for more info.
**   v1    0.3 Stop
**** v1    0.3 CLI TX|stop
***  v1    0.3 CLI RX  300
**** v1    0.3 CLI RX|Child in state stopped
**** v1    0.3 CLI TX|status
***  v1    0.3 CLI RX  200
**** v1    0.3 CLI RX|Child in state stopped
**** v1    0.3 STDOUT poll 0x10
**   v1    0.3 R 17898 Status: 0000 (u 0.060000 s 0.092000)
*    diag  0.0 ............................................................
#    top  TEST ../../../bin/varnishtest/tests/v00016.vtc TIMED OUT (kill -9)
#    top  TEST ../../../bin/varnishtest/tests/v00016.vtc FAILED (60.002) signal=9

1 @ SunOS 5.11 i86pc 1.04 32_sun12.4 uplex

*    top   0.0 TEST ../../../bin/varnishtest/tests/v00016.vtc starting
[...]
*    top   0.0 TEST Various VCL compiler coverage tests
[...]
**** v1    0.3 CLI TX|\tbackend b { .host = "127.0.0.1"; }
**** v1    0.3 CLI TX|\tsub vcl_recv {
**** v1    0.3 CLI TX|\t\tif (remote.ip == "varnish-cache.org") {}
**** v1    0.3 CLI TX|\t}
**** v1    0.3 CLI TX|
**** v1    0.3 CLI TX|%XJEIFLH|)Xspa8P
***  v1    0.3 CLI RX  106
**** v1    0.3 CLI RX|Message from VCC-compiler:
**** v1    0.3 CLI RX|Security: Privilege proc_setid missing, will not change uid/gid
**** v1    0.3 CLI RX|IP constant "varnish-cache.org": resolves to too many addresses.
**** v1    0.3 CLI RX|Only one IPv4 or IPv6 are allowed.
**** v1    0.3 CLI RX|Please specify which exact address you want to use, we found all of these:
**** v1    0.3 CLI RX|\t2a00:dd80:3e::255:80
**** v1    0.3 CLI RX|\t176.58.90.154:80
**** v1    0.3 CLI RX|('<vcl.inline>' Line 5 Pos 34)
**** v1    0.3 CLI RX|                if (remote.ip == "varnish-cache.org") {}
**** v1    0.3 CLI RX|---------------------------------###################----
**** v1    0.3 CLI RX|
**** v1    0.3 CLI RX|Running VCC-compiler failed, exited with 2
**** v1    0.3 CLI RX|VCL compilation failed
**   v1    0.3 VCL compilation failed (as expected)
***  v1    0.3 Found expected string: ("resolves to too many addresses")
*    top   0.3 RESETTING after ../../../bin/varnishtest/tests/v00016.vtc
**   v1    0.3 Wait
**** v1    0.3 CLI TX|backend.list
***  v1    0.3 CLI RX  101
**** v1    0.3 CLI RX|Unknown request in manager process (child not running).
**** v1    0.3 CLI RX|Type 'help' for more info.
**   v1    0.3 Stop
**** v1    0.3 CLI TX|stop
***  v1    0.3 CLI RX  300
**** v1    0.3 CLI RX|Child in state stopped
**** v1    0.3 CLI TX|status
***  v1    0.3 CLI RX  200
**** v1    0.3 CLI RX|Child in state stopped
**** v1    0.3 STDOUT poll 0x10
**   v1    0.3 R 6637 Status: 0000 (u 0.058000 s 0.088000)
*    diag  0.0 ............................................................
#    top  TEST ../../../bin/varnishtest/tests/v00016.vtc TIMED OUT (kill -9)
#    top  TEST ../../../bin/varnishtest/tests/v00016.vtc FAILED (60.002) signal=9

1 @ SunOS 5.11 i86pc 1.04 32_sun12.4 uplex

*    top   0.0 TEST ../../../bin/varnishtest/tests/v00016.vtc starting
[...]
*    top   0.0 TEST Various VCL compiler coverage tests
[...]
**** v1    0.3 CLI TX|\tbackend b { .host = "127.0.0.1"; }
**** v1    0.3 CLI TX|\tsub vcl_recv {
**** v1    0.3 CLI TX|\t\tif (remote.ip == "varnish-cache.org") {}
**** v1    0.3 CLI TX|\t}
**** v1    0.3 CLI TX|
**** v1    0.3 CLI TX|%XJEIFLH|)Xspa8P
***  v1    0.3 CLI RX  106
**** v1    0.3 CLI RX|Message from VCC-compiler:
**** v1    0.3 CLI RX|Security: Privilege proc_setid missing, will not change uid/gid
**** v1    0.3 CLI RX|IP constant "varnish-cache.org": resolves to too many addresses.
**** v1    0.3 CLI RX|Only one IPv4 or IPv6 are allowed.
**** v1    0.3 CLI RX|Please specify which exact address you want to use, we found all of these:
**** v1    0.3 CLI RX|\t2a00:dd80:3e::255:80
**** v1    0.3 CLI RX|\t176.58.90.154:80
**** v1    0.3 CLI RX|('<vcl.inline>' Line 5 Pos 34)
**** v1    0.3 CLI RX|                if (remote.ip == "varnish-cache.org") {}
**** v1    0.3 CLI RX|---------------------------------###################----
**** v1    0.3 CLI RX|
**** v1    0.3 CLI RX|Running VCC-compiler failed, exited with 2
**** v1    0.3 CLI RX|VCL compilation failed
**   v1    0.3 VCL compilation failed (as expected)
***  v1    0.3 Found expected string: ("resolves to too many addresses")
*    top   0.3 RESETTING after ../../../bin/varnishtest/tests/v00016.vtc
**   v1    0.3 Wait
**** v1    0.3 CLI TX|backend.list
***  v1    0.3 CLI RX  101
**** v1    0.3 CLI RX|Unknown request in manager process (child not running).
**** v1    0.3 CLI RX|Type 'help' for more info.
**   v1    0.3 Stop
**** v1    0.3 CLI TX|stop
***  v1    0.3 CLI RX  300
**** v1    0.3 CLI RX|Child in state stopped
**** v1    0.3 CLI TX|status
***  v1    0.3 CLI RX  200
**** v1    0.3 CLI RX|Child in state stopped
**** v1    0.3 STDOUT poll 0x10
**   v1    0.3 R 80842 Status: 0000 (u 0.059000 s 0.092000)
*    diag  0.0 ............................................................
#    top  TEST ../../../bin/varnishtest/tests/v00016.vtc TIMED OUT (kill -9)
#    top  TEST ../../../bin/varnishtest/tests/v00016.vtc FAILED (60.003) signal=9

1 @ SunOS 5.11 i86pc 1.04 32_sun12.4 uplex

*    top   0.0 TEST ../../../bin/varnishtest/tests/v00016.vtc starting
[...]
*    top   0.0 TEST Various VCL compiler coverage tests
[...]
**** v1    0.3 CLI TX|\tbackend b { .host = "127.0.0.1"; }
**** v1    0.3 CLI TX|\tsub vcl_recv {
**** v1    0.3 CLI TX|\t\tif (remote.ip == "varnish-cache.org") {}
**** v1    0.3 CLI TX|\t}
**** v1    0.3 CLI TX|
**** v1    0.3 CLI TX|%XJEIFLH|)Xspa8P
***  v1    0.3 CLI RX  106
**** v1    0.3 CLI RX|Message from VCC-compiler:
**** v1    0.3 CLI RX|Security: Privilege proc_setid missing, will not change uid/gid
**** v1    0.3 CLI RX|IP constant "varnish-cache.org": resolves to too many addresses.
**** v1    0.3 CLI RX|Only one IPv4 or IPv6 are allowed.
**** v1    0.3 CLI RX|Please specify which exact address you want to use, we found all of these:
**** v1    0.3 CLI RX|\t2a00:dd80:3e::255:80
**** v1    0.3 CLI RX|\t176.58.90.154:80
**** v1    0.3 CLI RX|('<vcl.inline>' Line 5 Pos 34)
**** v1    0.3 CLI RX|                if (remote.ip == "varnish-cache.org") {}
**** v1    0.3 CLI RX|---------------------------------###################----
**** v1    0.3 CLI RX|
**** v1    0.3 CLI RX|Running VCC-compiler failed, exited with 2
**** v1    0.3 CLI RX|VCL compilation failed
**   v1    0.3 VCL compilation failed (as expected)
***  v1    0.3 Found expected string: ("resolves to too many addresses")
*    top   0.3 RESETTING after ../../../bin/varnishtest/tests/v00016.vtc
**   v1    0.3 Wait
**** v1    0.3 CLI TX|backend.list
***  v1    0.3 CLI RX  101
**** v1    0.3 CLI RX|Unknown request in manager process (child not running).
**** v1    0.3 CLI RX|Type 'help' for more info.
**   v1    0.3 Stop
**** v1    0.3 CLI TX|stop
***  v1    0.3 CLI RX  300
**** v1    0.3 CLI RX|Child in state stopped
**** v1    0.3 CLI TX|status
***  v1    0.3 CLI RX  200
**** v1    0.3 CLI RX|Child in state stopped
**** v1    0.3 STDOUT poll 0x10
**   v1    0.3 R 21831 Status: 0000 (u 0.057000 s 0.087000)
*    diag  0.0 ............................................................
#    top  TEST ../../../bin/varnishtest/tests/v00016.vtc TIMED OUT (kill -9)
#    top  TEST ../../../bin/varnishtest/tests/v00016.vtc FAILED (60.002) signal=9

1 @ Ubuntu LTS i686 1.04 fgs

*    top   0.0 TEST ../../../bin/varnishtest/tests/v00016.vtc starting
[...]
*    top   0.0 TEST Various VCL compiler coverage tests
[...]
***  v1    3.2 vsl|No VSL chunk found (child not started ?)
***  v1    3.3 vsl|No VSL chunk found (child not started ?)
***  v1    3.4 vsl|No VSL chunk found (child not started ?)
***  v1    3.5 vsl|No VSL chunk found (child not started ?)
***  v1    3.6 vsl|No VSL chunk found (child not started ?)
***  v1    3.7 vsl|No VSL chunk found (child not started ?)
***  v1    3.8 vsl|No VSL chunk found (child not started ?)
***  v1    3.9 vsl|No VSL chunk found (child not started ?)
***  v1    4.0 vsl|No VSL chunk found (child not started ?)
***  v1    4.1 vsl|No VSL chunk found (child not started ?)
***  v1    4.2 vsl|No VSL chunk found (child not started ?)
***  v1    4.3 vsl|No VSL chunk found (child not started ?)
***  v1    4.4 vsl|No VSL chunk found (child not started ?)
***  v1    4.5 vsl|No VSL chunk found (child not started ?)
***  v1    4.6 vsl|No VSL chunk found (child not started ?)
***  v1    4.7 vsl|No VSL chunk found (child not started ?)
***  v1    4.8 vsl|No VSL chunk found (child not started ?)
***  v1    4.9 vsl|No VSL chunk found (child not started ?)
***  v1    5.0 vsl|No VSL chunk found (child not started ?)
***  v1    5.1 vsl|No VSL chunk found (child not started ?)
***  v1    5.2 vsl|No VSL chunk found (child not started ?)
***  v1    5.3 vsl|No VSL chunk found (child not started ?)
***  v1    5.4 vsl|No VSL chunk found (child not started ?)
***  v1    5.5 vsl|No VSL chunk found (child not started ?)
***  v1    5.6 vsl|No VSL chunk found (child not started ?)
***  v1    5.7 vsl|No VSL chunk found (child not started ?)
***  v1    5.8 vsl|No VSL chunk found (child not started ?)
***  v1    5.9 CLI RX  200
**** v1    5.9 CLI RX|VCL compiled.
**** v1    5.9 CLI TX|vcl.use vcl13
***  v1    5.9 CLI RX  200
**** v1    5.9 CLI RX|VCL 'vcl13' now active
---- v1    5.9 VCL compilation succeeded expected failure
*    top   5.9 RESETTING after ../../../bin/varnishtest/tests/v00016.vtc
**   v1    5.9 Wait
**** v1    5.9 STDOUT poll 0x10
**   v1    5.9 R 12580 Status: 0000 (u 0.312000 s 0.012000)
***  v1    5.9 vsl|No VSL chunk found (child not started ?)
*    top   5.9 TEST ../../../bin/varnishtest/tests/v00016.vtc FAILED
#    top  TEST ../../../bin/varnishtest/tests/v00016.vtc FAILED (5.924) exit=2

1 @ SunOS 5.11 i86pc 1.04 32_sun12.4 uplex

*    top   0.0 TEST ../../../bin/varnishtest/tests/v00016.vtc starting
[...]
*    top   0.0 TEST Various VCL compiler coverage tests
[...]
**** v1    0.2 CLI TX|\tbackend b { .host = "127.0.0.1"; }
**** v1    0.2 CLI TX|\tsub vcl_recv {
**** v1    0.2 CLI TX|\t\tif (remote.ip == "varnish-cache.org") {}
**** v1    0.2 CLI TX|\t}
**** v1    0.2 CLI TX|
**** v1    0.2 CLI TX|%XJEIFLH|)Xspa8P
***  v1    0.3 CLI RX  106
**** v1    0.3 CLI RX|Message from VCC-compiler:
**** v1    0.3 CLI RX|Security: Privilege proc_setid missing, will not change uid/gid
**** v1    0.3 CLI RX|IP constant "varnish-cache.org": resolves to too many addresses.
**** v1    0.3 CLI RX|Only one IPv4 or IPv6 are allowed.
**** v1    0.3 CLI RX|Please specify which exact address you want to use, we found all of these:
**** v1    0.3 CLI RX|\t2a00:dd80:3e::255:80
**** v1    0.3 CLI RX|\t176.58.90.154:80
**** v1    0.3 CLI RX|('<vcl.inline>' Line 5 Pos 34)
**** v1    0.3 CLI RX|                if (remote.ip == "varnish-cache.org") {}
**** v1    0.3 CLI RX|---------------------------------###################----
**** v1    0.3 CLI RX|
**** v1    0.3 CLI RX|Running VCC-compiler failed, exited with 2
**** v1    0.3 CLI RX|VCL compilation failed
**   v1    0.3 VCL compilation failed (as expected)
***  v1    0.3 Found expected string: ("resolves to too many addresses")
*    top   0.3 RESETTING after ../../../bin/varnishtest/tests/v00016.vtc
**   v1    0.3 Wait
**** v1    0.3 CLI TX|backend.list
***  v1    0.3 CLI RX  101
**** v1    0.3 CLI RX|Unknown request in manager process (child not running).
**** v1    0.3 CLI RX|Type 'help' for more info.
**   v1    0.3 Stop
**** v1    0.3 CLI TX|stop
***  v1    0.3 CLI RX  300
**** v1    0.3 CLI RX|Child in state stopped
**** v1    0.3 CLI TX|status
***  v1    0.3 CLI RX  200
**** v1    0.3 CLI RX|Child in state stopped
**** v1    0.3 STDOUT poll 0x10
**   v1    0.3 R 35037 Status: 0000 (u 0.056000 s 0.088000)
*    diag  0.0 ............................................................
#    top  TEST ../../../bin/varnishtest/tests/v00016.vtc TIMED OUT (kill -9)
#    top  TEST ../../../bin/varnishtest/tests/v00016.vtc FAILED (60.002) signal=9