v00021

8bbbdfa

1 @ SunOS 5.11 i86pc 1.04 32_sun12.4 uplex

*    top   0.0 TEST ../../../bin/varnishtest/tests/v00021.vtc starting
[...]
*    top   0.0 TEST VCL compiler coverage test: vcc_xref.c vcc_var.c vcc_symb.c
[...]
**** v1    0.2 CLI TX|vcl.use vcl12
***  v1    0.2 CLI RX  200
**   top   0.2 === varnish v1 -errvcl {Unknown variable 'req.foobar'} {
**** v1    0.2 CLI TX|vcl.inline vcl13 << %XJEIFLH|)Xspa8P
**** v1    0.2 CLI TX|vcl 4.0;
**** v1    0.2 CLI TX|
**** v1    0.2 CLI TX|\tbackend foo { .host = "127.0.0.1"; }
**** v1    0.2 CLI TX|\tsub vcl_recv { set req.foobar = 3; }
**** v1    0.2 CLI TX|
**** v1    0.2 CLI TX|%XJEIFLH|)Xspa8P
***  v1    0.2 CLI RX  106
**** v1    0.2 CLI RX|Message from VCC-compiler:
**** v1    0.2 CLI RX|Security: Privilege proc_setid missing, will not change uid/gid
**** v1    0.2 CLI RX|Unknown variable 'req.foobar'
**** v1    0.2 CLI RX|At: ('<vcl.inline>' Line 4 Pos 28)
**** v1    0.2 CLI RX|        sub vcl_recv { set req.foobar = 3; }
**** v1    0.2 CLI RX|---------------------------##########-------
**** v1    0.2 CLI RX|
**** v1    0.2 CLI RX|Running VCC-compiler failed, exited with 2
**** v1    0.2 CLI RX|VCL compilation failed
**   v1    0.2 VCL compilation failed (as expected)
***  v1    0.2 Found expected string: ("Unknown variable 'req.foobar'")
*    top   0.2 RESETTING after ../../../bin/varnishtest/tests/v00021.vtc
**   v1    0.2 Wait
**** v1    0.2 CLI TX|backend.list
***  v1    0.2 CLI RX  101
**** v1    0.2 CLI RX|Unknown request in manager process (child not running).
**** v1    0.2 CLI RX|Type 'help' for more info.
**   v1    0.2 Stop
**** v1    0.2 CLI TX|stop
***  v1    0.2 CLI RX  300
**** v1    0.2 CLI RX|Child in state stopped
**** v1    0.2 CLI TX|status
***  v1    0.2 CLI RX  200
**** v1    0.2 CLI RX|Child in state stopped
**** v1    0.2 STDOUT poll 0x10
**   v1    0.2 R 22185 Status: 0000 (u 0.068000 s 0.089000)
*    diag  0.0 ............................................................
#    top  TEST ../../../bin/varnishtest/tests/v00021.vtc TIMED OUT (kill -9)
#    top  TEST ../../../bin/varnishtest/tests/v00021.vtc FAILED (60.002) signal=9

1 @ SunOS 5.11 i86pc 1.04 32_sun12.4 uplex

*    top   0.0 TEST ../../../bin/varnishtest/tests/v00021.vtc starting
[...]
*    top   0.0 TEST VCL compiler coverage test: vcc_xref.c vcc_var.c vcc_symb.c
[...]
**** v1    0.2 CLI TX|vcl.use vcl12
***  v1    0.2 CLI RX  200
**   top   0.2 === varnish v1 -errvcl {Unknown variable 'req.foobar'} {
**** v1    0.2 CLI TX|vcl.inline vcl13 << %XJEIFLH|)Xspa8P
**** v1    0.2 CLI TX|vcl 4.0;
**** v1    0.2 CLI TX|
**** v1    0.2 CLI TX|\tbackend foo { .host = "127.0.0.1"; }
**** v1    0.2 CLI TX|\tsub vcl_recv { set req.foobar = 3; }
**** v1    0.2 CLI TX|
**** v1    0.2 CLI TX|%XJEIFLH|)Xspa8P
***  v1    0.2 CLI RX  106
**** v1    0.2 CLI RX|Message from VCC-compiler:
**** v1    0.2 CLI RX|Security: Privilege proc_setid missing, will not change uid/gid
**** v1    0.2 CLI RX|Unknown variable 'req.foobar'
**** v1    0.2 CLI RX|At: ('<vcl.inline>' Line 4 Pos 28)
**** v1    0.2 CLI RX|        sub vcl_recv { set req.foobar = 3; }
**** v1    0.2 CLI RX|---------------------------##########-------
**** v1    0.2 CLI RX|
**** v1    0.2 CLI RX|Running VCC-compiler failed, exited with 2
**** v1    0.2 CLI RX|VCL compilation failed
**   v1    0.2 VCL compilation failed (as expected)
***  v1    0.2 Found expected string: ("Unknown variable 'req.foobar'")
*    top   0.2 RESETTING after ../../../bin/varnishtest/tests/v00021.vtc
**   v1    0.2 Wait
**** v1    0.2 CLI TX|backend.list
***  v1    0.2 CLI RX  101
**** v1    0.2 CLI RX|Unknown request in manager process (child not running).
**** v1    0.2 CLI RX|Type 'help' for more info.
**   v1    0.2 Stop
**** v1    0.2 CLI TX|stop
***  v1    0.2 CLI RX  300
**** v1    0.2 CLI RX|Child in state stopped
**** v1    0.2 CLI TX|status
***  v1    0.2 CLI RX  200
**** v1    0.2 CLI RX|Child in state stopped
**** v1    0.3 STDOUT poll 0x10
**   v1    0.3 R 78728 Status: 0000 (u 0.069000 s 0.092000)
*    diag  0.0 ............................................................
#    top  TEST ../../../bin/varnishtest/tests/v00021.vtc TIMED OUT (kill -9)
#    top  TEST ../../../bin/varnishtest/tests/v00021.vtc FAILED (60.002) signal=9

1 @ SunOS 5.11 i86pc 1.04 32_sun12.4 uplex

*    top   0.0 TEST ../../../bin/varnishtest/tests/v00021.vtc starting
[...]
*    top   0.0 TEST VCL compiler coverage test: vcc_xref.c vcc_var.c vcc_symb.c
[...]
**** v1    0.2 CLI TX|vcl.use vcl12
***  v1    0.2 CLI RX  200
**   top   0.2 === varnish v1 -errvcl {Unknown variable 'req.foobar'} {
**** v1    0.2 CLI TX|vcl.inline vcl13 << %XJEIFLH|)Xspa8P
**** v1    0.2 CLI TX|vcl 4.0;
**** v1    0.2 CLI TX|
**** v1    0.2 CLI TX|\tbackend foo { .host = "127.0.0.1"; }
**** v1    0.2 CLI TX|\tsub vcl_recv { set req.foobar = 3; }
**** v1    0.2 CLI TX|
**** v1    0.2 CLI TX|%XJEIFLH|)Xspa8P
***  v1    0.3 CLI RX  106
**** v1    0.3 CLI RX|Message from VCC-compiler:
**** v1    0.3 CLI RX|Security: Privilege proc_setid missing, will not change uid/gid
**** v1    0.3 CLI RX|Unknown variable 'req.foobar'
**** v1    0.3 CLI RX|At: ('<vcl.inline>' Line 4 Pos 28)
**** v1    0.3 CLI RX|        sub vcl_recv { set req.foobar = 3; }
**** v1    0.3 CLI RX|---------------------------##########-------
**** v1    0.3 CLI RX|
**** v1    0.3 CLI RX|Running VCC-compiler failed, exited with 2
**** v1    0.3 CLI RX|VCL compilation failed
**   v1    0.3 VCL compilation failed (as expected)
***  v1    0.3 Found expected string: ("Unknown variable 'req.foobar'")
*    top   0.3 RESETTING after ../../../bin/varnishtest/tests/v00021.vtc
**   v1    0.3 Wait
**** v1    0.3 CLI TX|backend.list
***  v1    0.3 CLI RX  101
**** v1    0.3 CLI RX|Unknown request in manager process (child not running).
**** v1    0.3 CLI RX|Type 'help' for more info.
**   v1    0.3 Stop
**** v1    0.3 CLI TX|stop
***  v1    0.3 CLI RX  300
**** v1    0.3 CLI RX|Child in state stopped
**** v1    0.3 CLI TX|status
***  v1    0.3 CLI RX  200
**** v1    0.3 CLI RX|Child in state stopped
**** v1    0.3 STDOUT poll 0x10
**   v1    0.3 R 61347 Status: 0000 (u 0.067000 s 0.095000)
*    diag  0.0 ............................................................
#    top  TEST ../../../bin/varnishtest/tests/v00021.vtc TIMED OUT (kill -9)
#    top  TEST ../../../bin/varnishtest/tests/v00021.vtc FAILED (60.002) signal=9

1 @ SunOS 5.11 i86pc 1.04 32_sun12.4 uplex

*    top   0.0 TEST ../../../bin/varnishtest/tests/v00021.vtc starting
[...]
*    top   0.0 TEST VCL compiler coverage test: vcc_xref.c vcc_var.c vcc_symb.c
[...]
**** v1    0.2 CLI TX|vcl.use vcl12
***  v1    0.2 CLI RX  200
**   top   0.2 === varnish v1 -errvcl {Unknown variable 'req.foobar'} {
**** v1    0.2 CLI TX|vcl.inline vcl13 << %XJEIFLH|)Xspa8P
**** v1    0.2 CLI TX|vcl 4.0;
**** v1    0.2 CLI TX|
**** v1    0.2 CLI TX|\tbackend foo { .host = "127.0.0.1"; }
**** v1    0.2 CLI TX|\tsub vcl_recv { set req.foobar = 3; }
**** v1    0.2 CLI TX|
**** v1    0.2 CLI TX|%XJEIFLH|)Xspa8P
***  v1    0.3 CLI RX  106
**** v1    0.3 CLI RX|Message from VCC-compiler:
**** v1    0.3 CLI RX|Security: Privilege proc_setid missing, will not change uid/gid
**** v1    0.3 CLI RX|Unknown variable 'req.foobar'
**** v1    0.3 CLI RX|At: ('<vcl.inline>' Line 4 Pos 28)
**** v1    0.3 CLI RX|        sub vcl_recv { set req.foobar = 3; }
**** v1    0.3 CLI RX|---------------------------##########-------
**** v1    0.3 CLI RX|
**** v1    0.3 CLI RX|Running VCC-compiler failed, exited with 2
**** v1    0.3 CLI RX|VCL compilation failed
**   v1    0.3 VCL compilation failed (as expected)
***  v1    0.3 Found expected string: ("Unknown variable 'req.foobar'")
*    top   0.3 RESETTING after ../../../bin/varnishtest/tests/v00021.vtc
**   v1    0.3 Wait
**** v1    0.3 CLI TX|backend.list
***  v1    0.3 CLI RX  101
**** v1    0.3 CLI RX|Unknown request in manager process (child not running).
**** v1    0.3 CLI RX|Type 'help' for more info.
**   v1    0.3 Stop
**** v1    0.3 CLI TX|stop
***  v1    0.3 CLI RX  300
**** v1    0.3 CLI RX|Child in state stopped
**** v1    0.3 CLI TX|status
***  v1    0.3 CLI RX  200
**** v1    0.3 CLI RX|Child in state stopped
**** v1    0.3 STDOUT poll 0x10
**   v1    0.3 R 66216 Status: 0000 (u 0.048000 s 0.063000)
*    diag  0.0 ............................................................
#    top  TEST ../../../bin/varnishtest/tests/v00021.vtc TIMED OUT (kill -9)
#    top  TEST ../../../bin/varnishtest/tests/v00021.vtc FAILED (60.003) signal=9

1 @ SunOS 5.11 i86pc 1.04 32_sun12.4 uplex

*    top   0.0 TEST ../../../bin/varnishtest/tests/v00021.vtc starting
[...]
*    top   0.0 TEST VCL compiler coverage test: vcc_xref.c vcc_var.c vcc_symb.c
[...]
**** v1    0.2 CLI TX|vcl.use vcl12
***  v1    0.2 CLI RX  200
**   top   0.2 === varnish v1 -errvcl {Unknown variable 'req.foobar'} {
**** v1    0.2 CLI TX|vcl.inline vcl13 << %XJEIFLH|)Xspa8P
**** v1    0.2 CLI TX|vcl 4.0;
**** v1    0.2 CLI TX|
**** v1    0.2 CLI TX|\tbackend foo { .host = "127.0.0.1"; }
**** v1    0.2 CLI TX|\tsub vcl_recv { set req.foobar = 3; }
**** v1    0.2 CLI TX|
**** v1    0.2 CLI TX|%XJEIFLH|)Xspa8P
***  v1    0.2 CLI RX  106
**** v1    0.2 CLI RX|Message from VCC-compiler:
**** v1    0.2 CLI RX|Security: Privilege proc_setid missing, will not change uid/gid
**** v1    0.2 CLI RX|Unknown variable 'req.foobar'
**** v1    0.2 CLI RX|At: ('<vcl.inline>' Line 4 Pos 28)
**** v1    0.2 CLI RX|        sub vcl_recv { set req.foobar = 3; }
**** v1    0.2 CLI RX|---------------------------##########-------
**** v1    0.2 CLI RX|
**** v1    0.2 CLI RX|Running VCC-compiler failed, exited with 2
**** v1    0.2 CLI RX|VCL compilation failed
**   v1    0.2 VCL compilation failed (as expected)
***  v1    0.2 Found expected string: ("Unknown variable 'req.foobar'")
*    top   0.2 RESETTING after ../../../bin/varnishtest/tests/v00021.vtc
**   v1    0.2 Wait
**** v1    0.2 CLI TX|backend.list
***  v1    0.2 CLI RX  101
**** v1    0.2 CLI RX|Unknown request in manager process (child not running).
**** v1    0.2 CLI RX|Type 'help' for more info.
**   v1    0.2 Stop
**** v1    0.2 CLI TX|stop
***  v1    0.2 CLI RX  300
**** v1    0.2 CLI RX|Child in state stopped
**** v1    0.2 CLI TX|status
***  v1    0.2 CLI RX  200
**** v1    0.2 CLI RX|Child in state stopped
**** v1    0.3 STDOUT poll 0x10
**   v1    0.3 R 4005 Status: 0000 (u 0.048000 s 0.063000)
*    diag  0.0 ............................................................
#    top  TEST ../../../bin/varnishtest/tests/v00021.vtc TIMED OUT (kill -9)
#    top  TEST ../../../bin/varnishtest/tests/v00021.vtc FAILED (60.002) signal=9

1 @ SunOS 5.11 i86pc 1.04 32_sun12.4 uplex

*    top   0.0 TEST ../../../bin/varnishtest/tests/v00021.vtc starting
[...]
*    top   0.0 TEST VCL compiler coverage test: vcc_xref.c vcc_var.c vcc_symb.c
[...]
**** v1    0.2 CLI TX|vcl.use vcl12
***  v1    0.2 CLI RX  200
**   top   0.2 === varnish v1 -errvcl {Unknown variable 'req.foobar'} {
**** v1    0.2 CLI TX|vcl.inline vcl13 << %XJEIFLH|)Xspa8P
**** v1    0.2 CLI TX|vcl 4.0;
**** v1    0.2 CLI TX|
**** v1    0.2 CLI TX|\tbackend foo { .host = "127.0.0.1"; }
**** v1    0.2 CLI TX|\tsub vcl_recv { set req.foobar = 3; }
**** v1    0.2 CLI TX|
**** v1    0.2 CLI TX|%XJEIFLH|)Xspa8P
***  v1    0.2 CLI RX  106
**** v1    0.2 CLI RX|Message from VCC-compiler:
**** v1    0.2 CLI RX|Security: Privilege proc_setid missing, will not change uid/gid
**** v1    0.2 CLI RX|Unknown variable 'req.foobar'
**** v1    0.2 CLI RX|At: ('<vcl.inline>' Line 4 Pos 28)
**** v1    0.2 CLI RX|        sub vcl_recv { set req.foobar = 3; }
**** v1    0.2 CLI RX|---------------------------##########-------
**** v1    0.2 CLI RX|
**** v1    0.2 CLI RX|Running VCC-compiler failed, exited with 2
**** v1    0.2 CLI RX|VCL compilation failed
**   v1    0.2 VCL compilation failed (as expected)
***  v1    0.2 Found expected string: ("Unknown variable 'req.foobar'")
*    top   0.2 RESETTING after ../../../bin/varnishtest/tests/v00021.vtc
**   v1    0.2 Wait
**** v1    0.2 CLI TX|backend.list
***  v1    0.2 CLI RX  101
**** v1    0.2 CLI RX|Unknown request in manager process (child not running).
**** v1    0.2 CLI RX|Type 'help' for more info.
**   v1    0.2 Stop
**** v1    0.2 CLI TX|stop
***  v1    0.2 CLI RX  300
**** v1    0.2 CLI RX|Child in state stopped
**** v1    0.2 CLI TX|status
***  v1    0.2 CLI RX  200
**** v1    0.2 CLI RX|Child in state stopped
**** v1    0.2 STDOUT poll 0x10
**   v1    0.2 R 7050 Status: 0000 (u 0.047000 s 0.063000)
*    diag  0.0 ............................................................
#    top  TEST ../../../bin/varnishtest/tests/v00021.vtc TIMED OUT (kill -9)
#    top  TEST ../../../bin/varnishtest/tests/v00021.vtc FAILED (60.002) signal=9

1 @ SunOS 5.11 i86pc 1.04 32_sun12.4 uplex

*    top   0.0 TEST ../../../bin/varnishtest/tests/v00021.vtc starting
[...]
*    top   0.0 TEST VCL compiler coverage test: vcc_xref.c vcc_var.c vcc_symb.c
[...]
**** v1    0.2 CLI TX|vcl.use vcl12
***  v1    0.2 CLI RX  200
**   top   0.2 === varnish v1 -errvcl {Unknown variable 'req.foobar'} {
**** v1    0.2 CLI TX|vcl.inline vcl13 << %XJEIFLH|)Xspa8P
**** v1    0.2 CLI TX|vcl 4.0;
**** v1    0.2 CLI TX|
**** v1    0.2 CLI TX|\tbackend foo { .host = "127.0.0.1"; }
**** v1    0.2 CLI TX|\tsub vcl_recv { set req.foobar = 3; }
**** v1    0.2 CLI TX|
**** v1    0.2 CLI TX|%XJEIFLH|)Xspa8P
***  v1    0.2 CLI RX  106
**** v1    0.2 CLI RX|Message from VCC-compiler:
**** v1    0.2 CLI RX|Security: Privilege proc_setid missing, will not change uid/gid
**** v1    0.2 CLI RX|Unknown variable 'req.foobar'
**** v1    0.2 CLI RX|At: ('<vcl.inline>' Line 4 Pos 28)
**** v1    0.2 CLI RX|        sub vcl_recv { set req.foobar = 3; }
**** v1    0.2 CLI RX|---------------------------##########-------
**** v1    0.2 CLI RX|
**** v1    0.2 CLI RX|Running VCC-compiler failed, exited with 2
**** v1    0.2 CLI RX|VCL compilation failed
**   v1    0.2 VCL compilation failed (as expected)
***  v1    0.2 Found expected string: ("Unknown variable 'req.foobar'")
*    top   0.2 RESETTING after ../../../bin/varnishtest/tests/v00021.vtc
**   v1    0.2 Wait
**** v1    0.2 CLI TX|backend.list
***  v1    0.2 CLI RX  101
**** v1    0.2 CLI RX|Unknown request in manager process (child not running).
**** v1    0.2 CLI RX|Type 'help' for more info.
**   v1    0.2 Stop
**** v1    0.2 CLI TX|stop
***  v1    0.2 CLI RX  300
**** v1    0.2 CLI RX|Child in state stopped
**** v1    0.2 CLI TX|status
***  v1    0.2 CLI RX  200
**** v1    0.2 CLI RX|Child in state stopped
**** v1    0.2 STDOUT poll 0x10
**   v1    0.3 R 64845 Status: 0000 (u 0.074000 s 0.098000)
*    diag  0.0 ............................................................
#    top  TEST ../../../bin/varnishtest/tests/v00021.vtc TIMED OUT (kill -9)
#    top  TEST ../../../bin/varnishtest/tests/v00021.vtc FAILED (60.002) signal=9

1 @ SunOS 5.11 i86pc 1.04 32_sun12.4 uplex

*    top   0.0 TEST ../../../bin/varnishtest/tests/v00021.vtc starting
[...]
*    top   0.0 TEST VCL compiler coverage test: vcc_xref.c vcc_var.c vcc_symb.c
[...]
**** v1    0.2 CLI TX|vcl.use vcl12
***  v1    0.2 CLI RX  200
**   top   0.2 === varnish v1 -errvcl {Unknown variable 'req.foobar'} {
**** v1    0.2 CLI TX|vcl.inline vcl13 << %XJEIFLH|)Xspa8P
**** v1    0.2 CLI TX|vcl 4.0;
**** v1    0.2 CLI TX|
**** v1    0.2 CLI TX|\tbackend foo { .host = "127.0.0.1"; }
**** v1    0.2 CLI TX|\tsub vcl_recv { set req.foobar = 3; }
**** v1    0.2 CLI TX|
**** v1    0.2 CLI TX|%XJEIFLH|)Xspa8P
***  v1    0.2 CLI RX  106
**** v1    0.2 CLI RX|Message from VCC-compiler:
**** v1    0.2 CLI RX|Security: Privilege proc_setid missing, will not change uid/gid
**** v1    0.2 CLI RX|Unknown variable 'req.foobar'
**** v1    0.2 CLI RX|At: ('<vcl.inline>' Line 4 Pos 28)
**** v1    0.2 CLI RX|        sub vcl_recv { set req.foobar = 3; }
**** v1    0.2 CLI RX|---------------------------##########-------
**** v1    0.2 CLI RX|
**** v1    0.2 CLI RX|Running VCC-compiler failed, exited with 2
**** v1    0.2 CLI RX|VCL compilation failed
**   v1    0.2 VCL compilation failed (as expected)
***  v1    0.2 Found expected string: ("Unknown variable 'req.foobar'")
*    top   0.2 RESETTING after ../../../bin/varnishtest/tests/v00021.vtc
**   v1    0.2 Wait
**** v1    0.2 CLI TX|backend.list
***  v1    0.2 CLI RX  101
**** v1    0.2 CLI RX|Unknown request in manager process (child not running).
**** v1    0.2 CLI RX|Type 'help' for more info.
**   v1    0.2 Stop
**** v1    0.2 CLI TX|stop
***  v1    0.2 CLI RX  300
**** v1    0.2 CLI RX|Child in state stopped
**** v1    0.2 CLI TX|status
***  v1    0.2 CLI RX  200
**** v1    0.2 CLI RX|Child in state stopped
**** v1    0.2 STDOUT poll 0x10
**   v1    0.2 R 18257 Status: 0000 (u 0.066000 s 0.090000)
*    diag  0.0 ............................................................
#    top  TEST ../../../bin/varnishtest/tests/v00021.vtc TIMED OUT (kill -9)
#    top  TEST ../../../bin/varnishtest/tests/v00021.vtc FAILED (60.002) signal=9

1 @ SunOS 5.11 i86pc 1.04 32_sun12.4 uplex

*    top   0.0 TEST ../../../bin/varnishtest/tests/v00021.vtc starting
[...]
*    top   0.0 TEST VCL compiler coverage test: vcc_xref.c vcc_var.c vcc_symb.c
[...]
**** v1    0.2 CLI TX|vcl.use vcl12
***  v1    0.2 CLI RX  200
**   top   0.2 === varnish v1 -errvcl {Unknown variable 'req.foobar'} {
**** v1    0.2 CLI TX|vcl.inline vcl13 << %XJEIFLH|)Xspa8P
**** v1    0.2 CLI TX|vcl 4.0;
**** v1    0.2 CLI TX|
**** v1    0.2 CLI TX|\tbackend foo { .host = "127.0.0.1"; }
**** v1    0.2 CLI TX|\tsub vcl_recv { set req.foobar = 3; }
**** v1    0.2 CLI TX|
**** v1    0.2 CLI TX|%XJEIFLH|)Xspa8P
***  v1    0.2 CLI RX  106
**** v1    0.2 CLI RX|Message from VCC-compiler:
**** v1    0.2 CLI RX|Security: Privilege proc_setid missing, will not change uid/gid
**** v1    0.2 CLI RX|Unknown variable 'req.foobar'
**** v1    0.2 CLI RX|At: ('<vcl.inline>' Line 4 Pos 28)
**** v1    0.2 CLI RX|        sub vcl_recv { set req.foobar = 3; }
**** v1    0.2 CLI RX|---------------------------##########-------
**** v1    0.2 CLI RX|
**** v1    0.2 CLI RX|Running VCC-compiler failed, exited with 2
**** v1    0.2 CLI RX|VCL compilation failed
**   v1    0.2 VCL compilation failed (as expected)
***  v1    0.2 Found expected string: ("Unknown variable 'req.foobar'")
*    top   0.2 RESETTING after ../../../bin/varnishtest/tests/v00021.vtc
**   v1    0.2 Wait
**** v1    0.2 CLI TX|backend.list
***  v1    0.2 CLI RX  101
**** v1    0.2 CLI RX|Unknown request in manager process (child not running).
**** v1    0.2 CLI RX|Type 'help' for more info.
**   v1    0.2 Stop
**** v1    0.2 CLI TX|stop
***  v1    0.2 CLI RX  300
**** v1    0.2 CLI RX|Child in state stopped
**** v1    0.2 CLI TX|status
***  v1    0.2 CLI RX  200
**** v1    0.2 CLI RX|Child in state stopped
**** v1    0.3 STDOUT poll 0x10
**   v1    0.3 R 35521 Status: 0000 (u 0.067000 s 0.093000)
*    diag  0.0 ............................................................
#    top  TEST ../../../bin/varnishtest/tests/v00021.vtc TIMED OUT (kill -9)
#    top  TEST ../../../bin/varnishtest/tests/v00021.vtc FAILED (60.003) signal=9

d3baf27

1 @ SunOS 5.11 i86pc 1.04 32_sun12.4 uplex

*    top   0.0 TEST ../../../bin/varnishtest/tests/v00021.vtc starting
[...]
*    top   0.0 TEST VCL compiler coverage test: vcc_xref.c vcc_var.c vcc_symb.c
[...]
**** v1    0.2 CLI TX|vcl.use vcl12
***  v1    0.2 CLI RX  200
**   top   0.2 === varnish v1 -errvcl {Unknown variable 'req.foobar'} {
**** v1    0.2 CLI TX|vcl.inline vcl13 << %XJEIFLH|)Xspa8P
**** v1    0.2 CLI TX|vcl 4.0;
**** v1    0.2 CLI TX|
**** v1    0.2 CLI TX|\tbackend foo { .host = "127.0.0.1"; }
**** v1    0.2 CLI TX|\tsub vcl_recv { set req.foobar = 3; }
**** v1    0.2 CLI TX|
**** v1    0.2 CLI TX|%XJEIFLH|)Xspa8P
***  v1    0.3 CLI RX  106
**** v1    0.3 CLI RX|Message from VCC-compiler:
**** v1    0.3 CLI RX|Security: Privilege proc_setid missing, will not change uid/gid
**** v1    0.3 CLI RX|Unknown variable 'req.foobar'
**** v1    0.3 CLI RX|At: ('<vcl.inline>' Line 4 Pos 28)
**** v1    0.3 CLI RX|        sub vcl_recv { set req.foobar = 3; }
**** v1    0.3 CLI RX|---------------------------##########-------
**** v1    0.3 CLI RX|
**** v1    0.3 CLI RX|Running VCC-compiler failed, exited with 2
**** v1    0.3 CLI RX|VCL compilation failed
**   v1    0.3 VCL compilation failed (as expected)
***  v1    0.3 Found expected string: ("Unknown variable 'req.foobar'")
*    top   0.3 RESETTING after ../../../bin/varnishtest/tests/v00021.vtc
**   v1    0.3 Wait
**** v1    0.3 CLI TX|backend.list
***  v1    0.3 CLI RX  101
**** v1    0.3 CLI RX|Unknown request in manager process (child not running).
**** v1    0.3 CLI RX|Type 'help' for more info.
**   v1    0.3 Stop
**** v1    0.3 CLI TX|stop
***  v1    0.3 CLI RX  300
**** v1    0.3 CLI RX|Child in state stopped
**** v1    0.3 CLI TX|status
***  v1    0.3 CLI RX  200
**** v1    0.3 CLI RX|Child in state stopped
**** v1    0.3 STDOUT poll 0x10
**   v1    0.3 R 54048 Status: 0000 (u 0.067000 s 0.092000)
*    diag  0.0 ............................................................
#    top  TEST ../../../bin/varnishtest/tests/v00021.vtc TIMED OUT (kill -9)
#    top  TEST ../../../bin/varnishtest/tests/v00021.vtc FAILED (60.003) signal=9

1 @ SunOS 5.11 i86pc 1.04 32_sun12.4 uplex

*    top   0.0 TEST ../../../bin/varnishtest/tests/v00021.vtc starting
[...]
*    top   0.0 TEST VCL compiler coverage test: vcc_xref.c vcc_var.c vcc_symb.c
[...]
**** v1    0.2 CLI TX|vcl.use vcl12
***  v1    0.2 CLI RX  200
**   top   0.2 === varnish v1 -errvcl {Unknown variable 'req.foobar'} {
**** v1    0.2 CLI TX|vcl.inline vcl13 << %XJEIFLH|)Xspa8P
**** v1    0.2 CLI TX|vcl 4.0;
**** v1    0.2 CLI TX|
**** v1    0.2 CLI TX|\tbackend foo { .host = "127.0.0.1"; }
**** v1    0.2 CLI TX|\tsub vcl_recv { set req.foobar = 3; }
**** v1    0.2 CLI TX|
**** v1    0.2 CLI TX|%XJEIFLH|)Xspa8P
***  v1    0.2 CLI RX  106
**** v1    0.2 CLI RX|Message from VCC-compiler:
**** v1    0.2 CLI RX|Security: Privilege proc_setid missing, will not change uid/gid
**** v1    0.2 CLI RX|Unknown variable 'req.foobar'
**** v1    0.2 CLI RX|At: ('<vcl.inline>' Line 4 Pos 28)
**** v1    0.2 CLI RX|        sub vcl_recv { set req.foobar = 3; }
**** v1    0.2 CLI RX|---------------------------##########-------
**** v1    0.2 CLI RX|
**** v1    0.2 CLI RX|Running VCC-compiler failed, exited with 2
**** v1    0.2 CLI RX|VCL compilation failed
**   v1    0.2 VCL compilation failed (as expected)
***  v1    0.2 Found expected string: ("Unknown variable 'req.foobar'")
*    top   0.2 RESETTING after ../../../bin/varnishtest/tests/v00021.vtc
**   v1    0.2 Wait
**** v1    0.2 CLI TX|backend.list
***  v1    0.2 CLI RX  101
**** v1    0.2 CLI RX|Unknown request in manager process (child not running).
**** v1    0.2 CLI RX|Type 'help' for more info.
**   v1    0.2 Stop
**** v1    0.2 CLI TX|stop
***  v1    0.2 CLI RX  300
**** v1    0.2 CLI RX|Child in state stopped
**** v1    0.2 CLI TX|status
***  v1    0.2 CLI RX  200
**** v1    0.2 CLI RX|Child in state stopped
**** v1    0.2 STDOUT poll 0x10
**   v1    0.3 R 32739 Status: 0000 (u 0.067000 s 0.094000)
*    diag  0.0 ............................................................
#    top  TEST ../../../bin/varnishtest/tests/v00021.vtc TIMED OUT (kill -9)
#    top  TEST ../../../bin/varnishtest/tests/v00021.vtc FAILED (60.003) signal=9

1 @ SunOS 5.11 i86pc 1.04 32_sun12.4 uplex

*    top   0.0 TEST ../../../bin/varnishtest/tests/v00021.vtc starting
[...]
*    top   0.0 TEST VCL compiler coverage test: vcc_xref.c vcc_var.c vcc_symb.c
[...]
**** v1    0.2 CLI TX|vcl.use vcl12
***  v1    0.2 CLI RX  200
**   top   0.2 === varnish v1 -errvcl {Unknown variable 'req.foobar'} {
**** v1    0.2 CLI TX|vcl.inline vcl13 << %XJEIFLH|)Xspa8P
**** v1    0.2 CLI TX|vcl 4.0;
**** v1    0.2 CLI TX|
**** v1    0.2 CLI TX|\tbackend foo { .host = "127.0.0.1"; }
**** v1    0.2 CLI TX|\tsub vcl_recv { set req.foobar = 3; }
**** v1    0.2 CLI TX|
**** v1    0.2 CLI TX|%XJEIFLH|)Xspa8P
***  v1    0.2 CLI RX  106
**** v1    0.2 CLI RX|Message from VCC-compiler:
**** v1    0.2 CLI RX|Security: Privilege proc_setid missing, will not change uid/gid
**** v1    0.2 CLI RX|Unknown variable 'req.foobar'
**** v1    0.2 CLI RX|At: ('<vcl.inline>' Line 4 Pos 28)
**** v1    0.2 CLI RX|        sub vcl_recv { set req.foobar = 3; }
**** v1    0.2 CLI RX|---------------------------##########-------
**** v1    0.2 CLI RX|
**** v1    0.2 CLI RX|Running VCC-compiler failed, exited with 2
**** v1    0.2 CLI RX|VCL compilation failed
**   v1    0.2 VCL compilation failed (as expected)
***  v1    0.2 Found expected string: ("Unknown variable 'req.foobar'")
*    top   0.2 RESETTING after ../../../bin/varnishtest/tests/v00021.vtc
**   v1    0.2 Wait
**** v1    0.2 CLI TX|backend.list
***  v1    0.2 CLI RX  101
**** v1    0.2 CLI RX|Unknown request in manager process (child not running).
**** v1    0.2 CLI RX|Type 'help' for more info.
**   v1    0.2 Stop
**** v1    0.2 CLI TX|stop
***  v1    0.2 CLI RX  300
**** v1    0.2 CLI RX|Child in state stopped
**** v1    0.2 CLI TX|status
***  v1    0.2 CLI RX  200
**** v1    0.2 CLI RX|Child in state stopped
**** v1    0.2 STDOUT poll 0x10
**   v1    0.2 R 33221 Status: 0000 (u 0.067000 s 0.087000)
*    diag  0.0 ............................................................
#    top  TEST ../../../bin/varnishtest/tests/v00021.vtc TIMED OUT (kill -9)
#    top  TEST ../../../bin/varnishtest/tests/v00021.vtc FAILED (60.003) signal=9

1 @ SunOS 5.11 i86pc 1.04 32_sun12.4 uplex

*    top   0.0 TEST ../../../bin/varnishtest/tests/v00021.vtc starting
[...]
*    top   0.0 TEST VCL compiler coverage test: vcc_xref.c vcc_var.c vcc_symb.c
[...]
**** v1    0.2 CLI TX|vcl.use vcl12
***  v1    0.2 CLI RX  200
**   top   0.2 === varnish v1 -errvcl {Unknown variable 'req.foobar'} {
**** v1    0.2 CLI TX|vcl.inline vcl13 << %XJEIFLH|)Xspa8P
**** v1    0.2 CLI TX|vcl 4.0;
**** v1    0.2 CLI TX|
**** v1    0.2 CLI TX|\tbackend foo { .host = "127.0.0.1"; }
**** v1    0.2 CLI TX|\tsub vcl_recv { set req.foobar = 3; }
**** v1    0.2 CLI TX|
**** v1    0.2 CLI TX|%XJEIFLH|)Xspa8P
***  v1    0.3 CLI RX  106
**** v1    0.3 CLI RX|Message from VCC-compiler:
**** v1    0.3 CLI RX|Security: Privilege proc_setid missing, will not change uid/gid
**** v1    0.3 CLI RX|Unknown variable 'req.foobar'
**** v1    0.3 CLI RX|At: ('<vcl.inline>' Line 4 Pos 28)
**** v1    0.3 CLI RX|        sub vcl_recv { set req.foobar = 3; }
**** v1    0.3 CLI RX|---------------------------##########-------
**** v1    0.3 CLI RX|
**** v1    0.3 CLI RX|Running VCC-compiler failed, exited with 2
**** v1    0.3 CLI RX|VCL compilation failed
**   v1    0.3 VCL compilation failed (as expected)
***  v1    0.3 Found expected string: ("Unknown variable 'req.foobar'")
*    top   0.3 RESETTING after ../../../bin/varnishtest/tests/v00021.vtc
**   v1    0.3 Wait
**** v1    0.3 CLI TX|backend.list
***  v1    0.3 CLI RX  101
**** v1    0.3 CLI RX|Unknown request in manager process (child not running).
**** v1    0.3 CLI RX|Type 'help' for more info.
**   v1    0.3 Stop
**** v1    0.3 CLI TX|stop
***  v1    0.3 CLI RX  300
**** v1    0.3 CLI RX|Child in state stopped
**** v1    0.3 CLI TX|status
***  v1    0.3 CLI RX  200
**** v1    0.3 CLI RX|Child in state stopped
**** v1    0.3 STDOUT poll 0x10
**   v1    0.3 R 22868 Status: 0000 (u 0.069000 s 0.094000)
*    diag  0.0 ............................................................
#    top  TEST ../../../bin/varnishtest/tests/v00021.vtc TIMED OUT (kill -9)
#    top  TEST ../../../bin/varnishtest/tests/v00021.vtc FAILED (60.002) signal=9

1 @ SunOS 5.11 i86pc 1.04 32_sun12.4 uplex

*    top   0.0 TEST ../../../bin/varnishtest/tests/v00021.vtc starting
[...]
*    top   0.0 TEST VCL compiler coverage test: vcc_xref.c vcc_var.c vcc_symb.c
[...]
**** v1    0.3 CLI TX|vcl.use vcl12
***  v1    0.3 CLI RX  200
**   top   0.3 === varnish v1 -errvcl {Unknown variable 'req.foobar'} {
**** v1    0.3 CLI TX|vcl.inline vcl13 << %XJEIFLH|)Xspa8P
**** v1    0.3 CLI TX|vcl 4.0;
**** v1    0.3 CLI TX|
**** v1    0.3 CLI TX|\tbackend foo { .host = "127.0.0.1"; }
**** v1    0.3 CLI TX|\tsub vcl_recv { set req.foobar = 3; }
**** v1    0.3 CLI TX|
**** v1    0.3 CLI TX|%XJEIFLH|)Xspa8P
***  v1    0.3 CLI RX  106
**** v1    0.3 CLI RX|Message from VCC-compiler:
**** v1    0.3 CLI RX|Security: Privilege proc_setid missing, will not change uid/gid
**** v1    0.3 CLI RX|Unknown variable 'req.foobar'
**** v1    0.3 CLI RX|At: ('<vcl.inline>' Line 4 Pos 28)
**** v1    0.3 CLI RX|        sub vcl_recv { set req.foobar = 3; }
**** v1    0.3 CLI RX|---------------------------##########-------
**** v1    0.3 CLI RX|
**** v1    0.3 CLI RX|Running VCC-compiler failed, exited with 2
**** v1    0.3 CLI RX|VCL compilation failed
**   v1    0.3 VCL compilation failed (as expected)
***  v1    0.3 Found expected string: ("Unknown variable 'req.foobar'")
*    top   0.3 RESETTING after ../../../bin/varnishtest/tests/v00021.vtc
**   v1    0.3 Wait
**** v1    0.3 CLI TX|backend.list
***  v1    0.3 CLI RX  101
**** v1    0.3 CLI RX|Unknown request in manager process (child not running).
**** v1    0.3 CLI RX|Type 'help' for more info.
**   v1    0.3 Stop
**** v1    0.3 CLI TX|stop
***  v1    0.3 CLI RX  300
**** v1    0.3 CLI RX|Child in state stopped
**** v1    0.3 CLI TX|status
***  v1    0.3 CLI RX  200
**** v1    0.3 CLI RX|Child in state stopped
**** v1    0.3 STDOUT poll 0x10
**   v1    0.3 R 35420 Status: 0000 (u 0.069000 s 0.096000)
*    diag  0.0 ............................................................
#    top  TEST ../../../bin/varnishtest/tests/v00021.vtc TIMED OUT (kill -9)
#    top  TEST ../../../bin/varnishtest/tests/v00021.vtc FAILED (60.002) signal=9

1 @ SunOS 5.11 i86pc 1.04 32_sun12.4 uplex

*    top   0.0 TEST ../../../bin/varnishtest/tests/v00021.vtc starting
[...]
*    top   0.0 TEST VCL compiler coverage test: vcc_xref.c vcc_var.c vcc_symb.c
[...]
**** v1    0.2 CLI TX|vcl.use vcl12
***  v1    0.2 CLI RX  200
**   top   0.2 === varnish v1 -errvcl {Unknown variable 'req.foobar'} {
**** v1    0.2 CLI TX|vcl.inline vcl13 << %XJEIFLH|)Xspa8P
**** v1    0.2 CLI TX|vcl 4.0;
**** v1    0.2 CLI TX|
**** v1    0.2 CLI TX|\tbackend foo { .host = "127.0.0.1"; }
**** v1    0.2 CLI TX|\tsub vcl_recv { set req.foobar = 3; }
**** v1    0.2 CLI TX|
**** v1    0.2 CLI TX|%XJEIFLH|)Xspa8P
***  v1    0.2 CLI RX  106
**** v1    0.2 CLI RX|Message from VCC-compiler:
**** v1    0.2 CLI RX|Security: Privilege proc_setid missing, will not change uid/gid
**** v1    0.2 CLI RX|Unknown variable 'req.foobar'
**** v1    0.2 CLI RX|At: ('<vcl.inline>' Line 4 Pos 28)
**** v1    0.2 CLI RX|        sub vcl_recv { set req.foobar = 3; }
**** v1    0.2 CLI RX|---------------------------##########-------
**** v1    0.2 CLI RX|
**** v1    0.2 CLI RX|Running VCC-compiler failed, exited with 2
**** v1    0.2 CLI RX|VCL compilation failed
**   v1    0.2 VCL compilation failed (as expected)
***  v1    0.2 Found expected string: ("Unknown variable 'req.foobar'")
*    top   0.2 RESETTING after ../../../bin/varnishtest/tests/v00021.vtc
**   v1    0.2 Wait
**** v1    0.2 CLI TX|backend.list
***  v1    0.2 CLI RX  101
**** v1    0.2 CLI RX|Unknown request in manager process (child not running).
**** v1    0.2 CLI RX|Type 'help' for more info.
**   v1    0.2 Stop
**** v1    0.2 CLI TX|stop
***  v1    0.2 CLI RX  300
**** v1    0.2 CLI RX|Child in state stopped
**** v1    0.2 CLI TX|status
***  v1    0.2 CLI RX  200
**** v1    0.2 CLI RX|Child in state stopped
**** v1    0.2 STDOUT poll 0x10
**   v1    0.2 R 48452 Status: 0000 (u 0.068000 s 0.089000)
*    diag  0.0 ............................................................
#    top  TEST ../../../bin/varnishtest/tests/v00021.vtc TIMED OUT (kill -9)
#    top  TEST ../../../bin/varnishtest/tests/v00021.vtc FAILED (60.002) signal=9

1 @ SunOS 5.11 i86pc 1.04 32_sun12.4 uplex

*    top   0.0 TEST ../../../bin/varnishtest/tests/v00021.vtc starting
[...]
*    top   0.0 TEST VCL compiler coverage test: vcc_xref.c vcc_var.c vcc_symb.c
[...]
**** v1    0.3 CLI TX|vcl.use vcl12
***  v1    0.3 CLI RX  200
**   top   0.3 === varnish v1 -errvcl {Unknown variable 'req.foobar'} {
**** v1    0.3 CLI TX|vcl.inline vcl13 << %XJEIFLH|)Xspa8P
**** v1    0.3 CLI TX|vcl 4.0;
**** v1    0.3 CLI TX|
**** v1    0.3 CLI TX|\tbackend foo { .host = "127.0.0.1"; }
**** v1    0.3 CLI TX|\tsub vcl_recv { set req.foobar = 3; }
**** v1    0.3 CLI TX|
**** v1    0.3 CLI TX|%XJEIFLH|)Xspa8P
***  v1    0.3 CLI RX  106
**** v1    0.3 CLI RX|Message from VCC-compiler:
**** v1    0.3 CLI RX|Security: Privilege proc_setid missing, will not change uid/gid
**** v1    0.3 CLI RX|Unknown variable 'req.foobar'
**** v1    0.3 CLI RX|At: ('<vcl.inline>' Line 4 Pos 28)
**** v1    0.3 CLI RX|        sub vcl_recv { set req.foobar = 3; }
**** v1    0.3 CLI RX|---------------------------##########-------
**** v1    0.3 CLI RX|
**** v1    0.3 CLI RX|Running VCC-compiler failed, exited with 2
**** v1    0.3 CLI RX|VCL compilation failed
**   v1    0.3 VCL compilation failed (as expected)
***  v1    0.3 Found expected string: ("Unknown variable 'req.foobar'")
*    top   0.3 RESETTING after ../../../bin/varnishtest/tests/v00021.vtc
**   v1    0.3 Wait
**** v1    0.3 CLI TX|backend.list
***  v1    0.3 CLI RX  101
**** v1    0.3 CLI RX|Unknown request in manager process (child not running).
**** v1    0.3 CLI RX|Type 'help' for more info.
**   v1    0.3 Stop
**** v1    0.3 CLI TX|stop
***  v1    0.3 CLI RX  300
**** v1    0.3 CLI RX|Child in state stopped
**** v1    0.3 CLI TX|status
***  v1    0.3 CLI RX  200
**** v1    0.3 CLI RX|Child in state stopped
**** v1    0.3 STDOUT poll 0x10
**   v1    0.3 R 30291 Status: 0000 (u 0.069000 s 0.096000)
*    diag  0.0 ............................................................
#    top  TEST ../../../bin/varnishtest/tests/v00021.vtc TIMED OUT (kill -9)
#    top  TEST ../../../bin/varnishtest/tests/v00021.vtc FAILED (60.002) signal=9

1 @ SunOS 5.11 i86pc 1.04 32_sun12.4 uplex

*    top   0.0 TEST ../../../bin/varnishtest/tests/v00021.vtc starting
[...]
*    top   0.0 TEST VCL compiler coverage test: vcc_xref.c vcc_var.c vcc_symb.c
[...]
**** v1    0.2 CLI TX|vcl.use vcl12
***  v1    0.2 CLI RX  200
**   top   0.2 === varnish v1 -errvcl {Unknown variable 'req.foobar'} {
**** v1    0.2 CLI TX|vcl.inline vcl13 << %XJEIFLH|)Xspa8P
**** v1    0.2 CLI TX|vcl 4.0;
**** v1    0.2 CLI TX|
**** v1    0.2 CLI TX|\tbackend foo { .host = "127.0.0.1"; }
**** v1    0.2 CLI TX|\tsub vcl_recv { set req.foobar = 3; }
**** v1    0.2 CLI TX|
**** v1    0.2 CLI TX|%XJEIFLH|)Xspa8P
***  v1    0.2 CLI RX  106
**** v1    0.2 CLI RX|Message from VCC-compiler:
**** v1    0.2 CLI RX|Security: Privilege proc_setid missing, will not change uid/gid
**** v1    0.2 CLI RX|Unknown variable 'req.foobar'
**** v1    0.2 CLI RX|At: ('<vcl.inline>' Line 4 Pos 28)
**** v1    0.2 CLI RX|        sub vcl_recv { set req.foobar = 3; }
**** v1    0.2 CLI RX|---------------------------##########-------
**** v1    0.2 CLI RX|
**** v1    0.2 CLI RX|Running VCC-compiler failed, exited with 2
**** v1    0.2 CLI RX|VCL compilation failed
**   v1    0.2 VCL compilation failed (as expected)
***  v1    0.2 Found expected string: ("Unknown variable 'req.foobar'")
*    top   0.2 RESETTING after ../../../bin/varnishtest/tests/v00021.vtc
**   v1    0.2 Wait
**** v1    0.2 CLI TX|backend.list
***  v1    0.2 CLI RX  101
**** v1    0.2 CLI RX|Unknown request in manager process (child not running).
**** v1    0.2 CLI RX|Type 'help' for more info.
**   v1    0.2 Stop
**** v1    0.2 CLI TX|stop
***  v1    0.2 CLI RX  300
**** v1    0.2 CLI RX|Child in state stopped
**** v1    0.2 CLI TX|status
***  v1    0.2 CLI RX  200
**** v1    0.2 CLI RX|Child in state stopped
**** v1    0.2 STDOUT poll 0x10
**   v1    0.2 R 36314 Status: 0000 (u 0.065000 s 0.086000)
*    diag  0.0 ............................................................
#    top  TEST ../../../bin/varnishtest/tests/v00021.vtc TIMED OUT (kill -9)
#    top  TEST ../../../bin/varnishtest/tests/v00021.vtc FAILED (60.003) signal=9

bd4794e

1 @ SunOS 5.11 i86pc 1.04 32_sun12.4 uplex

*    top   0.0 TEST ../../../bin/varnishtest/tests/v00021.vtc starting
[...]
*    top   0.0 TEST VCL compiler coverage test: vcc_xref.c vcc_var.c vcc_symb.c
[...]
**** v1    0.2 CLI RX|VCL compiled.
**** v1    0.2 CLI TX|vcl.use vcl12
***  v1    0.2 CLI RX  200
**   top   0.2 === varnish v1 -errvcl {Unknown variable 'req.foobar'} {
**** v1    0.2 CLI TX|vcl.inline vcl13 << %XJEIFLH|)Xspa8P
**** v1    0.2 CLI TX|vcl 4.0;
**** v1    0.2 CLI TX|
**** v1    0.2 CLI TX|\tbackend foo { .host = "127.0.0.1"; }
**** v1    0.2 CLI TX|\tsub vcl_recv { set req.foobar = 3; }
**** v1    0.2 CLI TX|
**** v1    0.2 CLI TX|%XJEIFLH|)Xspa8P
***  v1    0.2 CLI RX  106
**** v1    0.2 CLI RX|Message from VCC-compiler:
**** v1    0.2 CLI RX|Security: Privilege proc_setid missing, will not change uid/gid
**** v1    0.2 CLI RX|Unknown variable 'req.foobar'
**** v1    0.2 CLI RX|At: ('<vcl.inline>' Line 4 Pos 28)
**** v1    0.2 CLI RX|        sub vcl_recv { set req.foobar = 3; }
**** v1    0.2 CLI RX|---------------------------##########-------
**** v1    0.2 CLI RX|
**** v1    0.2 CLI RX|Running VCC-compiler failed, exited with 2
**** v1    0.2 CLI RX|VCL compilation failed
**   v1    0.2 VCL compilation failed (as expected)
***  v1    0.2 Found expected string: ("Unknown variable 'req.foobar'")
*    top   0.2 RESETTING after ../../../bin/varnishtest/tests/v00021.vtc
**   v1    0.2 Wait
**** v1    0.2 CLI TX|backend.list
***  v1    0.2 CLI RX  101
**** v1    0.2 CLI RX|Unknown request in manager process (child not running).
**** v1    0.2 CLI RX|Type 'help' for more info.
**   v1    0.2 Stop
**** v1    0.2 CLI TX|stop
***  v1    0.2 CLI RX  300
**** v1    0.2 CLI RX|Child in state stopped
**** v1    0.2 CLI TX|status
***  v1    0.2 CLI RX  200
**** v1    0.2 CLI RX|Child in state stopped
**** v1    0.2 STDOUT poll 0x10
**   v1    0.2 R 81468 Status: 0000 (u 0.067000 s 0.088000)
#    top  TEST ../../../bin/varnishtest/tests/v00021.vtc TIMED OUT (kill -9)
#    top  TEST ../../../bin/varnishtest/tests/v00021.vtc FAILED (60.002) signal=9

1 @ SunOS 5.11 i86pc 1.04 32_sun12.4 uplex

*    top   0.0 TEST ../../../bin/varnishtest/tests/v00021.vtc starting
[...]
*    top   0.0 TEST VCL compiler coverage test: vcc_xref.c vcc_var.c vcc_symb.c
[...]
**** v1    0.2 CLI RX|VCL compiled.
**** v1    0.2 CLI TX|vcl.use vcl12
***  v1    0.2 CLI RX  200
**   top   0.2 === varnish v1 -errvcl {Unknown variable 'req.foobar'} {
**** v1    0.2 CLI TX|vcl.inline vcl13 << %XJEIFLH|)Xspa8P
**** v1    0.2 CLI TX|vcl 4.0;
**** v1    0.2 CLI TX|
**** v1    0.2 CLI TX|\tbackend foo { .host = "127.0.0.1"; }
**** v1    0.2 CLI TX|\tsub vcl_recv { set req.foobar = 3; }
**** v1    0.2 CLI TX|
**** v1    0.2 CLI TX|%XJEIFLH|)Xspa8P
***  v1    0.3 CLI RX  106
**** v1    0.3 CLI RX|Message from VCC-compiler:
**** v1    0.3 CLI RX|Security: Privilege proc_setid missing, will not change uid/gid
**** v1    0.3 CLI RX|Unknown variable 'req.foobar'
**** v1    0.3 CLI RX|At: ('<vcl.inline>' Line 4 Pos 28)
**** v1    0.3 CLI RX|        sub vcl_recv { set req.foobar = 3; }
**** v1    0.3 CLI RX|---------------------------##########-------
**** v1    0.3 CLI RX|
**** v1    0.3 CLI RX|Running VCC-compiler failed, exited with 2
**** v1    0.3 CLI RX|VCL compilation failed
**   v1    0.3 VCL compilation failed (as expected)
***  v1    0.3 Found expected string: ("Unknown variable 'req.foobar'")
*    top   0.3 RESETTING after ../../../bin/varnishtest/tests/v00021.vtc
**   v1    0.3 Wait
**** v1    0.3 CLI TX|backend.list
***  v1    0.3 CLI RX  101
**** v1    0.3 CLI RX|Unknown request in manager process (child not running).
**** v1    0.3 CLI RX|Type 'help' for more info.
**   v1    0.3 Stop
**** v1    0.3 CLI TX|stop
***  v1    0.3 CLI RX  300
**** v1    0.3 CLI RX|Child in state stopped
**** v1    0.3 CLI TX|status
***  v1    0.3 CLI RX  200
**** v1    0.3 CLI RX|Child in state stopped
**** v1    0.3 STDOUT poll 0x10
**   v1    0.3 R 45510 Status: 0000 (u 0.048000 s 0.063000)
#    top  TEST ../../../bin/varnishtest/tests/v00021.vtc TIMED OUT (kill -9)
#    top  TEST ../../../bin/varnishtest/tests/v00021.vtc FAILED (60.002) signal=9

1 @ SunOS 5.11 i86pc 1.04 32_sun12.4 uplex

*    top   0.0 TEST ../../../bin/varnishtest/tests/v00021.vtc starting
[...]
*    top   0.0 TEST VCL compiler coverage test: vcc_xref.c vcc_var.c vcc_symb.c
[...]
**** v1    0.3 CLI RX|VCL compiled.
**** v1    0.3 CLI TX|vcl.use vcl12
***  v1    0.3 CLI RX  200
**   top   0.3 === varnish v1 -errvcl {Unknown variable 'req.foobar'} {
**** v1    0.3 CLI TX|vcl.inline vcl13 << %XJEIFLH|)Xspa8P
**** v1    0.3 CLI TX|vcl 4.0;
**** v1    0.3 CLI TX|
**** v1    0.3 CLI TX|\tbackend foo { .host = "127.0.0.1"; }
**** v1    0.3 CLI TX|\tsub vcl_recv { set req.foobar = 3; }
**** v1    0.3 CLI TX|
**** v1    0.3 CLI TX|%XJEIFLH|)Xspa8P
***  v1    0.3 CLI RX  106
**** v1    0.3 CLI RX|Message from VCC-compiler:
**** v1    0.3 CLI RX|Security: Privilege proc_setid missing, will not change uid/gid
**** v1    0.3 CLI RX|Unknown variable 'req.foobar'
**** v1    0.3 CLI RX|At: ('<vcl.inline>' Line 4 Pos 28)
**** v1    0.3 CLI RX|        sub vcl_recv { set req.foobar = 3; }
**** v1    0.3 CLI RX|---------------------------##########-------
**** v1    0.3 CLI RX|
**** v1    0.3 CLI RX|Running VCC-compiler failed, exited with 2
**** v1    0.3 CLI RX|VCL compilation failed
**   v1    0.3 VCL compilation failed (as expected)
***  v1    0.3 Found expected string: ("Unknown variable 'req.foobar'")
*    top   0.3 RESETTING after ../../../bin/varnishtest/tests/v00021.vtc
**   v1    0.3 Wait
**** v1    0.3 CLI TX|backend.list
***  v1    0.3 CLI RX  101
**** v1    0.3 CLI RX|Unknown request in manager process (child not running).
**** v1    0.3 CLI RX|Type 'help' for more info.
**   v1    0.3 Stop
**** v1    0.3 CLI TX|stop
***  v1    0.3 CLI RX  300
**** v1    0.3 CLI RX|Child in state stopped
**** v1    0.3 CLI TX|status
***  v1    0.3 CLI RX  200
**** v1    0.3 CLI RX|Child in state stopped
**** v1    0.3 STDOUT poll 0x10
**   v1    0.3 R 39798 Status: 0000 (u 0.068000 s 0.096000)
#    top  TEST ../../../bin/varnishtest/tests/v00021.vtc TIMED OUT (kill -9)
#    top  TEST ../../../bin/varnishtest/tests/v00021.vtc FAILED (60.002) signal=9

1 @ SunOS 5.11 i86pc 1.04 32_sun12.4 uplex

*    top   0.0 TEST ../../../bin/varnishtest/tests/v00021.vtc starting
[...]
*    top   0.0 TEST VCL compiler coverage test: vcc_xref.c vcc_var.c vcc_symb.c
[...]
**** v1    0.3 CLI RX|VCL compiled.
**** v1    0.3 CLI TX|vcl.use vcl12
***  v1    0.3 CLI RX  200
**   top   0.3 === varnish v1 -errvcl {Unknown variable 'req.foobar'} {
**** v1    0.3 CLI TX|vcl.inline vcl13 << %XJEIFLH|)Xspa8P
**** v1    0.3 CLI TX|vcl 4.0;
**** v1    0.3 CLI TX|
**** v1    0.3 CLI TX|\tbackend foo { .host = "127.0.0.1"; }
**** v1    0.3 CLI TX|\tsub vcl_recv { set req.foobar = 3; }
**** v1    0.3 CLI TX|
**** v1    0.3 CLI TX|%XJEIFLH|)Xspa8P
***  v1    0.3 CLI RX  106
**** v1    0.3 CLI RX|Message from VCC-compiler:
**** v1    0.3 CLI RX|Security: Privilege proc_setid missing, will not change uid/gid
**** v1    0.3 CLI RX|Unknown variable 'req.foobar'
**** v1    0.3 CLI RX|At: ('<vcl.inline>' Line 4 Pos 28)
**** v1    0.3 CLI RX|        sub vcl_recv { set req.foobar = 3; }
**** v1    0.3 CLI RX|---------------------------##########-------
**** v1    0.3 CLI RX|
**** v1    0.3 CLI RX|Running VCC-compiler failed, exited with 2
**** v1    0.3 CLI RX|VCL compilation failed
**   v1    0.3 VCL compilation failed (as expected)
***  v1    0.3 Found expected string: ("Unknown variable 'req.foobar'")
*    top   0.3 RESETTING after ../../../bin/varnishtest/tests/v00021.vtc
**   v1    0.3 Wait
**** v1    0.3 CLI TX|backend.list
***  v1    0.3 CLI RX  101
**** v1    0.3 CLI RX|Unknown request in manager process (child not running).
**** v1    0.3 CLI RX|Type 'help' for more info.
**   v1    0.3 Stop
**** v1    0.3 CLI TX|stop
***  v1    0.3 CLI RX  300
**** v1    0.3 CLI RX|Child in state stopped
**** v1    0.3 CLI TX|status
***  v1    0.3 CLI RX  200
**** v1    0.3 CLI RX|Child in state stopped
**** v1    0.3 STDOUT poll 0x10
**   v1    0.3 R 72386 Status: 0000 (u 0.069000 s 0.097000)
#    top  TEST ../../../bin/varnishtest/tests/v00021.vtc TIMED OUT (kill -9)
#    top  TEST ../../../bin/varnishtest/tests/v00021.vtc FAILED (60.002) signal=9

1 @ SunOS 5.11 i86pc 1.04 32_sun12.4 uplex

*    top   0.0 TEST ../../../bin/varnishtest/tests/v00021.vtc starting
[...]
*    top   0.0 TEST VCL compiler coverage test: vcc_xref.c vcc_var.c vcc_symb.c
[...]
**** v1    0.2 CLI RX|VCL compiled.
**** v1    0.2 CLI TX|vcl.use vcl12
***  v1    0.2 CLI RX  200
**   top   0.2 === varnish v1 -errvcl {Unknown variable 'req.foobar'} {
**** v1    0.2 CLI TX|vcl.inline vcl13 << %XJEIFLH|)Xspa8P
**** v1    0.2 CLI TX|vcl 4.0;
**** v1    0.2 CLI TX|
**** v1    0.2 CLI TX|\tbackend foo { .host = "127.0.0.1"; }
**** v1    0.2 CLI TX|\tsub vcl_recv { set req.foobar = 3; }
**** v1    0.2 CLI TX|
**** v1    0.2 CLI TX|%XJEIFLH|)Xspa8P
***  v1    0.2 CLI RX  106
**** v1    0.2 CLI RX|Message from VCC-compiler:
**** v1    0.2 CLI RX|Security: Privilege proc_setid missing, will not change uid/gid
**** v1    0.2 CLI RX|Unknown variable 'req.foobar'
**** v1    0.2 CLI RX|At: ('<vcl.inline>' Line 4 Pos 28)
**** v1    0.2 CLI RX|        sub vcl_recv { set req.foobar = 3; }
**** v1    0.2 CLI RX|---------------------------##########-------
**** v1    0.2 CLI RX|
**** v1    0.2 CLI RX|Running VCC-compiler failed, exited with 2
**** v1    0.2 CLI RX|VCL compilation failed
**   v1    0.2 VCL compilation failed (as expected)
***  v1    0.2 Found expected string: ("Unknown variable 'req.foobar'")
*    top   0.2 RESETTING after ../../../bin/varnishtest/tests/v00021.vtc
**   v1    0.2 Wait
**** v1    0.2 CLI TX|backend.list
***  v1    0.2 CLI RX  101
**** v1    0.2 CLI RX|Unknown request in manager process (child not running).
**** v1    0.2 CLI RX|Type 'help' for more info.
**   v1    0.2 Stop
**** v1    0.2 CLI TX|stop
***  v1    0.2 CLI RX  300
**** v1    0.2 CLI RX|Child in state stopped
**** v1    0.2 CLI TX|status
***  v1    0.2 CLI RX  200
**** v1    0.2 CLI RX|Child in state stopped
**** v1    0.2 STDOUT poll 0x10
**   v1    0.2 R 79831 Status: 0000 (u 0.069000 s 0.090000)
#    top  TEST ../../../bin/varnishtest/tests/v00021.vtc TIMED OUT (kill -9)
#    top  TEST ../../../bin/varnishtest/tests/v00021.vtc FAILED (60.001) signal=9

1 @ SunOS 5.11 i86pc 1.04 32_sun12.4 uplex

*    top   0.0 TEST ../../../bin/varnishtest/tests/v00021.vtc starting
[...]
*    top   0.0 TEST VCL compiler coverage test: vcc_xref.c vcc_var.c vcc_symb.c
[...]
**** v1    0.3 CLI RX|VCL compiled.
**** v1    0.3 CLI TX|vcl.use vcl12
***  v1    0.3 CLI RX  200
**   top   0.3 === varnish v1 -errvcl {Unknown variable 'req.foobar'} {
**** v1    0.3 CLI TX|vcl.inline vcl13 << %XJEIFLH|)Xspa8P
**** v1    0.3 CLI TX|vcl 4.0;
**** v1    0.3 CLI TX|
**** v1    0.3 CLI TX|\tbackend foo { .host = "127.0.0.1"; }
**** v1    0.3 CLI TX|\tsub vcl_recv { set req.foobar = 3; }
**** v1    0.3 CLI TX|
**** v1    0.3 CLI TX|%XJEIFLH|)Xspa8P
***  v1    0.3 CLI RX  106
**** v1    0.3 CLI RX|Message from VCC-compiler:
**** v1    0.3 CLI RX|Security: Privilege proc_setid missing, will not change uid/gid
**** v1    0.3 CLI RX|Unknown variable 'req.foobar'
**** v1    0.3 CLI RX|At: ('<vcl.inline>' Line 4 Pos 28)
**** v1    0.3 CLI RX|        sub vcl_recv { set req.foobar = 3; }
**** v1    0.3 CLI RX|---------------------------##########-------
**** v1    0.3 CLI RX|
**** v1    0.3 CLI RX|Running VCC-compiler failed, exited with 2
**** v1    0.3 CLI RX|VCL compilation failed
**   v1    0.3 VCL compilation failed (as expected)
***  v1    0.3 Found expected string: ("Unknown variable 'req.foobar'")
*    top   0.3 RESETTING after ../../../bin/varnishtest/tests/v00021.vtc
**   v1    0.3 Wait
**** v1    0.3 CLI TX|backend.list
***  v1    0.3 CLI RX  101
**** v1    0.3 CLI RX|Unknown request in manager process (child not running).
**** v1    0.3 CLI RX|Type 'help' for more info.
**   v1    0.3 Stop
**** v1    0.3 CLI TX|stop
***  v1    0.3 CLI RX  300
**** v1    0.3 CLI RX|Child in state stopped
**** v1    0.3 CLI TX|status
***  v1    0.3 CLI RX  200
**** v1    0.3 CLI RX|Child in state stopped
**** v1    0.3 STDOUT poll 0x10
**   v1    0.3 R 59235 Status: 0000 (u 0.049000 s 0.065000)
#    top  TEST ../../../bin/varnishtest/tests/v00021.vtc TIMED OUT (kill -9)
#    top  TEST ../../../bin/varnishtest/tests/v00021.vtc FAILED (60.002) signal=9

1 @ SunOS 5.11 i86pc 1.04 32_sun12.4 uplex

*    top   0.0 TEST ../../../bin/varnishtest/tests/v00021.vtc starting
[...]
*    top   0.0 TEST VCL compiler coverage test: vcc_xref.c vcc_var.c vcc_symb.c
[...]
**** v1    0.2 CLI RX|VCL compiled.
**** v1    0.2 CLI TX|vcl.use vcl12
***  v1    0.2 CLI RX  200
**   top   0.2 === varnish v1 -errvcl {Unknown variable 'req.foobar'} {
**** v1    0.2 CLI TX|vcl.inline vcl13 << %XJEIFLH|)Xspa8P
**** v1    0.2 CLI TX|vcl 4.0;
**** v1    0.2 CLI TX|
**** v1    0.2 CLI TX|\tbackend foo { .host = "127.0.0.1"; }
**** v1    0.2 CLI TX|\tsub vcl_recv { set req.foobar = 3; }
**** v1    0.2 CLI TX|
**** v1    0.2 CLI TX|%XJEIFLH|)Xspa8P
***  v1    0.2 CLI RX  106
**** v1    0.2 CLI RX|Message from VCC-compiler:
**** v1    0.2 CLI RX|Security: Privilege proc_setid missing, will not change uid/gid
**** v1    0.2 CLI RX|Unknown variable 'req.foobar'
**** v1    0.2 CLI RX|At: ('<vcl.inline>' Line 4 Pos 28)
**** v1    0.2 CLI RX|        sub vcl_recv { set req.foobar = 3; }
**** v1    0.2 CLI RX|---------------------------##########-------
**** v1    0.2 CLI RX|
**** v1    0.2 CLI RX|Running VCC-compiler failed, exited with 2
**** v1    0.2 CLI RX|VCL compilation failed
**   v1    0.2 VCL compilation failed (as expected)
***  v1    0.2 Found expected string: ("Unknown variable 'req.foobar'")
*    top   0.2 RESETTING after ../../../bin/varnishtest/tests/v00021.vtc
**   v1    0.2 Wait
**** v1    0.2 CLI TX|backend.list
***  v1    0.2 CLI RX  101
**** v1    0.2 CLI RX|Unknown request in manager process (child not running).
**** v1    0.2 CLI RX|Type 'help' for more info.
**   v1    0.2 Stop
**** v1    0.2 CLI TX|stop
***  v1    0.2 CLI RX  300
**** v1    0.2 CLI RX|Child in state stopped
**** v1    0.2 CLI TX|status
***  v1    0.2 CLI RX  200
**** v1    0.2 CLI RX|Child in state stopped
**** v1    0.2 STDOUT poll 0x10
**   v1    0.2 R 49836 Status: 0000 (u 0.067000 s 0.091000)
#    top  TEST ../../../bin/varnishtest/tests/v00021.vtc TIMED OUT (kill -9)
#    top  TEST ../../../bin/varnishtest/tests/v00021.vtc FAILED (60.002) signal=9

1 @ SunOS 5.11 i86pc 1.04 32_sun12.4 uplex

*    top   0.0 TEST ../../../bin/varnishtest/tests/v00021.vtc starting
[...]
*    top   0.0 TEST VCL compiler coverage test: vcc_xref.c vcc_var.c vcc_symb.c
[...]
**** v1    0.2 CLI RX|VCL compiled.
**** v1    0.2 CLI TX|vcl.use vcl12
***  v1    0.2 CLI RX  200
**   top   0.2 === varnish v1 -errvcl {Unknown variable 'req.foobar'} {
**** v1    0.2 CLI TX|vcl.inline vcl13 << %XJEIFLH|)Xspa8P
**** v1    0.2 CLI TX|vcl 4.0;
**** v1    0.2 CLI TX|
**** v1    0.2 CLI TX|\tbackend foo { .host = "127.0.0.1"; }
**** v1    0.2 CLI TX|\tsub vcl_recv { set req.foobar = 3; }
**** v1    0.2 CLI TX|
**** v1    0.2 CLI TX|%XJEIFLH|)Xspa8P
***  v1    0.2 CLI RX  106
**** v1    0.2 CLI RX|Message from VCC-compiler:
**** v1    0.2 CLI RX|Security: Privilege proc_setid missing, will not change uid/gid
**** v1    0.2 CLI RX|Unknown variable 'req.foobar'
**** v1    0.2 CLI RX|At: ('<vcl.inline>' Line 4 Pos 28)
**** v1    0.2 CLI RX|        sub vcl_recv { set req.foobar = 3; }
**** v1    0.2 CLI RX|---------------------------##########-------
**** v1    0.2 CLI RX|
**** v1    0.2 CLI RX|Running VCC-compiler failed, exited with 2
**** v1    0.2 CLI RX|VCL compilation failed
**   v1    0.2 VCL compilation failed (as expected)
***  v1    0.2 Found expected string: ("Unknown variable 'req.foobar'")
*    top   0.2 RESETTING after ../../../bin/varnishtest/tests/v00021.vtc
**   v1    0.2 Wait
**** v1    0.2 CLI TX|backend.list
***  v1    0.2 CLI RX  101
**** v1    0.2 CLI RX|Unknown request in manager process (child not running).
**** v1    0.2 CLI RX|Type 'help' for more info.
**   v1    0.2 Stop
**** v1    0.2 CLI TX|stop
***  v1    0.2 CLI RX  300
**** v1    0.2 CLI RX|Child in state stopped
**** v1    0.2 CLI TX|status
***  v1    0.2 CLI RX  200
**** v1    0.2 CLI RX|Child in state stopped
**** v1    0.2 STDOUT poll 0x10
**   v1    0.2 R 35917 Status: 0000 (u 0.066000 s 0.092000)
#    top  TEST ../../../bin/varnishtest/tests/v00021.vtc TIMED OUT (kill -9)
#    top  TEST ../../../bin/varnishtest/tests/v00021.vtc FAILED (60.002) signal=9