v00025

7251861

1 @ SunOS i86pc 5.11 1.04 64_sun12.4 uplex

*    top   0.0 TEST ../../../bin/varnishtest/tests/v00025.vtc starting
[...]
*    top   0.0 TEST More VCL coverage
[...]
**** v1    0.2 CLI TX|\t}
**** v1    0.2 CLI TX|
**** v1    0.2 CLI TX|\tsub vcl_backend_fetch {
**** v1    0.2 CLI TX|\t\tif (bereq.between_bytes_timeout < 10s) {
**** v1    0.2 CLI TX|\t\t\tset bereq.http.quick = "please";
**** v1    0.2 CLI TX|\t\t}
**** v1    0.2 CLI TX|\t\tif (bereq.connect_timeout < 10s) {
**** v1    0.2 CLI TX|\t\t\tset bereq.http.hello = "please";
**** v1    0.2 CLI TX|\t\t}
**** v1    0.2 CLI TX|\t\tset bereq.connect_timeout = 10s;
**** v1    0.2 CLI TX|\t}
**** v1    0.2 CLI TX|
**** v1    0.2 CLI TX|
**** v1    0.2 CLI TX|%XJEIFLH|)Xspa8P
***  v1    0.2 CLI RX  106
**** v1    0.2 CLI RX|Message from VCC-compiler:
**** v1    0.2 CLI RX|Security: Privilege proc_setid missing, will not change uid/gid
**** v1    0.2 CLI RX|Could not load VMOD std
**** v1    0.2 CLI RX|\tFile name: /tmp/vtest.64_sun12.4/varnish-cache/varnish-trunk/_build/lib/libvmod_std/.libs/libvmod_std.so
**** v1    0.2 CLI RX|\tdlerror: ld.so.1: varnishd: fatal: relocation error: file /tmp/vtest.64_sun12.4/varnish-cache/varnish-trunk/_build/lib/libvmod_std/.libs/libvmod_std.so: symbol vmod_issyntax: referenced symbol not found
**** v1    0.2 CLI RX|('<vcl.inline>' Line 6 Pos 16)
**** v1    0.2 CLI RX|        import std;
**** v1    0.2 CLI RX|---------------###-
**** v1    0.2 CLI RX|
**** v1    0.2 CLI RX|Running VCC-compiler failed, exited with 2
**** v1    0.2 CLI RX|VCL compilation failed
---- v1    0.2 FAIL VCL does not compile
*    top   0.2 RESETTING after ../../../bin/varnishtest/tests/v00025.vtc
**   s1    0.2 Waiting for server (3/-1)
**   v1    0.2 Wait
**** v1    0.2 CLI TX|panic.clear
***  v1    0.2 CLI RX  300
**** v1    0.2 CLI RX|No panic to clear
***  v1    0.2 debug|Info: manager stopping child
***  v1    0.2 debug|Info: manager dies
**** v1    0.2 STDOUT poll 0x10
**   v1    0.2 R 38960 Status: 0000 (u 0.010000 s 0.034000)
***  v1    0.3 vsl|No VSL chunk found (child not started ?)
*    top   0.3 TEST ../../../bin/varnishtest/tests/v00025.vtc FAILED
#    top  TEST ../../../bin/varnishtest/tests/v00025.vtc FAILED (0.255) exit=2

1 @ SunOS i86pc 5.11 1.04 32_sun12.4 uplex

*    top   0.0 TEST ../../../bin/varnishtest/tests/v00025.vtc starting
[...]
*    top   0.0 TEST More VCL coverage
[...]
**** v1    0.1 CLI TX|\t}
**** v1    0.1 CLI TX|
**** v1    0.1 CLI TX|\tsub vcl_backend_fetch {
**** v1    0.1 CLI TX|\t\tif (bereq.between_bytes_timeout < 10s) {
**** v1    0.1 CLI TX|\t\t\tset bereq.http.quick = "please";
**** v1    0.1 CLI TX|\t\t}
**** v1    0.1 CLI TX|\t\tif (bereq.connect_timeout < 10s) {
**** v1    0.1 CLI TX|\t\t\tset bereq.http.hello = "please";
**** v1    0.1 CLI TX|\t\t}
**** v1    0.1 CLI TX|\t\tset bereq.connect_timeout = 10s;
**** v1    0.1 CLI TX|\t}
**** v1    0.1 CLI TX|
**** v1    0.1 CLI TX|
**** v1    0.1 CLI TX|%XJEIFLH|)Xspa8P
***  v1    0.1 CLI RX  106
**** v1    0.1 CLI RX|Message from VCC-compiler:
**** v1    0.1 CLI RX|Security: Privilege proc_setid missing, will not change uid/gid
**** v1    0.1 CLI RX|Could not load VMOD std
**** v1    0.1 CLI RX|\tFile name: /tmp/vtest.32_sun12.4/varnish-cache/varnish-trunk/_build/lib/libvmod_std/.libs/libvmod_std.so
**** v1    0.1 CLI RX|\tdlerror: ld.so.1: varnishd: fatal: relocation error: file /tmp/vtest.32_sun12.4/varnish-cache/varnish-trunk/_build/lib/libvmod_std/.libs/libvmod_std.so: symbol vmod_issyntax: referenced symbol not found
**** v1    0.1 CLI RX|('<vcl.inline>' Line 6 Pos 16)
**** v1    0.1 CLI RX|        import std;
**** v1    0.1 CLI RX|---------------###-
**** v1    0.1 CLI RX|
**** v1    0.1 CLI RX|Running VCC-compiler failed, exited with 2
**** v1    0.1 CLI RX|VCL compilation failed
---- v1    0.1 FAIL VCL does not compile
*    top   0.1 RESETTING after ../../../bin/varnishtest/tests/v00025.vtc
**   s1    0.1 Waiting for server (3/-1)
**   v1    0.1 Wait
**** v1    0.1 CLI TX|panic.clear
***  v1    0.1 CLI RX  300
**** v1    0.1 CLI RX|No panic to clear
***  v1    0.1 debug|Info: manager stopping child
***  v1    0.1 debug|Info: manager dies
**** v1    0.2 STDOUT poll 0x10
**   v1    0.2 R 68369 Status: 0000 (u 0.008000 s 0.027000)
***  v1    0.2 vsl|No VSL chunk found (child not started ?)
*    top   0.2 TEST ../../../bin/varnishtest/tests/v00025.vtc FAILED
#    top  TEST ../../../bin/varnishtest/tests/v00025.vtc FAILED (0.245) exit=2

1 @ SunOS i86pc 5.11 1.04 32_sun12.4 uplex

*    top   0.0 TEST ../../../bin/varnishtest/tests/v00025.vtc starting
[...]
*    top   0.0 TEST More VCL coverage
[...]
**** v1    0.1 CLI TX|\t}
**** v1    0.1 CLI TX|
**** v1    0.1 CLI TX|\tsub vcl_backend_fetch {
**** v1    0.1 CLI TX|\t\tif (bereq.between_bytes_timeout < 10s) {
**** v1    0.1 CLI TX|\t\t\tset bereq.http.quick = "please";
**** v1    0.1 CLI TX|\t\t}
**** v1    0.1 CLI TX|\t\tif (bereq.connect_timeout < 10s) {
**** v1    0.1 CLI TX|\t\t\tset bereq.http.hello = "please";
**** v1    0.1 CLI TX|\t\t}
**** v1    0.1 CLI TX|\t\tset bereq.connect_timeout = 10s;
**** v1    0.1 CLI TX|\t}
**** v1    0.1 CLI TX|
**** v1    0.1 CLI TX|
**** v1    0.1 CLI TX|%XJEIFLH|)Xspa8P
***  v1    0.2 CLI RX  106
**** v1    0.2 CLI RX|Message from VCC-compiler:
**** v1    0.2 CLI RX|Security: Privilege proc_setid missing, will not change uid/gid
**** v1    0.2 CLI RX|Could not load VMOD std
**** v1    0.2 CLI RX|\tFile name: /tmp/vtest.32_sun12.4/varnish-cache/varnish-trunk/_build/lib/libvmod_std/.libs/libvmod_std.so
**** v1    0.2 CLI RX|\tdlerror: ld.so.1: varnishd: fatal: relocation error: file /tmp/vtest.32_sun12.4/varnish-cache/varnish-trunk/_build/lib/libvmod_std/.libs/libvmod_std.so: symbol vmod_issyntax: referenced symbol not found
**** v1    0.2 CLI RX|('<vcl.inline>' Line 6 Pos 16)
**** v1    0.2 CLI RX|        import std;
**** v1    0.2 CLI RX|---------------###-
**** v1    0.2 CLI RX|
**** v1    0.2 CLI RX|Running VCC-compiler failed, exited with 2
**** v1    0.2 CLI RX|VCL compilation failed
---- v1    0.2 FAIL VCL does not compile
*    top   0.2 RESETTING after ../../../bin/varnishtest/tests/v00025.vtc
**   s1    0.2 Waiting for server (3/-1)
**   v1    0.2 Wait
**** v1    0.2 CLI TX|panic.clear
***  v1    0.2 CLI RX  300
**** v1    0.2 CLI RX|No panic to clear
***  v1    0.2 debug|Info: manager stopping child
***  v1    0.2 debug|Info: manager dies
**** v1    0.2 STDOUT poll 0x10
**   v1    0.2 R 40584 Status: 0000 (u 0.009000 s 0.028000)
***  v1    0.2 vsl|No VSL chunk found (child not started ?)
*    top   0.2 TEST ../../../bin/varnishtest/tests/v00025.vtc FAILED
#    top  TEST ../../../bin/varnishtest/tests/v00025.vtc FAILED (0.248) exit=2

1 @ SunOS i86pc 5.11 1.04 64_sun12.4 uplex

*    top   0.0 TEST ../../../bin/varnishtest/tests/v00025.vtc starting
[...]
*    top   0.0 TEST More VCL coverage
[...]
**** v1    0.1 CLI TX|\t}
**** v1    0.1 CLI TX|
**** v1    0.1 CLI TX|\tsub vcl_backend_fetch {
**** v1    0.1 CLI TX|\t\tif (bereq.between_bytes_timeout < 10s) {
**** v1    0.1 CLI TX|\t\t\tset bereq.http.quick = "please";
**** v1    0.1 CLI TX|\t\t}
**** v1    0.1 CLI TX|\t\tif (bereq.connect_timeout < 10s) {
**** v1    0.1 CLI TX|\t\t\tset bereq.http.hello = "please";
**** v1    0.1 CLI TX|\t\t}
**** v1    0.1 CLI TX|\t\tset bereq.connect_timeout = 10s;
**** v1    0.1 CLI TX|\t}
**** v1    0.1 CLI TX|
**** v1    0.1 CLI TX|
**** v1    0.1 CLI TX|%XJEIFLH|)Xspa8P
***  v1    0.2 CLI RX  106
**** v1    0.2 CLI RX|Message from VCC-compiler:
**** v1    0.2 CLI RX|Security: Privilege proc_setid missing, will not change uid/gid
**** v1    0.2 CLI RX|Could not load VMOD std
**** v1    0.2 CLI RX|\tFile name: /tmp/vtest.64_sun12.4/varnish-cache/varnish-trunk/_build/lib/libvmod_std/.libs/libvmod_std.so
**** v1    0.2 CLI RX|\tdlerror: ld.so.1: varnishd: fatal: relocation error: file /tmp/vtest.64_sun12.4/varnish-cache/varnish-trunk/_build/lib/libvmod_std/.libs/libvmod_std.so: symbol vmod_issyntax: referenced symbol not found
**** v1    0.2 CLI RX|('<vcl.inline>' Line 6 Pos 16)
**** v1    0.2 CLI RX|        import std;
**** v1    0.2 CLI RX|---------------###-
**** v1    0.2 CLI RX|
**** v1    0.2 CLI RX|Running VCC-compiler failed, exited with 2
**** v1    0.2 CLI RX|VCL compilation failed
---- v1    0.2 FAIL VCL does not compile
*    top   0.2 RESETTING after ../../../bin/varnishtest/tests/v00025.vtc
**   s1    0.2 Waiting for server (3/-1)
**   v1    0.2 Wait
**** v1    0.2 CLI TX|panic.clear
***  v1    0.2 CLI RX  300
**** v1    0.2 CLI RX|No panic to clear
***  v1    0.2 debug|Info: manager stopping child
***  v1    0.2 debug|Info: manager dies
**** v1    0.2 STDOUT poll 0x10
**   v1    0.2 R 65645 Status: 0000 (u 0.009000 s 0.028000)
***  v1    0.2 vsl|No VSL chunk found (child not started ?)
*    top   0.2 TEST ../../../bin/varnishtest/tests/v00025.vtc FAILED
#    top  TEST ../../../bin/varnishtest/tests/v00025.vtc FAILED (0.250) exit=2

1 @ SunOS i86pc 5.11 1.04 32_sun12.4 uplex

*    top   0.0 TEST ../../../bin/varnishtest/tests/v00025.vtc starting
[...]
*    top   0.0 TEST More VCL coverage
[...]
**** v1    0.2 CLI TX|\t}
**** v1    0.2 CLI TX|
**** v1    0.2 CLI TX|\tsub vcl_backend_fetch {
**** v1    0.2 CLI TX|\t\tif (bereq.between_bytes_timeout < 10s) {
**** v1    0.2 CLI TX|\t\t\tset bereq.http.quick = "please";
**** v1    0.2 CLI TX|\t\t}
**** v1    0.2 CLI TX|\t\tif (bereq.connect_timeout < 10s) {
**** v1    0.2 CLI TX|\t\t\tset bereq.http.hello = "please";
**** v1    0.2 CLI TX|\t\t}
**** v1    0.2 CLI TX|\t\tset bereq.connect_timeout = 10s;
**** v1    0.2 CLI TX|\t}
**** v1    0.2 CLI TX|
**** v1    0.2 CLI TX|
**** v1    0.2 CLI TX|%XJEIFLH|)Xspa8P
***  v1    0.2 CLI RX  106
**** v1    0.2 CLI RX|Message from VCC-compiler:
**** v1    0.2 CLI RX|Security: Privilege proc_setid missing, will not change uid/gid
**** v1    0.2 CLI RX|Could not load VMOD std
**** v1    0.2 CLI RX|\tFile name: /tmp/vtest.32_sun12.4/varnish-cache/varnish-trunk/_build/lib/libvmod_std/.libs/libvmod_std.so
**** v1    0.2 CLI RX|\tdlerror: ld.so.1: varnishd: fatal: relocation error: file /tmp/vtest.32_sun12.4/varnish-cache/varnish-trunk/_build/lib/libvmod_std/.libs/libvmod_std.so: symbol vmod_issyntax: referenced symbol not found
**** v1    0.2 CLI RX|('<vcl.inline>' Line 6 Pos 16)
**** v1    0.2 CLI RX|        import std;
**** v1    0.2 CLI RX|---------------###-
**** v1    0.2 CLI RX|
**** v1    0.2 CLI RX|Running VCC-compiler failed, exited with 2
**** v1    0.2 CLI RX|VCL compilation failed
---- v1    0.2 FAIL VCL does not compile
*    top   0.2 RESETTING after ../../../bin/varnishtest/tests/v00025.vtc
**   s1    0.2 Waiting for server (3/-1)
**   v1    0.2 Wait
**** v1    0.2 CLI TX|panic.clear
***  v1    0.2 CLI RX  300
**** v1    0.2 CLI RX|No panic to clear
***  v1    0.2 debug|Info: manager stopping child
***  v1    0.2 debug|Info: manager dies
**** v1    0.2 STDOUT poll 0x10
**   v1    0.2 R 89496 Status: 0000 (u 0.015000 s 0.046000)
***  v1    0.3 vsl|No VSL chunk found (child not started ?)
*    top   0.3 TEST ../../../bin/varnishtest/tests/v00025.vtc FAILED
#    top  TEST ../../../bin/varnishtest/tests/v00025.vtc FAILED (0.306) exit=2

1 @ SunOS i86pc 5.11 1.04 32_sun12.4 uplex

*    top   0.0 TEST ../../../bin/varnishtest/tests/v00025.vtc starting
[...]
*    top   0.0 TEST More VCL coverage
[...]
**** v1    0.2 CLI TX|\t}
**** v1    0.2 CLI TX|
**** v1    0.2 CLI TX|\tsub vcl_backend_fetch {
**** v1    0.2 CLI TX|\t\tif (bereq.between_bytes_timeout < 10s) {
**** v1    0.2 CLI TX|\t\t\tset bereq.http.quick = "please";
**** v1    0.2 CLI TX|\t\t}
**** v1    0.2 CLI TX|\t\tif (bereq.connect_timeout < 10s) {
**** v1    0.2 CLI TX|\t\t\tset bereq.http.hello = "please";
**** v1    0.2 CLI TX|\t\t}
**** v1    0.2 CLI TX|\t\tset bereq.connect_timeout = 10s;
**** v1    0.2 CLI TX|\t}
**** v1    0.2 CLI TX|
**** v1    0.2 CLI TX|
**** v1    0.2 CLI TX|%XJEIFLH|)Xspa8P
***  v1    0.2 CLI RX  106
**** v1    0.2 CLI RX|Message from VCC-compiler:
**** v1    0.2 CLI RX|Security: Privilege proc_setid missing, will not change uid/gid
**** v1    0.2 CLI RX|Could not load VMOD std
**** v1    0.2 CLI RX|\tFile name: /tmp/vtest.32_sun12.4/varnish-cache/varnish-trunk/_build/lib/libvmod_std/.libs/libvmod_std.so
**** v1    0.2 CLI RX|\tdlerror: ld.so.1: varnishd: fatal: relocation error: file /tmp/vtest.32_sun12.4/varnish-cache/varnish-trunk/_build/lib/libvmod_std/.libs/libvmod_std.so: symbol vmod_issyntax: referenced symbol not found
**** v1    0.2 CLI RX|('<vcl.inline>' Line 6 Pos 16)
**** v1    0.2 CLI RX|        import std;
**** v1    0.2 CLI RX|---------------###-
**** v1    0.2 CLI RX|
**** v1    0.2 CLI RX|Running VCC-compiler failed, exited with 2
**** v1    0.2 CLI RX|VCL compilation failed
---- v1    0.2 FAIL VCL does not compile
*    top   0.2 RESETTING after ../../../bin/varnishtest/tests/v00025.vtc
**   s1    0.2 Waiting for server (3/-1)
**   v1    0.2 Wait
**** v1    0.2 CLI TX|panic.clear
***  v1    0.2 CLI RX  300
**** v1    0.2 CLI RX|No panic to clear
***  v1    0.2 debug|Info: manager stopping child
***  v1    0.2 debug|Info: manager dies
**** v1    0.2 STDOUT poll 0x10
**   v1    0.2 R 96054 Status: 0000 (u 0.012000 s 0.036000)
***  v1    0.3 vsl|No VSL chunk found (child not started ?)
*    top   0.3 TEST ../../../bin/varnishtest/tests/v00025.vtc FAILED
#    top  TEST ../../../bin/varnishtest/tests/v00025.vtc FAILED (0.259) exit=2

1 @ SunOS i86pc 5.11 1.04 64_sun12.4 uplex

*    top   0.0 TEST ../../../bin/varnishtest/tests/v00025.vtc starting
[...]
*    top   0.0 TEST More VCL coverage
[...]
**** v1    0.2 CLI TX|\t}
**** v1    0.2 CLI TX|
**** v1    0.2 CLI TX|\tsub vcl_backend_fetch {
**** v1    0.2 CLI TX|\t\tif (bereq.between_bytes_timeout < 10s) {
**** v1    0.2 CLI TX|\t\t\tset bereq.http.quick = "please";
**** v1    0.2 CLI TX|\t\t}
**** v1    0.2 CLI TX|\t\tif (bereq.connect_timeout < 10s) {
**** v1    0.2 CLI TX|\t\t\tset bereq.http.hello = "please";
**** v1    0.2 CLI TX|\t\t}
**** v1    0.2 CLI TX|\t\tset bereq.connect_timeout = 10s;
**** v1    0.2 CLI TX|\t}
**** v1    0.2 CLI TX|
**** v1    0.2 CLI TX|
**** v1    0.2 CLI TX|%XJEIFLH|)Xspa8P
***  v1    0.2 CLI RX  106
**** v1    0.2 CLI RX|Message from VCC-compiler:
**** v1    0.2 CLI RX|Security: Privilege proc_setid missing, will not change uid/gid
**** v1    0.2 CLI RX|Could not load VMOD std
**** v1    0.2 CLI RX|\tFile name: /tmp/vtest.64_sun12.4/varnish-cache/varnish-trunk/_build/lib/libvmod_std/.libs/libvmod_std.so
**** v1    0.2 CLI RX|\tdlerror: ld.so.1: varnishd: fatal: relocation error: file /tmp/vtest.64_sun12.4/varnish-cache/varnish-trunk/_build/lib/libvmod_std/.libs/libvmod_std.so: symbol vmod_issyntax: referenced symbol not found
**** v1    0.2 CLI RX|('<vcl.inline>' Line 6 Pos 16)
**** v1    0.2 CLI RX|        import std;
**** v1    0.2 CLI RX|---------------###-
**** v1    0.2 CLI RX|
**** v1    0.2 CLI RX|Running VCC-compiler failed, exited with 2
**** v1    0.2 CLI RX|VCL compilation failed
---- v1    0.2 FAIL VCL does not compile
*    top   0.2 RESETTING after ../../../bin/varnishtest/tests/v00025.vtc
**   s1    0.2 Waiting for server (3/-1)
**   v1    0.2 Wait
**** v1    0.2 CLI TX|panic.clear
***  v1    0.2 CLI RX  300
**** v1    0.2 CLI RX|No panic to clear
***  v1    0.2 debug|Info: manager stopping child
***  v1    0.2 debug|Info: manager dies
**** v1    0.2 STDOUT poll 0x10
**   v1    0.2 R 94705 Status: 0000 (u 0.017000 s 0.055000)
***  v1    0.3 vsl|No VSL chunk found (child not started ?)
*    top   0.3 TEST ../../../bin/varnishtest/tests/v00025.vtc FAILED
#    top  TEST ../../../bin/varnishtest/tests/v00025.vtc FAILED (0.283) exit=2

1 @ SunOS i86pc 5.11 1.04 64_sun12.4 uplex

*    top   0.0 TEST ../../../bin/varnishtest/tests/v00025.vtc starting
[...]
*    top   0.0 TEST More VCL coverage
[...]
**** v1    0.1 CLI TX|\t}
**** v1    0.1 CLI TX|
**** v1    0.1 CLI TX|\tsub vcl_backend_fetch {
**** v1    0.1 CLI TX|\t\tif (bereq.between_bytes_timeout < 10s) {
**** v1    0.1 CLI TX|\t\t\tset bereq.http.quick = "please";
**** v1    0.1 CLI TX|\t\t}
**** v1    0.1 CLI TX|\t\tif (bereq.connect_timeout < 10s) {
**** v1    0.1 CLI TX|\t\t\tset bereq.http.hello = "please";
**** v1    0.1 CLI TX|\t\t}
**** v1    0.1 CLI TX|\t\tset bereq.connect_timeout = 10s;
**** v1    0.1 CLI TX|\t}
**** v1    0.1 CLI TX|
**** v1    0.1 CLI TX|
**** v1    0.1 CLI TX|%XJEIFLH|)Xspa8P
***  v1    0.2 CLI RX  106
**** v1    0.2 CLI RX|Message from VCC-compiler:
**** v1    0.2 CLI RX|Security: Privilege proc_setid missing, will not change uid/gid
**** v1    0.2 CLI RX|Could not load VMOD std
**** v1    0.2 CLI RX|\tFile name: /tmp/vtest.64_sun12.4/varnish-cache/varnish-trunk/_build/lib/libvmod_std/.libs/libvmod_std.so
**** v1    0.2 CLI RX|\tdlerror: ld.so.1: varnishd: fatal: relocation error: file /tmp/vtest.64_sun12.4/varnish-cache/varnish-trunk/_build/lib/libvmod_std/.libs/libvmod_std.so: symbol vmod_issyntax: referenced symbol not found
**** v1    0.2 CLI RX|('<vcl.inline>' Line 6 Pos 16)
**** v1    0.2 CLI RX|        import std;
**** v1    0.2 CLI RX|---------------###-
**** v1    0.2 CLI RX|
**** v1    0.2 CLI RX|Running VCC-compiler failed, exited with 2
**** v1    0.2 CLI RX|VCL compilation failed
---- v1    0.2 FAIL VCL does not compile
*    top   0.2 RESETTING after ../../../bin/varnishtest/tests/v00025.vtc
**   s1    0.2 Waiting for server (3/-1)
**   v1    0.2 Wait
**** v1    0.2 CLI TX|panic.clear
***  v1    0.2 CLI RX  300
**** v1    0.2 CLI RX|No panic to clear
***  v1    0.2 debug|Info: manager stopping child
***  v1    0.2 debug|Info: manager dies
**** v1    0.2 STDOUT poll 0x10
**   v1    0.2 R 83897 Status: 0000 (u 0.009000 s 0.029000)
***  v1    0.2 vsl|No VSL chunk found (child not started ?)
*    top   0.2 TEST ../../../bin/varnishtest/tests/v00025.vtc FAILED
#    top  TEST ../../../bin/varnishtest/tests/v00025.vtc FAILED (0.251) exit=2