v00031

8bbbdfa

1 @ SunOS 5.11 i86pc 1.04 32_sun12.4 uplex

*    top   0.0 TEST ../../../bin/varnishtest/tests/v00031.vtc starting
[...]
*    top   0.0 TEST param vcc_err_unref
[...]
***  v1    0.2 CLI RX  200
**   v1    0.2 CLI 200 <param.set vcc_err_unref true>
**   top   0.2 === varnish v1 -errvcl {Unused backend c, defined:} {
**** v1    0.2 CLI TX|vcl.inline vcl3 << %XJEIFLH|)Xspa8P
**** v1    0.2 CLI TX|vcl 4.0;
**** v1    0.2 CLI TX|
**** v1    0.2 CLI TX|\tbackend b { .host = "127.0.0.1"; }
**** v1    0.2 CLI TX|\tbackend c { .host = "127.0.0.1"; }
**** v1    0.2 CLI TX|
**** v1    0.2 CLI TX|%XJEIFLH|)Xspa8P
***  v1    0.2 CLI RX  106
**** v1    0.2 CLI RX|Message from VCC-compiler:
**** v1    0.2 CLI RX|Security: Privilege proc_setid missing, will not change uid/gid
**** v1    0.2 CLI RX|Unused backend c, defined:
**** v1    0.2 CLI RX|('<vcl.inline>' Line 4 Pos 17)
**** v1    0.2 CLI RX|        backend c { .host = "127.0.0.1"; }
**** v1    0.2 CLI RX|----------------#-------------------------
**** v1    0.2 CLI RX|
**** v1    0.2 CLI RX|Running VCC-compiler failed, exited with 2
**** v1    0.2 CLI RX|VCL compilation failed
**   v1    0.2 VCL compilation failed (as expected)
***  v1    0.2 Found expected string: ("Unused backend c, defined:")
*    top   0.2 RESETTING after ../../../bin/varnishtest/tests/v00031.vtc
**   v1    0.2 Wait
**** v1    0.2 CLI TX|backend.list
***  v1    0.2 CLI RX  101
**** v1    0.2 CLI RX|Unknown request in manager process (child not running).
**** v1    0.2 CLI RX|Type 'help' for more info.
**   v1    0.2 Stop
**** v1    0.2 CLI TX|stop
***  v1    0.2 CLI RX  300
**** v1    0.2 CLI RX|Child in state stopped
**** v1    0.2 CLI TX|status
***  v1    0.2 CLI RX  200
**** v1    0.2 CLI RX|Child in state stopped
**** v1    0.2 STDOUT poll 0x10
**   v1    0.2 R 62246 Status: 0000 (u 0.038000 s 0.049000)
*    diag  0.0 ............................................................
#    top  TEST ../../../bin/varnishtest/tests/v00031.vtc TIMED OUT (kill -9)
#    top  TEST ../../../bin/varnishtest/tests/v00031.vtc FAILED (60.002) signal=9

1 @ SunOS 5.11 i86pc 1.04 64_sun12.4 uplex

*    top   0.0 TEST ../../../bin/varnishtest/tests/v00031.vtc starting
[...]
*    top   0.0 TEST param vcc_err_unref
[...]
***  v1    0.2 CLI RX  200
**   v1    0.2 CLI 200 <param.set vcc_err_unref true>
**   top   0.2 === varnish v1 -errvcl {Unused backend c, defined:} {
**** v1    0.2 CLI TX|vcl.inline vcl3 << %XJEIFLH|)Xspa8P
**** v1    0.2 CLI TX|vcl 4.0;
**** v1    0.2 CLI TX|
**** v1    0.2 CLI TX|\tbackend b { .host = "127.0.0.1"; }
**** v1    0.2 CLI TX|\tbackend c { .host = "127.0.0.1"; }
**** v1    0.2 CLI TX|
**** v1    0.2 CLI TX|%XJEIFLH|)Xspa8P
***  v1    0.2 CLI RX  106
**** v1    0.2 CLI RX|Message from VCC-compiler:
**** v1    0.2 CLI RX|Security: Privilege proc_setid missing, will not change uid/gid
**** v1    0.2 CLI RX|Unused backend c, defined:
**** v1    0.2 CLI RX|('<vcl.inline>' Line 4 Pos 17)
**** v1    0.2 CLI RX|        backend c { .host = "127.0.0.1"; }
**** v1    0.2 CLI RX|----------------#-------------------------
**** v1    0.2 CLI RX|
**** v1    0.2 CLI RX|Running VCC-compiler failed, exited with 2
**** v1    0.2 CLI RX|VCL compilation failed
**   v1    0.2 VCL compilation failed (as expected)
***  v1    0.2 Found expected string: ("Unused backend c, defined:")
*    top   0.2 RESETTING after ../../../bin/varnishtest/tests/v00031.vtc
**   v1    0.2 Wait
**** v1    0.2 CLI TX|backend.list
***  v1    0.2 CLI RX  101
**** v1    0.2 CLI RX|Unknown request in manager process (child not running).
**** v1    0.2 CLI RX|Type 'help' for more info.
**   v1    0.2 Stop
**** v1    0.2 CLI TX|stop
***  v1    0.2 CLI RX  300
**** v1    0.2 CLI RX|Child in state stopped
**** v1    0.2 CLI TX|status
***  v1    0.2 CLI RX  200
**** v1    0.2 CLI RX|Child in state stopped
**** v1    0.2 STDOUT poll 0x10
**   v1    0.2 R 33865 Status: 0000 (u 0.062000 s 0.093000)
*    diag  0.0 ............................................................
#    top  TEST ../../../bin/varnishtest/tests/v00031.vtc TIMED OUT (kill -9)
#    top  TEST ../../../bin/varnishtest/tests/v00031.vtc FAILED (60.004) signal=9

1 @ SunOS 5.11 i86pc 1.04 32_sun12.4 uplex

*    top   0.0 TEST ../../../bin/varnishtest/tests/v00031.vtc starting
[...]
*    top   0.0 TEST param vcc_err_unref
[...]
***  v1    0.2 CLI RX  200
**   v1    0.2 CLI 200 <param.set vcc_err_unref true>
**   top   0.2 === varnish v1 -errvcl {Unused backend c, defined:} {
**** v1    0.2 CLI TX|vcl.inline vcl3 << %XJEIFLH|)Xspa8P
**** v1    0.2 CLI TX|vcl 4.0;
**** v1    0.2 CLI TX|
**** v1    0.2 CLI TX|\tbackend b { .host = "127.0.0.1"; }
**** v1    0.2 CLI TX|\tbackend c { .host = "127.0.0.1"; }
**** v1    0.2 CLI TX|
**** v1    0.2 CLI TX|%XJEIFLH|)Xspa8P
***  v1    0.2 CLI RX  106
**** v1    0.2 CLI RX|Message from VCC-compiler:
**** v1    0.2 CLI RX|Security: Privilege proc_setid missing, will not change uid/gid
**** v1    0.2 CLI RX|Unused backend c, defined:
**** v1    0.2 CLI RX|('<vcl.inline>' Line 4 Pos 17)
**** v1    0.2 CLI RX|        backend c { .host = "127.0.0.1"; }
**** v1    0.2 CLI RX|----------------#-------------------------
**** v1    0.2 CLI RX|
**** v1    0.2 CLI RX|Running VCC-compiler failed, exited with 2
**** v1    0.2 CLI RX|VCL compilation failed
**   v1    0.2 VCL compilation failed (as expected)
***  v1    0.2 Found expected string: ("Unused backend c, defined:")
*    top   0.2 RESETTING after ../../../bin/varnishtest/tests/v00031.vtc
**   v1    0.2 Wait
**** v1    0.2 CLI TX|backend.list
***  v1    0.2 CLI RX  101
**** v1    0.2 CLI RX|Unknown request in manager process (child not running).
**** v1    0.2 CLI RX|Type 'help' for more info.
**   v1    0.2 Stop
**** v1    0.2 CLI TX|stop
***  v1    0.2 CLI RX  300
**** v1    0.2 CLI RX|Child in state stopped
**** v1    0.2 CLI TX|status
***  v1    0.2 CLI RX  200
**** v1    0.2 CLI RX|Child in state stopped
**** v1    0.2 STDOUT poll 0x10
**   v1    0.2 R 36357 Status: 0000 (u 0.056000 s 0.076000)
*    diag  0.0 ............................................................
#    top  TEST ../../../bin/varnishtest/tests/v00031.vtc TIMED OUT (kill -9)
#    top  TEST ../../../bin/varnishtest/tests/v00031.vtc FAILED (60.003) signal=9

1 @ SunOS 5.11 i86pc 1.04 32_gcc4.7 uplex

*    top   0.0 TEST ../../../bin/varnishtest/tests/v00031.vtc starting
[...]
*    top   0.0 TEST param vcc_err_unref
[...]
***  v1    0.2 CLI RX  200
**   v1    0.2 CLI 200 <param.set vcc_err_unref true>
**   top   0.2 === varnish v1 -errvcl {Unused backend c, defined:} {
**** v1    0.2 CLI TX|vcl.inline vcl3 << %XJEIFLH|)Xspa8P
**** v1    0.2 CLI TX|vcl 4.0;
**** v1    0.2 CLI TX|
**** v1    0.2 CLI TX|\tbackend b { .host = "127.0.0.1"; }
**** v1    0.2 CLI TX|\tbackend c { .host = "127.0.0.1"; }
**** v1    0.2 CLI TX|
**** v1    0.2 CLI TX|%XJEIFLH|)Xspa8P
***  v1    0.3 CLI RX  106
**** v1    0.3 CLI RX|Message from VCC-compiler:
**** v1    0.3 CLI RX|Security: Privilege proc_setid missing, will not change uid/gid
**** v1    0.3 CLI RX|Unused backend c, defined:
**** v1    0.3 CLI RX|('<vcl.inline>' Line 4 Pos 17)
**** v1    0.3 CLI RX|        backend c { .host = "127.0.0.1"; }
**** v1    0.3 CLI RX|----------------#-------------------------
**** v1    0.3 CLI RX|
**** v1    0.3 CLI RX|Running VCC-compiler failed, exited with 2
**** v1    0.3 CLI RX|VCL compilation failed
**   v1    0.3 VCL compilation failed (as expected)
***  v1    0.3 Found expected string: ("Unused backend c, defined:")
*    top   0.3 RESETTING after ../../../bin/varnishtest/tests/v00031.vtc
**   v1    0.3 Wait
**** v1    0.3 CLI TX|backend.list
***  v1    0.3 CLI RX  101
**** v1    0.3 CLI RX|Unknown request in manager process (child not running).
**** v1    0.3 CLI RX|Type 'help' for more info.
**   v1    0.3 Stop
**** v1    0.3 CLI TX|stop
***  v1    0.3 CLI RX  300
**** v1    0.3 CLI RX|Child in state stopped
**** v1    0.3 CLI TX|status
***  v1    0.3 CLI RX  200
**** v1    0.3 CLI RX|Child in state stopped
**** v1    0.3 STDOUT poll 0x10
**   v1    0.3 R 14675 Status: 0000 (u 0.065000 s 0.060000)
*    diag  0.0 ............................................................
#    top  TEST ../../../bin/varnishtest/tests/v00031.vtc TIMED OUT (kill -9)
#    top  TEST ../../../bin/varnishtest/tests/v00031.vtc FAILED (60.002) signal=9

1 @ SunOS 5.11 i86pc 1.04 32_sun12.4 uplex

*    top   0.0 TEST ../../../bin/varnishtest/tests/v00031.vtc starting
[...]
*    top   0.0 TEST param vcc_err_unref
[...]
***  v1    0.2 CLI RX  200
**   v1    0.2 CLI 200 <param.set vcc_err_unref true>
**   top   0.2 === varnish v1 -errvcl {Unused backend c, defined:} {
**** v1    0.2 CLI TX|vcl.inline vcl3 << %XJEIFLH|)Xspa8P
**** v1    0.2 CLI TX|vcl 4.0;
**** v1    0.2 CLI TX|
**** v1    0.2 CLI TX|\tbackend b { .host = "127.0.0.1"; }
**** v1    0.2 CLI TX|\tbackend c { .host = "127.0.0.1"; }
**** v1    0.2 CLI TX|
**** v1    0.2 CLI TX|%XJEIFLH|)Xspa8P
***  v1    0.2 CLI RX  106
**** v1    0.2 CLI RX|Message from VCC-compiler:
**** v1    0.2 CLI RX|Security: Privilege proc_setid missing, will not change uid/gid
**** v1    0.2 CLI RX|Unused backend c, defined:
**** v1    0.2 CLI RX|('<vcl.inline>' Line 4 Pos 17)
**** v1    0.2 CLI RX|        backend c { .host = "127.0.0.1"; }
**** v1    0.2 CLI RX|----------------#-------------------------
**** v1    0.2 CLI RX|
**** v1    0.2 CLI RX|Running VCC-compiler failed, exited with 2
**** v1    0.2 CLI RX|VCL compilation failed
**   v1    0.2 VCL compilation failed (as expected)
***  v1    0.2 Found expected string: ("Unused backend c, defined:")
*    top   0.2 RESETTING after ../../../bin/varnishtest/tests/v00031.vtc
**   v1    0.2 Wait
**** v1    0.2 CLI TX|backend.list
***  v1    0.2 CLI RX  101
**** v1    0.2 CLI RX|Unknown request in manager process (child not running).
**** v1    0.2 CLI RX|Type 'help' for more info.
**   v1    0.2 Stop
**** v1    0.2 CLI TX|stop
***  v1    0.2 CLI RX  300
**** v1    0.2 CLI RX|Child in state stopped
**** v1    0.2 CLI TX|status
***  v1    0.2 CLI RX  200
**** v1    0.2 CLI RX|Child in state stopped
**** v1    0.2 STDOUT poll 0x10
**   v1    0.2 R 18680 Status: 0000 (u 0.057000 s 0.071000)
*    diag  0.0 ............................................................
#    top  TEST ../../../bin/varnishtest/tests/v00031.vtc TIMED OUT (kill -9)
#    top  TEST ../../../bin/varnishtest/tests/v00031.vtc FAILED (60.002) signal=9

1 @ SunOS 5.11 i86pc 1.04 32_sun12.4 uplex

*    top   0.0 TEST ../../../bin/varnishtest/tests/v00031.vtc starting
[...]
*    top   0.0 TEST param vcc_err_unref
[...]
***  v1    0.2 CLI RX  200
**   v1    0.2 CLI 200 <param.set vcc_err_unref true>
**   top   0.2 === varnish v1 -errvcl {Unused backend c, defined:} {
**** v1    0.2 CLI TX|vcl.inline vcl3 << %XJEIFLH|)Xspa8P
**** v1    0.2 CLI TX|vcl 4.0;
**** v1    0.2 CLI TX|
**** v1    0.2 CLI TX|\tbackend b { .host = "127.0.0.1"; }
**** v1    0.2 CLI TX|\tbackend c { .host = "127.0.0.1"; }
**** v1    0.2 CLI TX|
**** v1    0.2 CLI TX|%XJEIFLH|)Xspa8P
***  v1    0.2 CLI RX  106
**** v1    0.2 CLI RX|Message from VCC-compiler:
**** v1    0.2 CLI RX|Security: Privilege proc_setid missing, will not change uid/gid
**** v1    0.2 CLI RX|Unused backend c, defined:
**** v1    0.2 CLI RX|('<vcl.inline>' Line 4 Pos 17)
**** v1    0.2 CLI RX|        backend c { .host = "127.0.0.1"; }
**** v1    0.2 CLI RX|----------------#-------------------------
**** v1    0.2 CLI RX|
**** v1    0.2 CLI RX|Running VCC-compiler failed, exited with 2
**** v1    0.2 CLI RX|VCL compilation failed
**   v1    0.2 VCL compilation failed (as expected)
***  v1    0.2 Found expected string: ("Unused backend c, defined:")
*    top   0.2 RESETTING after ../../../bin/varnishtest/tests/v00031.vtc
**   v1    0.2 Wait
**** v1    0.2 CLI TX|backend.list
***  v1    0.2 CLI RX  101
**** v1    0.2 CLI RX|Unknown request in manager process (child not running).
**** v1    0.2 CLI RX|Type 'help' for more info.
**   v1    0.2 Stop
**** v1    0.2 CLI TX|stop
***  v1    0.2 CLI RX  300
**** v1    0.2 CLI RX|Child in state stopped
**** v1    0.2 CLI TX|status
***  v1    0.2 CLI RX  200
**** v1    0.2 CLI RX|Child in state stopped
**** v1    0.2 STDOUT poll 0x10
**   v1    0.2 R 22626 Status: 0000 (u 0.056000 s 0.074000)
*    diag  0.0 ............................................................
#    top  TEST ../../../bin/varnishtest/tests/v00031.vtc TIMED OUT (kill -9)
#    top  TEST ../../../bin/varnishtest/tests/v00031.vtc FAILED (60.002) signal=9

1 @ SunOS 5.11 i86pc 1.04 64_sun12.4 uplex

*    top   0.0 TEST ../../../bin/varnishtest/tests/v00031.vtc starting
[...]
*    top   0.0 TEST param vcc_err_unref
[...]
***  v1    0.2 CLI RX  200
**   v1    0.2 CLI 200 <param.set vcc_err_unref true>
**   top   0.2 === varnish v1 -errvcl {Unused backend c, defined:} {
**** v1    0.2 CLI TX|vcl.inline vcl3 << %XJEIFLH|)Xspa8P
**** v1    0.2 CLI TX|vcl 4.0;
**** v1    0.2 CLI TX|
**** v1    0.2 CLI TX|\tbackend b { .host = "127.0.0.1"; }
**** v1    0.2 CLI TX|\tbackend c { .host = "127.0.0.1"; }
**** v1    0.2 CLI TX|
**** v1    0.2 CLI TX|%XJEIFLH|)Xspa8P
***  v1    0.2 CLI RX  106
**** v1    0.2 CLI RX|Message from VCC-compiler:
**** v1    0.2 CLI RX|Security: Privilege proc_setid missing, will not change uid/gid
**** v1    0.2 CLI RX|Unused backend c, defined:
**** v1    0.2 CLI RX|('<vcl.inline>' Line 4 Pos 17)
**** v1    0.2 CLI RX|        backend c { .host = "127.0.0.1"; }
**** v1    0.2 CLI RX|----------------#-------------------------
**** v1    0.2 CLI RX|
**** v1    0.2 CLI RX|Running VCC-compiler failed, exited with 2
**** v1    0.2 CLI RX|VCL compilation failed
**   v1    0.2 VCL compilation failed (as expected)
***  v1    0.2 Found expected string: ("Unused backend c, defined:")
*    top   0.2 RESETTING after ../../../bin/varnishtest/tests/v00031.vtc
**   v1    0.2 Wait
**** v1    0.2 CLI TX|backend.list
***  v1    0.2 CLI RX  101
**** v1    0.2 CLI RX|Unknown request in manager process (child not running).
**** v1    0.2 CLI RX|Type 'help' for more info.
**   v1    0.2 Stop
**** v1    0.2 CLI TX|stop
***  v1    0.2 CLI RX  300
**** v1    0.2 CLI RX|Child in state stopped
**** v1    0.2 CLI TX|status
***  v1    0.2 CLI RX  200
**** v1    0.2 CLI RX|Child in state stopped
**** v1    0.2 STDOUT poll 0x10
**   v1    0.2 R 40705 Status: 0000 (u 0.060000 s 0.091000)
*    diag  0.0 ............................................................
#    top  TEST ../../../bin/varnishtest/tests/v00031.vtc TIMED OUT (kill -9)
#    top  TEST ../../../bin/varnishtest/tests/v00031.vtc FAILED (60.004) signal=9

1 @ SunOS 5.11 i86pc 1.04 64_sun12.4 uplex

*    top   0.0 TEST ../../../bin/varnishtest/tests/v00031.vtc starting
[...]
*    top   0.0 TEST param vcc_err_unref
[...]
***  v1    0.2 CLI RX  200
**   v1    0.2 CLI 200 <param.set vcc_err_unref true>
**   top   0.2 === varnish v1 -errvcl {Unused backend c, defined:} {
**** v1    0.2 CLI TX|vcl.inline vcl3 << %XJEIFLH|)Xspa8P
**** v1    0.2 CLI TX|vcl 4.0;
**** v1    0.2 CLI TX|
**** v1    0.2 CLI TX|\tbackend b { .host = "127.0.0.1"; }
**** v1    0.2 CLI TX|\tbackend c { .host = "127.0.0.1"; }
**** v1    0.2 CLI TX|
**** v1    0.2 CLI TX|%XJEIFLH|)Xspa8P
***  v1    0.2 CLI RX  106
**** v1    0.2 CLI RX|Message from VCC-compiler:
**** v1    0.2 CLI RX|Security: Privilege proc_setid missing, will not change uid/gid
**** v1    0.2 CLI RX|Unused backend c, defined:
**** v1    0.2 CLI RX|('<vcl.inline>' Line 4 Pos 17)
**** v1    0.2 CLI RX|        backend c { .host = "127.0.0.1"; }
**** v1    0.2 CLI RX|----------------#-------------------------
**** v1    0.2 CLI RX|
**** v1    0.2 CLI RX|Running VCC-compiler failed, exited with 2
**** v1    0.2 CLI RX|VCL compilation failed
**   v1    0.2 VCL compilation failed (as expected)
***  v1    0.2 Found expected string: ("Unused backend c, defined:")
*    top   0.2 RESETTING after ../../../bin/varnishtest/tests/v00031.vtc
**   v1    0.2 Wait
**** v1    0.2 CLI TX|backend.list
***  v1    0.2 CLI RX  101
**** v1    0.2 CLI RX|Unknown request in manager process (child not running).
**** v1    0.2 CLI RX|Type 'help' for more info.
**   v1    0.2 Stop
**** v1    0.2 CLI TX|stop
***  v1    0.2 CLI RX  300
**** v1    0.2 CLI RX|Child in state stopped
**** v1    0.2 CLI TX|status
***  v1    0.2 CLI RX  200
**** v1    0.2 CLI RX|Child in state stopped
**** v1    0.2 STDOUT poll 0x10
**   v1    0.2 R 31420 Status: 0000 (u 0.061000 s 0.091000)
*    diag  0.0 ............................................................
#    top  TEST ../../../bin/varnishtest/tests/v00031.vtc TIMED OUT (kill -9)
#    top  TEST ../../../bin/varnishtest/tests/v00031.vtc FAILED (60.004) signal=9

1 @ SunOS 5.11 i86pc 1.04 64_sun12.4 uplex

*    top   0.0 TEST ../../../bin/varnishtest/tests/v00031.vtc starting
[...]
*    top   0.0 TEST param vcc_err_unref
[...]
***  v1    0.2 CLI RX  200
**   v1    0.2 CLI 200 <param.set vcc_err_unref true>
**   top   0.2 === varnish v1 -errvcl {Unused backend c, defined:} {
**** v1    0.2 CLI TX|vcl.inline vcl3 << %XJEIFLH|)Xspa8P
**** v1    0.2 CLI TX|vcl 4.0;
**** v1    0.2 CLI TX|
**** v1    0.2 CLI TX|\tbackend b { .host = "127.0.0.1"; }
**** v1    0.2 CLI TX|\tbackend c { .host = "127.0.0.1"; }
**** v1    0.2 CLI TX|
**** v1    0.2 CLI TX|%XJEIFLH|)Xspa8P
***  v1    0.2 CLI RX  106
**** v1    0.2 CLI RX|Message from VCC-compiler:
**** v1    0.2 CLI RX|Security: Privilege proc_setid missing, will not change uid/gid
**** v1    0.2 CLI RX|Unused backend c, defined:
**** v1    0.2 CLI RX|('<vcl.inline>' Line 4 Pos 17)
**** v1    0.2 CLI RX|        backend c { .host = "127.0.0.1"; }
**** v1    0.2 CLI RX|----------------#-------------------------
**** v1    0.2 CLI RX|
**** v1    0.2 CLI RX|Running VCC-compiler failed, exited with 2
**** v1    0.2 CLI RX|VCL compilation failed
**   v1    0.2 VCL compilation failed (as expected)
***  v1    0.2 Found expected string: ("Unused backend c, defined:")
*    top   0.2 RESETTING after ../../../bin/varnishtest/tests/v00031.vtc
**   v1    0.2 Wait
**** v1    0.2 CLI TX|backend.list
***  v1    0.2 CLI RX  101
**** v1    0.2 CLI RX|Unknown request in manager process (child not running).
**** v1    0.2 CLI RX|Type 'help' for more info.
**   v1    0.2 Stop
**** v1    0.2 CLI TX|stop
***  v1    0.2 CLI RX  300
**** v1    0.2 CLI RX|Child in state stopped
**** v1    0.2 CLI TX|status
***  v1    0.2 CLI RX  200
**** v1    0.2 CLI RX|Child in state stopped
**** v1    0.2 STDOUT poll 0x10
**   v1    0.2 R 1987 Status: 0000 (u 0.060000 s 0.090000)
*    diag  0.0 ............................................................
#    top  TEST ../../../bin/varnishtest/tests/v00031.vtc TIMED OUT (kill -9)
#    top  TEST ../../../bin/varnishtest/tests/v00031.vtc FAILED (60.004) signal=9

1 @ SunOS 5.11 i86pc 1.04 64_sun12.4 uplex

*    top   0.0 TEST ../../../bin/varnishtest/tests/v00031.vtc starting
[...]
*    top   0.0 TEST param vcc_err_unref
[...]
***  v1    0.2 CLI RX  200
**   v1    0.2 CLI 200 <param.set vcc_err_unref true>
**   top   0.2 === varnish v1 -errvcl {Unused backend c, defined:} {
**** v1    0.2 CLI TX|vcl.inline vcl3 << %XJEIFLH|)Xspa8P
**** v1    0.2 CLI TX|vcl 4.0;
**** v1    0.2 CLI TX|
**** v1    0.2 CLI TX|\tbackend b { .host = "127.0.0.1"; }
**** v1    0.2 CLI TX|\tbackend c { .host = "127.0.0.1"; }
**** v1    0.2 CLI TX|
**** v1    0.2 CLI TX|%XJEIFLH|)Xspa8P
***  v1    0.2 CLI RX  106
**** v1    0.2 CLI RX|Message from VCC-compiler:
**** v1    0.2 CLI RX|Security: Privilege proc_setid missing, will not change uid/gid
**** v1    0.2 CLI RX|Unused backend c, defined:
**** v1    0.2 CLI RX|('<vcl.inline>' Line 4 Pos 17)
**** v1    0.2 CLI RX|        backend c { .host = "127.0.0.1"; }
**** v1    0.2 CLI RX|----------------#-------------------------
**** v1    0.2 CLI RX|
**** v1    0.2 CLI RX|Running VCC-compiler failed, exited with 2
**** v1    0.2 CLI RX|VCL compilation failed
**   v1    0.2 VCL compilation failed (as expected)
***  v1    0.2 Found expected string: ("Unused backend c, defined:")
*    top   0.2 RESETTING after ../../../bin/varnishtest/tests/v00031.vtc
**   v1    0.2 Wait
**** v1    0.2 CLI TX|backend.list
***  v1    0.2 CLI RX  101
**** v1    0.2 CLI RX|Unknown request in manager process (child not running).
**** v1    0.2 CLI RX|Type 'help' for more info.
**   v1    0.2 Stop
**** v1    0.2 CLI TX|stop
***  v1    0.2 CLI RX  300
**** v1    0.2 CLI RX|Child in state stopped
**** v1    0.2 CLI TX|status
***  v1    0.2 CLI RX  200
**** v1    0.2 CLI RX|Child in state stopped
**** v1    0.2 STDOUT poll 0x10
**   v1    0.3 R 99397 Status: 0000 (u 0.078000 s 0.109000)
*    diag  0.0 ............................................................
#    top  TEST ../../../bin/varnishtest/tests/v00031.vtc TIMED OUT (kill -9)
#    top  TEST ../../../bin/varnishtest/tests/v00031.vtc FAILED (60.004) signal=9

1 @ SunOS 5.11 i86pc 1.04 32_gcc4.7 uplex

*    top   0.0 TEST ../../../bin/varnishtest/tests/v00031.vtc starting
[...]
*    top   0.0 TEST param vcc_err_unref
[...]
***  v1    0.3 CLI RX  200
**   v1    0.3 CLI 200 <param.set vcc_err_unref true>
**   top   0.3 === varnish v1 -errvcl {Unused backend c, defined:} {
**** v1    0.3 CLI TX|vcl.inline vcl3 << %XJEIFLH|)Xspa8P
**** v1    0.3 CLI TX|vcl 4.0;
**** v1    0.3 CLI TX|
**** v1    0.3 CLI TX|\tbackend b { .host = "127.0.0.1"; }
**** v1    0.3 CLI TX|\tbackend c { .host = "127.0.0.1"; }
**** v1    0.3 CLI TX|
**** v1    0.3 CLI TX|%XJEIFLH|)Xspa8P
***  v1    0.3 CLI RX  106
**** v1    0.3 CLI RX|Message from VCC-compiler:
**** v1    0.3 CLI RX|Security: Privilege proc_setid missing, will not change uid/gid
**** v1    0.3 CLI RX|Unused backend c, defined:
**** v1    0.3 CLI RX|('<vcl.inline>' Line 4 Pos 17)
**** v1    0.3 CLI RX|        backend c { .host = "127.0.0.1"; }
**** v1    0.3 CLI RX|----------------#-------------------------
**** v1    0.3 CLI RX|
**** v1    0.3 CLI RX|Running VCC-compiler failed, exited with 2
**** v1    0.3 CLI RX|VCL compilation failed
**   v1    0.3 VCL compilation failed (as expected)
***  v1    0.3 Found expected string: ("Unused backend c, defined:")
*    top   0.3 RESETTING after ../../../bin/varnishtest/tests/v00031.vtc
**   v1    0.3 Wait
**** v1    0.3 CLI TX|backend.list
***  v1    0.3 CLI RX  101
**** v1    0.3 CLI RX|Unknown request in manager process (child not running).
**** v1    0.3 CLI RX|Type 'help' for more info.
**   v1    0.3 Stop
**** v1    0.3 CLI TX|stop
***  v1    0.3 CLI RX  300
**** v1    0.3 CLI RX|Child in state stopped
**** v1    0.3 CLI TX|status
***  v1    0.3 CLI RX  200
**** v1    0.3 CLI RX|Child in state stopped
**** v1    0.3 STDOUT poll 0x10
**   v1    0.3 R 88517 Status: 0000 (u 0.064000 s 0.064000)
*    diag  0.0 ............................................................
#    top  TEST ../../../bin/varnishtest/tests/v00031.vtc TIMED OUT (kill -9)
#    top  TEST ../../../bin/varnishtest/tests/v00031.vtc FAILED (60.002) signal=9

1 @ SunOS 5.11 i86pc 1.04 32_sun12.4 uplex

*    top   0.0 TEST ../../../bin/varnishtest/tests/v00031.vtc starting
[...]
*    top   0.0 TEST param vcc_err_unref
[...]
***  v1    0.2 CLI RX  200
**   v1    0.2 CLI 200 <param.set vcc_err_unref true>
**   top   0.2 === varnish v1 -errvcl {Unused backend c, defined:} {
**** v1    0.2 CLI TX|vcl.inline vcl3 << %XJEIFLH|)Xspa8P
**** v1    0.2 CLI TX|vcl 4.0;
**** v1    0.2 CLI TX|
**** v1    0.2 CLI TX|\tbackend b { .host = "127.0.0.1"; }
**** v1    0.2 CLI TX|\tbackend c { .host = "127.0.0.1"; }
**** v1    0.2 CLI TX|
**** v1    0.2 CLI TX|%XJEIFLH|)Xspa8P
***  v1    0.2 CLI RX  106
**** v1    0.2 CLI RX|Message from VCC-compiler:
**** v1    0.2 CLI RX|Security: Privilege proc_setid missing, will not change uid/gid
**** v1    0.2 CLI RX|Unused backend c, defined:
**** v1    0.2 CLI RX|('<vcl.inline>' Line 4 Pos 17)
**** v1    0.2 CLI RX|        backend c { .host = "127.0.0.1"; }
**** v1    0.2 CLI RX|----------------#-------------------------
**** v1    0.2 CLI RX|
**** v1    0.2 CLI RX|Running VCC-compiler failed, exited with 2
**** v1    0.2 CLI RX|VCL compilation failed
**   v1    0.2 VCL compilation failed (as expected)
***  v1    0.2 Found expected string: ("Unused backend c, defined:")
*    top   0.2 RESETTING after ../../../bin/varnishtest/tests/v00031.vtc
**   v1    0.2 Wait
**** v1    0.2 CLI TX|backend.list
***  v1    0.2 CLI RX  101
**** v1    0.2 CLI RX|Unknown request in manager process (child not running).
**** v1    0.2 CLI RX|Type 'help' for more info.
**   v1    0.2 Stop
**** v1    0.2 CLI TX|stop
***  v1    0.2 CLI RX  300
**** v1    0.2 CLI RX|Child in state stopped
**** v1    0.2 CLI TX|status
***  v1    0.2 CLI RX  200
**** v1    0.2 CLI RX|Child in state stopped
**** v1    0.2 STDOUT poll 0x10
**   v1    0.2 R 79302 Status: 0000 (u 0.058000 s 0.076000)
*    diag  0.0 ............................................................
#    top  TEST ../../../bin/varnishtest/tests/v00031.vtc TIMED OUT (kill -9)
#    top  TEST ../../../bin/varnishtest/tests/v00031.vtc FAILED (60.002) signal=9

1 @ SunOS 5.11 i86pc 1.04 32_sun12.4 uplex

*    top   0.0 TEST ../../../bin/varnishtest/tests/v00031.vtc starting
[...]
*    top   0.0 TEST param vcc_err_unref
[...]
***  v1    0.2 CLI RX  200
**   v1    0.2 CLI 200 <param.set vcc_err_unref true>
**   top   0.2 === varnish v1 -errvcl {Unused backend c, defined:} {
**** v1    0.2 CLI TX|vcl.inline vcl3 << %XJEIFLH|)Xspa8P
**** v1    0.2 CLI TX|vcl 4.0;
**** v1    0.2 CLI TX|
**** v1    0.2 CLI TX|\tbackend b { .host = "127.0.0.1"; }
**** v1    0.2 CLI TX|\tbackend c { .host = "127.0.0.1"; }
**** v1    0.2 CLI TX|
**** v1    0.2 CLI TX|%XJEIFLH|)Xspa8P
***  v1    0.2 CLI RX  106
**** v1    0.2 CLI RX|Message from VCC-compiler:
**** v1    0.2 CLI RX|Security: Privilege proc_setid missing, will not change uid/gid
**** v1    0.2 CLI RX|Unused backend c, defined:
**** v1    0.2 CLI RX|('<vcl.inline>' Line 4 Pos 17)
**** v1    0.2 CLI RX|        backend c { .host = "127.0.0.1"; }
**** v1    0.2 CLI RX|----------------#-------------------------
**** v1    0.2 CLI RX|
**** v1    0.2 CLI RX|Running VCC-compiler failed, exited with 2
**** v1    0.2 CLI RX|VCL compilation failed
**   v1    0.2 VCL compilation failed (as expected)
***  v1    0.2 Found expected string: ("Unused backend c, defined:")
*    top   0.2 RESETTING after ../../../bin/varnishtest/tests/v00031.vtc
**   v1    0.2 Wait
**** v1    0.2 CLI TX|backend.list
***  v1    0.2 CLI RX  101
**** v1    0.2 CLI RX|Unknown request in manager process (child not running).
**** v1    0.2 CLI RX|Type 'help' for more info.
**   v1    0.2 Stop
**** v1    0.2 CLI TX|stop
***  v1    0.2 CLI RX  300
**** v1    0.2 CLI RX|Child in state stopped
**** v1    0.2 CLI TX|status
***  v1    0.2 CLI RX  200
**** v1    0.2 CLI RX|Child in state stopped
**** v1    0.2 STDOUT poll 0x10
**   v1    0.2 R 7653 Status: 0000 (u 0.055000 s 0.073000)
*    diag  0.0 ............................................................
#    top  TEST ../../../bin/varnishtest/tests/v00031.vtc TIMED OUT (kill -9)
#    top  TEST ../../../bin/varnishtest/tests/v00031.vtc FAILED (60.002) signal=9

1 @ SunOS 5.11 i86pc 1.04 32_sun12.4 uplex

*    top   0.0 TEST ../../../bin/varnishtest/tests/v00031.vtc starting
[...]
*    top   0.0 TEST param vcc_err_unref
[...]
***  v1    0.2 CLI RX  200
**   v1    0.2 CLI 200 <param.set vcc_err_unref true>
**   top   0.2 === varnish v1 -errvcl {Unused backend c, defined:} {
**** v1    0.2 CLI TX|vcl.inline vcl3 << %XJEIFLH|)Xspa8P
**** v1    0.2 CLI TX|vcl 4.0;
**** v1    0.2 CLI TX|
**** v1    0.2 CLI TX|\tbackend b { .host = "127.0.0.1"; }
**** v1    0.2 CLI TX|\tbackend c { .host = "127.0.0.1"; }
**** v1    0.2 CLI TX|
**** v1    0.2 CLI TX|%XJEIFLH|)Xspa8P
***  v1    0.2 CLI RX  106
**** v1    0.2 CLI RX|Message from VCC-compiler:
**** v1    0.2 CLI RX|Security: Privilege proc_setid missing, will not change uid/gid
**** v1    0.2 CLI RX|Unused backend c, defined:
**** v1    0.2 CLI RX|('<vcl.inline>' Line 4 Pos 17)
**** v1    0.2 CLI RX|        backend c { .host = "127.0.0.1"; }
**** v1    0.2 CLI RX|----------------#-------------------------
**** v1    0.2 CLI RX|
**** v1    0.2 CLI RX|Running VCC-compiler failed, exited with 2
**** v1    0.2 CLI RX|VCL compilation failed
**   v1    0.2 VCL compilation failed (as expected)
***  v1    0.2 Found expected string: ("Unused backend c, defined:")
*    top   0.2 RESETTING after ../../../bin/varnishtest/tests/v00031.vtc
**   v1    0.2 Wait
**** v1    0.2 CLI TX|backend.list
***  v1    0.2 CLI RX  101
**** v1    0.2 CLI RX|Unknown request in manager process (child not running).
**** v1    0.2 CLI RX|Type 'help' for more info.
**   v1    0.2 Stop
**** v1    0.2 CLI TX|stop
***  v1    0.2 CLI RX  300
**** v1    0.2 CLI RX|Child in state stopped
**** v1    0.2 CLI TX|status
***  v1    0.2 CLI RX  200
**** v1    0.2 CLI RX|Child in state stopped
**** v1    0.2 STDOUT poll 0x10
**   v1    0.2 R 65847 Status: 0000 (u 0.059000 s 0.078000)
*    diag  0.0 ............................................................
#    top  TEST ../../../bin/varnishtest/tests/v00031.vtc TIMED OUT (kill -9)
#    top  TEST ../../../bin/varnishtest/tests/v00031.vtc FAILED (60.003) signal=9

1 @ SunOS 5.11 i86pc 1.04 32_sun12.4 uplex

*    top   0.0 TEST ../../../bin/varnishtest/tests/v00031.vtc starting
[...]
*    top   0.0 TEST param vcc_err_unref
[...]
***  v1    0.2 CLI RX  200
**   v1    0.2 CLI 200 <param.set vcc_err_unref true>
**   top   0.2 === varnish v1 -errvcl {Unused backend c, defined:} {
**** v1    0.2 CLI TX|vcl.inline vcl3 << %XJEIFLH|)Xspa8P
**** v1    0.2 CLI TX|vcl 4.0;
**** v1    0.2 CLI TX|
**** v1    0.2 CLI TX|\tbackend b { .host = "127.0.0.1"; }
**** v1    0.2 CLI TX|\tbackend c { .host = "127.0.0.1"; }
**** v1    0.2 CLI TX|
**** v1    0.2 CLI TX|%XJEIFLH|)Xspa8P
***  v1    0.2 CLI RX  106
**** v1    0.2 CLI RX|Message from VCC-compiler:
**** v1    0.2 CLI RX|Security: Privilege proc_setid missing, will not change uid/gid
**** v1    0.2 CLI RX|Unused backend c, defined:
**** v1    0.2 CLI RX|('<vcl.inline>' Line 4 Pos 17)
**** v1    0.2 CLI RX|        backend c { .host = "127.0.0.1"; }
**** v1    0.2 CLI RX|----------------#-------------------------
**** v1    0.2 CLI RX|
**** v1    0.2 CLI RX|Running VCC-compiler failed, exited with 2
**** v1    0.2 CLI RX|VCL compilation failed
**   v1    0.2 VCL compilation failed (as expected)
***  v1    0.2 Found expected string: ("Unused backend c, defined:")
*    top   0.2 RESETTING after ../../../bin/varnishtest/tests/v00031.vtc
**   v1    0.2 Wait
**** v1    0.2 CLI TX|backend.list
***  v1    0.2 CLI RX  101
**** v1    0.2 CLI RX|Unknown request in manager process (child not running).
**** v1    0.2 CLI RX|Type 'help' for more info.
**   v1    0.2 Stop
**** v1    0.2 CLI TX|stop
***  v1    0.2 CLI RX  300
**** v1    0.2 CLI RX|Child in state stopped
**** v1    0.2 CLI TX|status
***  v1    0.2 CLI RX  200
**** v1    0.2 CLI RX|Child in state stopped
**** v1    0.2 STDOUT poll 0x10
**   v1    0.2 R 67121 Status: 0000 (u 0.060000 s 0.084000)
*    diag  0.0 ............................................................
#    top  TEST ../../../bin/varnishtest/tests/v00031.vtc TIMED OUT (kill -9)
#    top  TEST ../../../bin/varnishtest/tests/v00031.vtc FAILED (60.002) signal=9

1 @ SunOS 5.11 i86pc 1.04 64_sun12.4 uplex

*    top   0.0 TEST ../../../bin/varnishtest/tests/v00031.vtc starting
[...]
*    top   0.0 TEST param vcc_err_unref
[...]
***  v1    0.2 CLI RX  200
**   v1    0.2 CLI 200 <param.set vcc_err_unref true>
**   top   0.2 === varnish v1 -errvcl {Unused backend c, defined:} {
**** v1    0.2 CLI TX|vcl.inline vcl3 << %XJEIFLH|)Xspa8P
**** v1    0.2 CLI TX|vcl 4.0;
**** v1    0.2 CLI TX|
**** v1    0.2 CLI TX|\tbackend b { .host = "127.0.0.1"; }
**** v1    0.2 CLI TX|\tbackend c { .host = "127.0.0.1"; }
**** v1    0.2 CLI TX|
**** v1    0.2 CLI TX|%XJEIFLH|)Xspa8P
***  v1    0.2 CLI RX  106
**** v1    0.2 CLI RX|Message from VCC-compiler:
**** v1    0.2 CLI RX|Security: Privilege proc_setid missing, will not change uid/gid
**** v1    0.2 CLI RX|Unused backend c, defined:
**** v1    0.2 CLI RX|('<vcl.inline>' Line 4 Pos 17)
**** v1    0.2 CLI RX|        backend c { .host = "127.0.0.1"; }
**** v1    0.2 CLI RX|----------------#-------------------------
**** v1    0.2 CLI RX|
**** v1    0.2 CLI RX|Running VCC-compiler failed, exited with 2
**** v1    0.2 CLI RX|VCL compilation failed
**   v1    0.2 VCL compilation failed (as expected)
***  v1    0.2 Found expected string: ("Unused backend c, defined:")
*    top   0.2 RESETTING after ../../../bin/varnishtest/tests/v00031.vtc
**   v1    0.2 Wait
**** v1    0.2 CLI TX|backend.list
***  v1    0.2 CLI RX  101
**** v1    0.2 CLI RX|Unknown request in manager process (child not running).
**** v1    0.2 CLI RX|Type 'help' for more info.
**   v1    0.2 Stop
**** v1    0.2 CLI TX|stop
***  v1    0.2 CLI RX  300
**** v1    0.2 CLI RX|Child in state stopped
**** v1    0.2 CLI TX|status
***  v1    0.2 CLI RX  200
**** v1    0.2 CLI RX|Child in state stopped
**** v1    0.2 STDOUT poll 0x10
**   v1    0.2 R 65346 Status: 0000 (u 0.064000 s 0.098000)
*    diag  0.0 ............................................................
#    top  TEST ../../../bin/varnishtest/tests/v00031.vtc TIMED OUT (kill -9)
#    top  TEST ../../../bin/varnishtest/tests/v00031.vtc FAILED (60.004) signal=9

1 @ SunOS 5.11 i86pc 1.04 32_sun12.4 uplex

*    top   0.0 TEST ../../../bin/varnishtest/tests/v00031.vtc starting
[...]
*    top   0.0 TEST param vcc_err_unref
[...]
***  v1    0.2 CLI RX  200
**   v1    0.2 CLI 200 <param.set vcc_err_unref true>
**   top   0.2 === varnish v1 -errvcl {Unused backend c, defined:} {
**** v1    0.2 CLI TX|vcl.inline vcl3 << %XJEIFLH|)Xspa8P
**** v1    0.2 CLI TX|vcl 4.0;
**** v1    0.2 CLI TX|
**** v1    0.2 CLI TX|\tbackend b { .host = "127.0.0.1"; }
**** v1    0.2 CLI TX|\tbackend c { .host = "127.0.0.1"; }
**** v1    0.2 CLI TX|
**** v1    0.2 CLI TX|%XJEIFLH|)Xspa8P
***  v1    0.2 CLI RX  106
**** v1    0.2 CLI RX|Message from VCC-compiler:
**** v1    0.2 CLI RX|Security: Privilege proc_setid missing, will not change uid/gid
**** v1    0.2 CLI RX|Unused backend c, defined:
**** v1    0.2 CLI RX|('<vcl.inline>' Line 4 Pos 17)
**** v1    0.2 CLI RX|        backend c { .host = "127.0.0.1"; }
**** v1    0.2 CLI RX|----------------#-------------------------
**** v1    0.2 CLI RX|
**** v1    0.2 CLI RX|Running VCC-compiler failed, exited with 2
**** v1    0.2 CLI RX|VCL compilation failed
**   v1    0.2 VCL compilation failed (as expected)
***  v1    0.2 Found expected string: ("Unused backend c, defined:")
*    top   0.2 RESETTING after ../../../bin/varnishtest/tests/v00031.vtc
**   v1    0.2 Wait
**** v1    0.2 CLI TX|backend.list
***  v1    0.2 CLI RX  101
**** v1    0.2 CLI RX|Unknown request in manager process (child not running).
**** v1    0.2 CLI RX|Type 'help' for more info.
**   v1    0.2 Stop
**** v1    0.2 CLI TX|stop
***  v1    0.2 CLI RX  300
**** v1    0.2 CLI RX|Child in state stopped
**** v1    0.2 CLI TX|status
***  v1    0.2 CLI RX  200
**** v1    0.2 CLI RX|Child in state stopped
**** v1    0.2 STDOUT poll 0x10
**   v1    0.2 R 4319 Status: 0000 (u 0.059000 s 0.075000)
*    diag  0.0 ............................................................
#    top  TEST ../../../bin/varnishtest/tests/v00031.vtc TIMED OUT (kill -9)
#    top  TEST ../../../bin/varnishtest/tests/v00031.vtc FAILED (60.003) signal=9

1 @ SunOS 5.11 i86pc 1.04 32_gcc4.7 uplex

*    top   0.0 TEST ../../../bin/varnishtest/tests/v00031.vtc starting
[...]
*    top   0.0 TEST param vcc_err_unref
[...]
***  v1    0.3 CLI RX  200
**   v1    0.3 CLI 200 <param.set vcc_err_unref true>
**   top   0.3 === varnish v1 -errvcl {Unused backend c, defined:} {
**** v1    0.3 CLI TX|vcl.inline vcl3 << %XJEIFLH|)Xspa8P
**** v1    0.3 CLI TX|vcl 4.0;
**** v1    0.3 CLI TX|
**** v1    0.3 CLI TX|\tbackend b { .host = "127.0.0.1"; }
**** v1    0.3 CLI TX|\tbackend c { .host = "127.0.0.1"; }
**** v1    0.3 CLI TX|
**** v1    0.3 CLI TX|%XJEIFLH|)Xspa8P
***  v1    0.3 CLI RX  106
**** v1    0.3 CLI RX|Message from VCC-compiler:
**** v1    0.3 CLI RX|Security: Privilege proc_setid missing, will not change uid/gid
**** v1    0.3 CLI RX|Unused backend c, defined:
**** v1    0.3 CLI RX|('<vcl.inline>' Line 4 Pos 17)
**** v1    0.3 CLI RX|        backend c { .host = "127.0.0.1"; }
**** v1    0.3 CLI RX|----------------#-------------------------
**** v1    0.3 CLI RX|
**** v1    0.3 CLI RX|Running VCC-compiler failed, exited with 2
**** v1    0.3 CLI RX|VCL compilation failed
**   v1    0.3 VCL compilation failed (as expected)
***  v1    0.3 Found expected string: ("Unused backend c, defined:")
*    top   0.3 RESETTING after ../../../bin/varnishtest/tests/v00031.vtc
**   v1    0.3 Wait
**** v1    0.3 CLI TX|backend.list
***  v1    0.3 CLI RX  101
**** v1    0.3 CLI RX|Unknown request in manager process (child not running).
**** v1    0.3 CLI RX|Type 'help' for more info.
**   v1    0.3 Stop
**** v1    0.3 CLI TX|stop
***  v1    0.3 CLI RX  300
**** v1    0.3 CLI RX|Child in state stopped
**** v1    0.3 CLI TX|status
***  v1    0.3 CLI RX  200
**** v1    0.3 CLI RX|Child in state stopped
**** v1    0.3 STDOUT poll 0x10
**   v1    0.3 R 75579 Status: 0000 (u 0.065000 s 0.063000)
*    diag  0.0 ............................................................
#    top  TEST ../../../bin/varnishtest/tests/v00031.vtc TIMED OUT (kill -9)
#    top  TEST ../../../bin/varnishtest/tests/v00031.vtc FAILED (60.002) signal=9

1 @ SunOS 5.11 i86pc 1.04 32_gcc4.7 uplex

*    top   0.0 TEST ../../../bin/varnishtest/tests/v00031.vtc starting
[...]
*    top   0.0 TEST param vcc_err_unref
[...]
***  v1    0.3 CLI RX  200
**   v1    0.3 CLI 200 <param.set vcc_err_unref true>
**   top   0.3 === varnish v1 -errvcl {Unused backend c, defined:} {
**** v1    0.3 CLI TX|vcl.inline vcl3 << %XJEIFLH|)Xspa8P
**** v1    0.3 CLI TX|vcl 4.0;
**** v1    0.3 CLI TX|
**** v1    0.3 CLI TX|\tbackend b { .host = "127.0.0.1"; }
**** v1    0.3 CLI TX|\tbackend c { .host = "127.0.0.1"; }
**** v1    0.3 CLI TX|
**** v1    0.3 CLI TX|%XJEIFLH|)Xspa8P
***  v1    0.3 CLI RX  106
**** v1    0.3 CLI RX|Message from VCC-compiler:
**** v1    0.3 CLI RX|Security: Privilege proc_setid missing, will not change uid/gid
**** v1    0.3 CLI RX|Unused backend c, defined:
**** v1    0.3 CLI RX|('<vcl.inline>' Line 4 Pos 17)
**** v1    0.3 CLI RX|        backend c { .host = "127.0.0.1"; }
**** v1    0.3 CLI RX|----------------#-------------------------
**** v1    0.3 CLI RX|
**** v1    0.3 CLI RX|Running VCC-compiler failed, exited with 2
**** v1    0.3 CLI RX|VCL compilation failed
**   v1    0.3 VCL compilation failed (as expected)
***  v1    0.3 Found expected string: ("Unused backend c, defined:")
*    top   0.3 RESETTING after ../../../bin/varnishtest/tests/v00031.vtc
**   v1    0.3 Wait
**** v1    0.3 CLI TX|backend.list
***  v1    0.3 CLI RX  101
**** v1    0.3 CLI RX|Unknown request in manager process (child not running).
**** v1    0.3 CLI RX|Type 'help' for more info.
**   v1    0.3 Stop
**** v1    0.3 CLI TX|stop
***  v1    0.3 CLI RX  300
**** v1    0.3 CLI RX|Child in state stopped
**** v1    0.3 CLI TX|status
***  v1    0.3 CLI RX  200
**** v1    0.3 CLI RX|Child in state stopped
**** v1    0.3 STDOUT poll 0x10
**   v1    0.3 R 52902 Status: 0000 (u 0.066000 s 0.062000)
*    diag  0.0 ............................................................
#    top  TEST ../../../bin/varnishtest/tests/v00031.vtc TIMED OUT (kill -9)
#    top  TEST ../../../bin/varnishtest/tests/v00031.vtc FAILED (60.002) signal=9

1 @ SunOS 5.11 i86pc 1.04 64_sun12.4 uplex

*    top   0.0 TEST ../../../bin/varnishtest/tests/v00031.vtc starting
[...]
*    top   0.0 TEST param vcc_err_unref
[...]
***  v1    0.2 CLI RX  200
**   v1    0.2 CLI 200 <param.set vcc_err_unref true>
**   top   0.2 === varnish v1 -errvcl {Unused backend c, defined:} {
**** v1    0.2 CLI TX|vcl.inline vcl3 << %XJEIFLH|)Xspa8P
**** v1    0.2 CLI TX|vcl 4.0;
**** v1    0.2 CLI TX|
**** v1    0.2 CLI TX|\tbackend b { .host = "127.0.0.1"; }
**** v1    0.2 CLI TX|\tbackend c { .host = "127.0.0.1"; }
**** v1    0.2 CLI TX|
**** v1    0.2 CLI TX|%XJEIFLH|)Xspa8P
***  v1    0.2 CLI RX  106
**** v1    0.2 CLI RX|Message from VCC-compiler:
**** v1    0.2 CLI RX|Security: Privilege proc_setid missing, will not change uid/gid
**** v1    0.2 CLI RX|Unused backend c, defined:
**** v1    0.2 CLI RX|('<vcl.inline>' Line 4 Pos 17)
**** v1    0.2 CLI RX|        backend c { .host = "127.0.0.1"; }
**** v1    0.2 CLI RX|----------------#-------------------------
**** v1    0.2 CLI RX|
**** v1    0.2 CLI RX|Running VCC-compiler failed, exited with 2
**** v1    0.2 CLI RX|VCL compilation failed
**   v1    0.2 VCL compilation failed (as expected)
***  v1    0.2 Found expected string: ("Unused backend c, defined:")
*    top   0.2 RESETTING after ../../../bin/varnishtest/tests/v00031.vtc
**   v1    0.2 Wait
**** v1    0.2 CLI TX|backend.list
***  v1    0.2 CLI RX  101
**** v1    0.2 CLI RX|Unknown request in manager process (child not running).
**** v1    0.2 CLI RX|Type 'help' for more info.
**   v1    0.2 Stop
**** v1    0.2 CLI TX|stop
***  v1    0.2 CLI RX  300
**** v1    0.2 CLI RX|Child in state stopped
**** v1    0.2 CLI TX|status
***  v1    0.2 CLI RX  200
**** v1    0.2 CLI RX|Child in state stopped
**** v1    0.2 STDOUT poll 0x10
**   v1    0.2 R 93162 Status: 0000 (u 0.070000 s 0.100000)
*    diag  0.0 ............................................................
#    top  TEST ../../../bin/varnishtest/tests/v00031.vtc TIMED OUT (kill -9)
#    top  TEST ../../../bin/varnishtest/tests/v00031.vtc FAILED (60.003) signal=9

1 @ SunOS 5.11 i86pc 1.04 32_sun12.4 uplex

*    top   0.0 TEST ../../../bin/varnishtest/tests/v00031.vtc starting
[...]
*    top   0.0 TEST param vcc_err_unref
[...]
***  v1    0.3 CLI RX  200
**   v1    0.3 CLI 200 <param.set vcc_err_unref true>
**   top   0.3 === varnish v1 -errvcl {Unused backend c, defined:} {
**** v1    0.3 CLI TX|vcl.inline vcl3 << %XJEIFLH|)Xspa8P
**** v1    0.3 CLI TX|vcl 4.0;
**** v1    0.3 CLI TX|
**** v1    0.3 CLI TX|\tbackend b { .host = "127.0.0.1"; }
**** v1    0.3 CLI TX|\tbackend c { .host = "127.0.0.1"; }
**** v1    0.3 CLI TX|
**** v1    0.3 CLI TX|%XJEIFLH|)Xspa8P
***  v1    0.3 CLI RX  106
**** v1    0.3 CLI RX|Message from VCC-compiler:
**** v1    0.3 CLI RX|Security: Privilege proc_setid missing, will not change uid/gid
**** v1    0.3 CLI RX|Unused backend c, defined:
**** v1    0.3 CLI RX|('<vcl.inline>' Line 4 Pos 17)
**** v1    0.3 CLI RX|        backend c { .host = "127.0.0.1"; }
**** v1    0.3 CLI RX|----------------#-------------------------
**** v1    0.3 CLI RX|
**** v1    0.3 CLI RX|Running VCC-compiler failed, exited with 2
**** v1    0.3 CLI RX|VCL compilation failed
**   v1    0.3 VCL compilation failed (as expected)
***  v1    0.3 Found expected string: ("Unused backend c, defined:")
*    top   0.3 RESETTING after ../../../bin/varnishtest/tests/v00031.vtc
**   v1    0.3 Wait
**** v1    0.3 CLI TX|backend.list
***  v1    0.3 CLI RX  101
**** v1    0.3 CLI RX|Unknown request in manager process (child not running).
**** v1    0.3 CLI RX|Type 'help' for more info.
**   v1    0.3 Stop
**** v1    0.3 CLI TX|stop
***  v1    0.3 CLI RX  300
**** v1    0.3 CLI RX|Child in state stopped
**** v1    0.3 CLI TX|status
***  v1    0.3 CLI RX  200
**** v1    0.3 CLI RX|Child in state stopped
**** v1    0.3 STDOUT poll 0x10
**   v1    0.3 R 64396 Status: 0000 (u 0.093000 s 0.118000)
*    diag  0.0 ............................................................
#    top  TEST ../../../bin/varnishtest/tests/v00031.vtc TIMED OUT (kill -9)
#    top  TEST ../../../bin/varnishtest/tests/v00031.vtc FAILED (60.002) signal=9

1 @ SunOS 5.11 i86pc 1.04 32_sun12.4 uplex

*    top   0.0 TEST ../../../bin/varnishtest/tests/v00031.vtc starting
[...]
*    top   0.0 TEST param vcc_err_unref
[...]
***  v1    0.2 CLI RX  200
**   v1    0.2 CLI 200 <param.set vcc_err_unref true>
**   top   0.2 === varnish v1 -errvcl {Unused backend c, defined:} {
**** v1    0.2 CLI TX|vcl.inline vcl3 << %XJEIFLH|)Xspa8P
**** v1    0.2 CLI TX|vcl 4.0;
**** v1    0.2 CLI TX|
**** v1    0.2 CLI TX|\tbackend b { .host = "127.0.0.1"; }
**** v1    0.2 CLI TX|\tbackend c { .host = "127.0.0.1"; }
**** v1    0.2 CLI TX|
**** v1    0.2 CLI TX|%XJEIFLH|)Xspa8P
***  v1    0.2 CLI RX  106
**** v1    0.2 CLI RX|Message from VCC-compiler:
**** v1    0.2 CLI RX|Security: Privilege proc_setid missing, will not change uid/gid
**** v1    0.2 CLI RX|Unused backend c, defined:
**** v1    0.2 CLI RX|('<vcl.inline>' Line 4 Pos 17)
**** v1    0.2 CLI RX|        backend c { .host = "127.0.0.1"; }
**** v1    0.2 CLI RX|----------------#-------------------------
**** v1    0.2 CLI RX|
**** v1    0.2 CLI RX|Running VCC-compiler failed, exited with 2
**** v1    0.2 CLI RX|VCL compilation failed
**   v1    0.2 VCL compilation failed (as expected)
***  v1    0.2 Found expected string: ("Unused backend c, defined:")
*    top   0.2 RESETTING after ../../../bin/varnishtest/tests/v00031.vtc
**   v1    0.2 Wait
**** v1    0.2 CLI TX|backend.list
***  v1    0.2 CLI RX  101
**** v1    0.2 CLI RX|Unknown request in manager process (child not running).
**** v1    0.2 CLI RX|Type 'help' for more info.
**   v1    0.2 Stop
**** v1    0.2 CLI TX|stop
***  v1    0.2 CLI RX  300
**** v1    0.2 CLI RX|Child in state stopped
**** v1    0.2 CLI TX|status
***  v1    0.2 CLI RX  200
**** v1    0.2 CLI RX|Child in state stopped
**** v1    0.2 STDOUT poll 0x10
**   v1    0.2 R 65701 Status: 0000 (u 0.045000 s 0.059000)
*    diag  0.0 ............................................................
#    top  TEST ../../../bin/varnishtest/tests/v00031.vtc TIMED OUT (kill -9)
#    top  TEST ../../../bin/varnishtest/tests/v00031.vtc FAILED (60.002) signal=9

1 @ SunOS 5.11 i86pc 1.04 32_gcc4.7 uplex

*    top   0.0 TEST ../../../bin/varnishtest/tests/v00031.vtc starting
[...]
*    top   0.0 TEST param vcc_err_unref
[...]
***  v1    0.2 CLI RX  200
**   v1    0.2 CLI 200 <param.set vcc_err_unref true>
**   top   0.2 === varnish v1 -errvcl {Unused backend c, defined:} {
**** v1    0.2 CLI TX|vcl.inline vcl3 << %XJEIFLH|)Xspa8P
**** v1    0.2 CLI TX|vcl 4.0;
**** v1    0.2 CLI TX|
**** v1    0.2 CLI TX|\tbackend b { .host = "127.0.0.1"; }
**** v1    0.2 CLI TX|\tbackend c { .host = "127.0.0.1"; }
**** v1    0.2 CLI TX|
**** v1    0.2 CLI TX|%XJEIFLH|)Xspa8P
***  v1    0.3 CLI RX  106
**** v1    0.3 CLI RX|Message from VCC-compiler:
**** v1    0.3 CLI RX|Security: Privilege proc_setid missing, will not change uid/gid
**** v1    0.3 CLI RX|Unused backend c, defined:
**** v1    0.3 CLI RX|('<vcl.inline>' Line 4 Pos 17)
**** v1    0.3 CLI RX|        backend c { .host = "127.0.0.1"; }
**** v1    0.3 CLI RX|----------------#-------------------------
**** v1    0.3 CLI RX|
**** v1    0.3 CLI RX|Running VCC-compiler failed, exited with 2
**** v1    0.3 CLI RX|VCL compilation failed
**   v1    0.3 VCL compilation failed (as expected)
***  v1    0.3 Found expected string: ("Unused backend c, defined:")
*    top   0.3 RESETTING after ../../../bin/varnishtest/tests/v00031.vtc
**   v1    0.3 Wait
**** v1    0.3 CLI TX|backend.list
***  v1    0.3 CLI RX  101
**** v1    0.3 CLI RX|Unknown request in manager process (child not running).
**** v1    0.3 CLI RX|Type 'help' for more info.
**   v1    0.3 Stop
**** v1    0.3 CLI TX|stop
***  v1    0.3 CLI RX  300
**** v1    0.3 CLI RX|Child in state stopped
**** v1    0.3 CLI TX|status
***  v1    0.3 CLI RX  200
**** v1    0.3 CLI RX|Child in state stopped
**** v1    0.3 STDOUT poll 0x10
**   v1    0.3 R 85914 Status: 0000 (u 0.063000 s 0.059000)
*    diag  0.0 ............................................................
#    top  TEST ../../../bin/varnishtest/tests/v00031.vtc TIMED OUT (kill -9)
#    top  TEST ../../../bin/varnishtest/tests/v00031.vtc FAILED (60.002) signal=9

1 @ SunOS 5.11 i86pc 1.04 64_sun12.4 uplex

*    top   0.0 TEST ../../../bin/varnishtest/tests/v00031.vtc starting
[...]
*    top   0.0 TEST param vcc_err_unref
[...]
***  v1    0.2 CLI RX  200
**   v1    0.2 CLI 200 <param.set vcc_err_unref true>
**   top   0.2 === varnish v1 -errvcl {Unused backend c, defined:} {
**** v1    0.2 CLI TX|vcl.inline vcl3 << %XJEIFLH|)Xspa8P
**** v1    0.2 CLI TX|vcl 4.0;
**** v1    0.2 CLI TX|
**** v1    0.2 CLI TX|\tbackend b { .host = "127.0.0.1"; }
**** v1    0.2 CLI TX|\tbackend c { .host = "127.0.0.1"; }
**** v1    0.2 CLI TX|
**** v1    0.2 CLI TX|%XJEIFLH|)Xspa8P
***  v1    0.2 CLI RX  106
**** v1    0.2 CLI RX|Message from VCC-compiler:
**** v1    0.2 CLI RX|Security: Privilege proc_setid missing, will not change uid/gid
**** v1    0.2 CLI RX|Unused backend c, defined:
**** v1    0.2 CLI RX|('<vcl.inline>' Line 4 Pos 17)
**** v1    0.2 CLI RX|        backend c { .host = "127.0.0.1"; }
**** v1    0.2 CLI RX|----------------#-------------------------
**** v1    0.2 CLI RX|
**** v1    0.2 CLI RX|Running VCC-compiler failed, exited with 2
**** v1    0.2 CLI RX|VCL compilation failed
**   v1    0.2 VCL compilation failed (as expected)
***  v1    0.2 Found expected string: ("Unused backend c, defined:")
*    top   0.2 RESETTING after ../../../bin/varnishtest/tests/v00031.vtc
**   v1    0.2 Wait
**** v1    0.2 CLI TX|backend.list
***  v1    0.2 CLI RX  101
**** v1    0.2 CLI RX|Unknown request in manager process (child not running).
**** v1    0.2 CLI RX|Type 'help' for more info.
**   v1    0.2 Stop
**** v1    0.2 CLI TX|stop
***  v1    0.2 CLI RX  300
**** v1    0.2 CLI RX|Child in state stopped
**** v1    0.2 CLI TX|status
***  v1    0.2 CLI RX  200
**** v1    0.2 CLI RX|Child in state stopped
**** v1    0.2 STDOUT poll 0x10
**   v1    0.2 R 256 Status: 0000 (u 0.067000 s 0.100000)
*    diag  0.0 ............................................................
#    top  TEST ../../../bin/varnishtest/tests/v00031.vtc TIMED OUT (kill -9)
#    top  TEST ../../../bin/varnishtest/tests/v00031.vtc FAILED (60.004) signal=9

1 @ SunOS 5.11 i86pc 1.04 32_gcc4.7 uplex

*    top   0.0 TEST ../../../bin/varnishtest/tests/v00031.vtc starting
[...]
*    top   0.0 TEST param vcc_err_unref
[...]
***  v1    0.2 CLI RX  200
**   v1    0.2 CLI 200 <param.set vcc_err_unref true>
**   top   0.2 === varnish v1 -errvcl {Unused backend c, defined:} {
**** v1    0.2 CLI TX|vcl.inline vcl3 << %XJEIFLH|)Xspa8P
**** v1    0.2 CLI TX|vcl 4.0;
**** v1    0.2 CLI TX|
**** v1    0.2 CLI TX|\tbackend b { .host = "127.0.0.1"; }
**** v1    0.2 CLI TX|\tbackend c { .host = "127.0.0.1"; }
**** v1    0.2 CLI TX|
**** v1    0.2 CLI TX|%XJEIFLH|)Xspa8P
***  v1    0.3 CLI RX  106
**** v1    0.3 CLI RX|Message from VCC-compiler:
**** v1    0.3 CLI RX|Security: Privilege proc_setid missing, will not change uid/gid
**** v1    0.3 CLI RX|Unused backend c, defined:
**** v1    0.3 CLI RX|('<vcl.inline>' Line 4 Pos 17)
**** v1    0.3 CLI RX|        backend c { .host = "127.0.0.1"; }
**** v1    0.3 CLI RX|----------------#-------------------------
**** v1    0.3 CLI RX|
**** v1    0.3 CLI RX|Running VCC-compiler failed, exited with 2
**** v1    0.3 CLI RX|VCL compilation failed
**   v1    0.3 VCL compilation failed (as expected)
***  v1    0.3 Found expected string: ("Unused backend c, defined:")
*    top   0.3 RESETTING after ../../../bin/varnishtest/tests/v00031.vtc
**   v1    0.3 Wait
**** v1    0.3 CLI TX|backend.list
***  v1    0.3 CLI RX  101
**** v1    0.3 CLI RX|Unknown request in manager process (child not running).
**** v1    0.3 CLI RX|Type 'help' for more info.
**   v1    0.3 Stop
**** v1    0.3 CLI TX|stop
***  v1    0.3 CLI RX  300
**** v1    0.3 CLI RX|Child in state stopped
**** v1    0.3 CLI TX|status
***  v1    0.3 CLI RX  200
**** v1    0.3 CLI RX|Child in state stopped
**** v1    0.3 STDOUT poll 0x10
**   v1    0.3 R 87222 Status: 0000 (u 0.065000 s 0.060000)
*    diag  0.0 ............................................................
#    top  TEST ../../../bin/varnishtest/tests/v00031.vtc TIMED OUT (kill -9)
#    top  TEST ../../../bin/varnishtest/tests/v00031.vtc FAILED (60.002) signal=9

1 @ SunOS 5.11 i86pc 1.04 32_gcc4.7 uplex

*    top   0.0 TEST ../../../bin/varnishtest/tests/v00031.vtc starting
[...]
*    top   0.0 TEST param vcc_err_unref
[...]
***  v1    0.3 CLI RX  200
**   v1    0.3 CLI 200 <param.set vcc_err_unref true>
**   top   0.3 === varnish v1 -errvcl {Unused backend c, defined:} {
**** v1    0.3 CLI TX|vcl.inline vcl3 << %XJEIFLH|)Xspa8P
**** v1    0.3 CLI TX|vcl 4.0;
**** v1    0.3 CLI TX|
**** v1    0.3 CLI TX|\tbackend b { .host = "127.0.0.1"; }
**** v1    0.3 CLI TX|\tbackend c { .host = "127.0.0.1"; }
**** v1    0.3 CLI TX|
**** v1    0.3 CLI TX|%XJEIFLH|)Xspa8P
***  v1    0.3 CLI RX  106
**** v1    0.3 CLI RX|Message from VCC-compiler:
**** v1    0.3 CLI RX|Security: Privilege proc_setid missing, will not change uid/gid
**** v1    0.3 CLI RX|Unused backend c, defined:
**** v1    0.3 CLI RX|('<vcl.inline>' Line 4 Pos 17)
**** v1    0.3 CLI RX|        backend c { .host = "127.0.0.1"; }
**** v1    0.3 CLI RX|----------------#-------------------------
**** v1    0.3 CLI RX|
**** v1    0.3 CLI RX|Running VCC-compiler failed, exited with 2
**** v1    0.3 CLI RX|VCL compilation failed
**   v1    0.3 VCL compilation failed (as expected)
***  v1    0.3 Found expected string: ("Unused backend c, defined:")
*    top   0.3 RESETTING after ../../../bin/varnishtest/tests/v00031.vtc
**   v1    0.3 Wait
**** v1    0.3 CLI TX|backend.list
***  v1    0.3 CLI RX  101
**** v1    0.3 CLI RX|Unknown request in manager process (child not running).
**** v1    0.3 CLI RX|Type 'help' for more info.
**   v1    0.3 Stop
**** v1    0.3 CLI TX|stop
***  v1    0.3 CLI RX  300
**** v1    0.3 CLI RX|Child in state stopped
**** v1    0.3 CLI TX|status
***  v1    0.3 CLI RX  200
**** v1    0.3 CLI RX|Child in state stopped
**** v1    0.3 STDOUT poll 0x10
**   v1    0.3 R 3324 Status: 0000 (u 0.065000 s 0.066000)
*    diag  0.0 ............................................................
#    top  TEST ../../../bin/varnishtest/tests/v00031.vtc TIMED OUT (kill -9)
#    top  TEST ../../../bin/varnishtest/tests/v00031.vtc FAILED (60.002) signal=9

1 @ SunOS 5.11 i86pc 1.04 32_sun12.4 uplex

*    top   0.0 TEST ../../../bin/varnishtest/tests/v00031.vtc starting
[...]
*    top   0.0 TEST param vcc_err_unref
[...]
***  v1    0.2 CLI RX  200
**   v1    0.2 CLI 200 <param.set vcc_err_unref true>
**   top   0.2 === varnish v1 -errvcl {Unused backend c, defined:} {
**** v1    0.2 CLI TX|vcl.inline vcl3 << %XJEIFLH|)Xspa8P
**** v1    0.2 CLI TX|vcl 4.0;
**** v1    0.2 CLI TX|
**** v1    0.2 CLI TX|\tbackend b { .host = "127.0.0.1"; }
**** v1    0.2 CLI TX|\tbackend c { .host = "127.0.0.1"; }
**** v1    0.2 CLI TX|
**** v1    0.2 CLI TX|%XJEIFLH|)Xspa8P
***  v1    0.2 CLI RX  106
**** v1    0.2 CLI RX|Message from VCC-compiler:
**** v1    0.2 CLI RX|Security: Privilege proc_setid missing, will not change uid/gid
**** v1    0.2 CLI RX|Unused backend c, defined:
**** v1    0.2 CLI RX|('<vcl.inline>' Line 4 Pos 17)
**** v1    0.2 CLI RX|        backend c { .host = "127.0.0.1"; }
**** v1    0.2 CLI RX|----------------#-------------------------
**** v1    0.2 CLI RX|
**** v1    0.2 CLI RX|Running VCC-compiler failed, exited with 2
**** v1    0.2 CLI RX|VCL compilation failed
**   v1    0.2 VCL compilation failed (as expected)
***  v1    0.2 Found expected string: ("Unused backend c, defined:")
*    top   0.2 RESETTING after ../../../bin/varnishtest/tests/v00031.vtc
**   v1    0.2 Wait
**** v1    0.2 CLI TX|backend.list
***  v1    0.2 CLI RX  101
**** v1    0.2 CLI RX|Unknown request in manager process (child not running).
**** v1    0.2 CLI RX|Type 'help' for more info.
**   v1    0.2 Stop
**** v1    0.2 CLI TX|stop
***  v1    0.2 CLI RX  300
**** v1    0.2 CLI RX|Child in state stopped
**** v1    0.2 CLI TX|status
***  v1    0.2 CLI RX  200
**** v1    0.2 CLI RX|Child in state stopped
**** v1    0.2 STDOUT poll 0x10
**   v1    0.2 R 83065 Status: 0000 (u 0.058000 s 0.078000)
*    diag  0.0 ............................................................
#    top  TEST ../../../bin/varnishtest/tests/v00031.vtc TIMED OUT (kill -9)
#    top  TEST ../../../bin/varnishtest/tests/v00031.vtc FAILED (60.002) signal=9

1 @ SunOS 5.11 i86pc 1.04 32_gcc4.7 uplex

*    top   0.0 TEST ../../../bin/varnishtest/tests/v00031.vtc starting
[...]
*    top   0.0 TEST param vcc_err_unref
[...]
***  v1    0.3 CLI RX  200
**   v1    0.3 CLI 200 <param.set vcc_err_unref true>
**   top   0.3 === varnish v1 -errvcl {Unused backend c, defined:} {
**** v1    0.3 CLI TX|vcl.inline vcl3 << %XJEIFLH|)Xspa8P
**** v1    0.3 CLI TX|vcl 4.0;
**** v1    0.3 CLI TX|
**** v1    0.3 CLI TX|\tbackend b { .host = "127.0.0.1"; }
**** v1    0.3 CLI TX|\tbackend c { .host = "127.0.0.1"; }
**** v1    0.3 CLI TX|
**** v1    0.3 CLI TX|%XJEIFLH|)Xspa8P
***  v1    0.3 CLI RX  106
**** v1    0.3 CLI RX|Message from VCC-compiler:
**** v1    0.3 CLI RX|Security: Privilege proc_setid missing, will not change uid/gid
**** v1    0.3 CLI RX|Unused backend c, defined:
**** v1    0.3 CLI RX|('<vcl.inline>' Line 4 Pos 17)
**** v1    0.3 CLI RX|        backend c { .host = "127.0.0.1"; }
**** v1    0.3 CLI RX|----------------#-------------------------
**** v1    0.3 CLI RX|
**** v1    0.3 CLI RX|Running VCC-compiler failed, exited with 2
**** v1    0.3 CLI RX|VCL compilation failed
**   v1    0.3 VCL compilation failed (as expected)
***  v1    0.3 Found expected string: ("Unused backend c, defined:")
*    top   0.3 RESETTING after ../../../bin/varnishtest/tests/v00031.vtc
**   v1    0.3 Wait
**** v1    0.3 CLI TX|backend.list
***  v1    0.3 CLI RX  101
**** v1    0.3 CLI RX|Unknown request in manager process (child not running).
**** v1    0.3 CLI RX|Type 'help' for more info.
**   v1    0.3 Stop
**** v1    0.3 CLI TX|stop
***  v1    0.3 CLI RX  300
**** v1    0.3 CLI RX|Child in state stopped
**** v1    0.3 CLI TX|status
***  v1    0.3 CLI RX  200
**** v1    0.3 CLI RX|Child in state stopped
**** v1    0.3 STDOUT poll 0x10
**   v1    0.3 R 56452 Status: 0000 (u 0.068000 s 0.062000)
*    diag  0.0 ............................................................
#    top  TEST ../../../bin/varnishtest/tests/v00031.vtc TIMED OUT (kill -9)
#    top  TEST ../../../bin/varnishtest/tests/v00031.vtc FAILED (60.002) signal=9

1 @ SunOS 5.11 i86pc 1.04 64_sun12.4 uplex

*    top   0.0 TEST ../../../bin/varnishtest/tests/v00031.vtc starting
[...]
*    top   0.0 TEST param vcc_err_unref
[...]
***  v1    0.2 CLI RX  200
**   v1    0.2 CLI 200 <param.set vcc_err_unref true>
**   top   0.2 === varnish v1 -errvcl {Unused backend c, defined:} {
**** v1    0.2 CLI TX|vcl.inline vcl3 << %XJEIFLH|)Xspa8P
**** v1    0.2 CLI TX|vcl 4.0;
**** v1    0.2 CLI TX|
**** v1    0.2 CLI TX|\tbackend b { .host = "127.0.0.1"; }
**** v1    0.2 CLI TX|\tbackend c { .host = "127.0.0.1"; }
**** v1    0.2 CLI TX|
**** v1    0.2 CLI TX|%XJEIFLH|)Xspa8P
***  v1    0.2 CLI RX  106
**** v1    0.2 CLI RX|Message from VCC-compiler:
**** v1    0.2 CLI RX|Security: Privilege proc_setid missing, will not change uid/gid
**** v1    0.2 CLI RX|Unused backend c, defined:
**** v1    0.2 CLI RX|('<vcl.inline>' Line 4 Pos 17)
**** v1    0.2 CLI RX|        backend c { .host = "127.0.0.1"; }
**** v1    0.2 CLI RX|----------------#-------------------------
**** v1    0.2 CLI RX|
**** v1    0.2 CLI RX|Running VCC-compiler failed, exited with 2
**** v1    0.2 CLI RX|VCL compilation failed
**   v1    0.2 VCL compilation failed (as expected)
***  v1    0.2 Found expected string: ("Unused backend c, defined:")
*    top   0.2 RESETTING after ../../../bin/varnishtest/tests/v00031.vtc
**   v1    0.2 Wait
**** v1    0.2 CLI TX|backend.list
***  v1    0.2 CLI RX  101
**** v1    0.2 CLI RX|Unknown request in manager process (child not running).
**** v1    0.2 CLI RX|Type 'help' for more info.
**   v1    0.2 Stop
**** v1    0.2 CLI TX|stop
***  v1    0.2 CLI RX  300
**** v1    0.2 CLI RX|Child in state stopped
**** v1    0.2 CLI TX|status
***  v1    0.2 CLI RX  200
**** v1    0.2 CLI RX|Child in state stopped
**** v1    0.2 STDOUT poll 0x10
**   v1    0.2 R 2399 Status: 0000 (u 0.064000 s 0.097000)
*    diag  0.0 ............................................................
#    top  TEST ../../../bin/varnishtest/tests/v00031.vtc TIMED OUT (kill -9)
#    top  TEST ../../../bin/varnishtest/tests/v00031.vtc FAILED (60.004) signal=9

1 @ SunOS 5.11 i86pc 1.04 64_sun12.4 uplex

*    top   0.0 TEST ../../../bin/varnishtest/tests/v00031.vtc starting
[...]
*    top   0.0 TEST param vcc_err_unref
[...]
***  v1    0.2 CLI RX  200
**   v1    0.2 CLI 200 <param.set vcc_err_unref true>
**   top   0.2 === varnish v1 -errvcl {Unused backend c, defined:} {
**** v1    0.2 CLI TX|vcl.inline vcl3 << %XJEIFLH|)Xspa8P
**** v1    0.2 CLI TX|vcl 4.0;
**** v1    0.2 CLI TX|
**** v1    0.2 CLI TX|\tbackend b { .host = "127.0.0.1"; }
**** v1    0.2 CLI TX|\tbackend c { .host = "127.0.0.1"; }
**** v1    0.2 CLI TX|
**** v1    0.2 CLI TX|%XJEIFLH|)Xspa8P
***  v1    0.2 CLI RX  106
**** v1    0.2 CLI RX|Message from VCC-compiler:
**** v1    0.2 CLI RX|Security: Privilege proc_setid missing, will not change uid/gid
**** v1    0.2 CLI RX|Unused backend c, defined:
**** v1    0.2 CLI RX|('<vcl.inline>' Line 4 Pos 17)
**** v1    0.2 CLI RX|        backend c { .host = "127.0.0.1"; }
**** v1    0.2 CLI RX|----------------#-------------------------
**** v1    0.2 CLI RX|
**** v1    0.2 CLI RX|Running VCC-compiler failed, exited with 2
**** v1    0.2 CLI RX|VCL compilation failed
**   v1    0.2 VCL compilation failed (as expected)
***  v1    0.2 Found expected string: ("Unused backend c, defined:")
*    top   0.2 RESETTING after ../../../bin/varnishtest/tests/v00031.vtc
**   v1    0.2 Wait
**** v1    0.2 CLI TX|backend.list
***  v1    0.2 CLI RX  101
**** v1    0.2 CLI RX|Unknown request in manager process (child not running).
**** v1    0.2 CLI RX|Type 'help' for more info.
**   v1    0.2 Stop
**** v1    0.2 CLI TX|stop
***  v1    0.2 CLI RX  300
**** v1    0.2 CLI RX|Child in state stopped
**** v1    0.2 CLI TX|status
***  v1    0.2 CLI RX  200
**** v1    0.2 CLI RX|Child in state stopped
**** v1    0.2 STDOUT poll 0x10
**   v1    0.2 R 14056 Status: 0000 (u 0.062000 s 0.093000)
*    diag  0.0 ............................................................
#    top  TEST ../../../bin/varnishtest/tests/v00031.vtc TIMED OUT (kill -9)
#    top  TEST ../../../bin/varnishtest/tests/v00031.vtc FAILED (60.004) signal=9

1 @ SunOS 5.11 i86pc 1.04 64_sun12.4 uplex

*    top   0.0 TEST ../../../bin/varnishtest/tests/v00031.vtc starting
[...]
*    top   0.0 TEST param vcc_err_unref
[...]
***  v1    0.2 CLI RX  200
**   v1    0.2 CLI 200 <param.set vcc_err_unref true>
**   top   0.2 === varnish v1 -errvcl {Unused backend c, defined:} {
**** v1    0.2 CLI TX|vcl.inline vcl3 << %XJEIFLH|)Xspa8P
**** v1    0.2 CLI TX|vcl 4.0;
**** v1    0.2 CLI TX|
**** v1    0.2 CLI TX|\tbackend b { .host = "127.0.0.1"; }
**** v1    0.2 CLI TX|\tbackend c { .host = "127.0.0.1"; }
**** v1    0.2 CLI TX|
**** v1    0.2 CLI TX|%XJEIFLH|)Xspa8P
***  v1    0.2 CLI RX  106
**** v1    0.2 CLI RX|Message from VCC-compiler:
**** v1    0.2 CLI RX|Security: Privilege proc_setid missing, will not change uid/gid
**** v1    0.2 CLI RX|Unused backend c, defined:
**** v1    0.2 CLI RX|('<vcl.inline>' Line 4 Pos 17)
**** v1    0.2 CLI RX|        backend c { .host = "127.0.0.1"; }
**** v1    0.2 CLI RX|----------------#-------------------------
**** v1    0.2 CLI RX|
**** v1    0.2 CLI RX|Running VCC-compiler failed, exited with 2
**** v1    0.2 CLI RX|VCL compilation failed
**   v1    0.2 VCL compilation failed (as expected)
***  v1    0.2 Found expected string: ("Unused backend c, defined:")
*    top   0.2 RESETTING after ../../../bin/varnishtest/tests/v00031.vtc
**   v1    0.2 Wait
**** v1    0.2 CLI TX|backend.list
***  v1    0.2 CLI RX  101
**** v1    0.2 CLI RX|Unknown request in manager process (child not running).
**** v1    0.2 CLI RX|Type 'help' for more info.
**   v1    0.2 Stop
**** v1    0.2 CLI TX|stop
***  v1    0.2 CLI RX  300
**** v1    0.2 CLI RX|Child in state stopped
**** v1    0.2 CLI TX|status
***  v1    0.2 CLI RX  200
**** v1    0.2 CLI RX|Child in state stopped
**** v1    0.2 STDOUT poll 0x10
**   v1    0.2 R 20741 Status: 0000 (u 0.065000 s 0.094000)
*    diag  0.0 ............................................................
#    top  TEST ../../../bin/varnishtest/tests/v00031.vtc TIMED OUT (kill -9)
#    top  TEST ../../../bin/varnishtest/tests/v00031.vtc FAILED (60.004) signal=9

1 @ SunOS 5.11 i86pc 1.04 64_sun12.4 uplex

*    top   0.0 TEST ../../../bin/varnishtest/tests/v00031.vtc starting
[...]
*    top   0.0 TEST param vcc_err_unref
[...]
***  v1    0.2 CLI RX  200
**   v1    0.2 CLI 200 <param.set vcc_err_unref true>
**   top   0.2 === varnish v1 -errvcl {Unused backend c, defined:} {
**** v1    0.2 CLI TX|vcl.inline vcl3 << %XJEIFLH|)Xspa8P
**** v1    0.2 CLI TX|vcl 4.0;
**** v1    0.2 CLI TX|
**** v1    0.2 CLI TX|\tbackend b { .host = "127.0.0.1"; }
**** v1    0.2 CLI TX|\tbackend c { .host = "127.0.0.1"; }
**** v1    0.2 CLI TX|
**** v1    0.2 CLI TX|%XJEIFLH|)Xspa8P
***  v1    0.2 CLI RX  106
**** v1    0.2 CLI RX|Message from VCC-compiler:
**** v1    0.2 CLI RX|Security: Privilege proc_setid missing, will not change uid/gid
**** v1    0.2 CLI RX|Unused backend c, defined:
**** v1    0.2 CLI RX|('<vcl.inline>' Line 4 Pos 17)
**** v1    0.2 CLI RX|        backend c { .host = "127.0.0.1"; }
**** v1    0.2 CLI RX|----------------#-------------------------
**** v1    0.2 CLI RX|
**** v1    0.2 CLI RX|Running VCC-compiler failed, exited with 2
**** v1    0.2 CLI RX|VCL compilation failed
**   v1    0.2 VCL compilation failed (as expected)
***  v1    0.2 Found expected string: ("Unused backend c, defined:")
*    top   0.2 RESETTING after ../../../bin/varnishtest/tests/v00031.vtc
**   v1    0.2 Wait
**** v1    0.2 CLI TX|backend.list
***  v1    0.2 CLI RX  101
**** v1    0.2 CLI RX|Unknown request in manager process (child not running).
**** v1    0.2 CLI RX|Type 'help' for more info.
**   v1    0.2 Stop
**** v1    0.2 CLI TX|stop
***  v1    0.2 CLI RX  300
**** v1    0.2 CLI RX|Child in state stopped
**** v1    0.2 CLI TX|status
***  v1    0.2 CLI RX  200
**** v1    0.2 CLI RX|Child in state stopped
**** v1    0.2 STDOUT poll 0x10
**   v1    0.2 R 8852 Status: 0000 (u 0.064000 s 0.094000)
*    diag  0.0 ............................................................
#    top  TEST ../../../bin/varnishtest/tests/v00031.vtc TIMED OUT (kill -9)
#    top  TEST ../../../bin/varnishtest/tests/v00031.vtc FAILED (60.004) signal=9

1 @ SunOS 5.11 i86pc 1.04 32_gcc4.7 uplex

*    top   0.0 TEST ../../../bin/varnishtest/tests/v00031.vtc starting
[...]
*    top   0.0 TEST param vcc_err_unref
[...]
***  v1    0.3 CLI RX  200
**   v1    0.3 CLI 200 <param.set vcc_err_unref true>
**   top   0.3 === varnish v1 -errvcl {Unused backend c, defined:} {
**** v1    0.3 CLI TX|vcl.inline vcl3 << %XJEIFLH|)Xspa8P
**** v1    0.3 CLI TX|vcl 4.0;
**** v1    0.3 CLI TX|
**** v1    0.3 CLI TX|\tbackend b { .host = "127.0.0.1"; }
**** v1    0.3 CLI TX|\tbackend c { .host = "127.0.0.1"; }
**** v1    0.3 CLI TX|
**** v1    0.3 CLI TX|%XJEIFLH|)Xspa8P
***  v1    0.3 CLI RX  106
**** v1    0.3 CLI RX|Message from VCC-compiler:
**** v1    0.3 CLI RX|Security: Privilege proc_setid missing, will not change uid/gid
**** v1    0.3 CLI RX|Unused backend c, defined:
**** v1    0.3 CLI RX|('<vcl.inline>' Line 4 Pos 17)
**** v1    0.3 CLI RX|        backend c { .host = "127.0.0.1"; }
**** v1    0.3 CLI RX|----------------#-------------------------
**** v1    0.3 CLI RX|
**** v1    0.3 CLI RX|Running VCC-compiler failed, exited with 2
**** v1    0.3 CLI RX|VCL compilation failed
**   v1    0.3 VCL compilation failed (as expected)
***  v1    0.3 Found expected string: ("Unused backend c, defined:")
*    top   0.3 RESETTING after ../../../bin/varnishtest/tests/v00031.vtc
**   v1    0.3 Wait
**** v1    0.3 CLI TX|backend.list
***  v1    0.3 CLI RX  101
**** v1    0.3 CLI RX|Unknown request in manager process (child not running).
**** v1    0.3 CLI RX|Type 'help' for more info.
**   v1    0.3 Stop
**** v1    0.3 CLI TX|stop
***  v1    0.3 CLI RX  300
**** v1    0.3 CLI RX|Child in state stopped
**** v1    0.3 CLI TX|status
***  v1    0.3 CLI RX  200
**** v1    0.3 CLI RX|Child in state stopped
**** v1    0.3 STDOUT poll 0x10
**   v1    0.3 R 62486 Status: 0000 (u 0.065000 s 0.068000)
*    diag  0.0 ............................................................
#    top  TEST ../../../bin/varnishtest/tests/v00031.vtc TIMED OUT (kill -9)
#    top  TEST ../../../bin/varnishtest/tests/v00031.vtc FAILED (60.002) signal=9

1 @ SunOS 5.11 i86pc 1.04 64_sun12.4 uplex

*    top   0.0 TEST ../../../bin/varnishtest/tests/v00031.vtc starting
[...]
*    top   0.0 TEST param vcc_err_unref
[...]
***  v1    0.2 CLI RX  200
**   v1    0.2 CLI 200 <param.set vcc_err_unref true>
**   top   0.2 === varnish v1 -errvcl {Unused backend c, defined:} {
**** v1    0.2 CLI TX|vcl.inline vcl3 << %XJEIFLH|)Xspa8P
**** v1    0.2 CLI TX|vcl 4.0;
**** v1    0.2 CLI TX|
**** v1    0.2 CLI TX|\tbackend b { .host = "127.0.0.1"; }
**** v1    0.2 CLI TX|\tbackend c { .host = "127.0.0.1"; }
**** v1    0.2 CLI TX|
**** v1    0.2 CLI TX|%XJEIFLH|)Xspa8P
***  v1    0.2 CLI RX  106
**** v1    0.2 CLI RX|Message from VCC-compiler:
**** v1    0.2 CLI RX|Security: Privilege proc_setid missing, will not change uid/gid
**** v1    0.2 CLI RX|Unused backend c, defined:
**** v1    0.2 CLI RX|('<vcl.inline>' Line 4 Pos 17)
**** v1    0.2 CLI RX|        backend c { .host = "127.0.0.1"; }
**** v1    0.2 CLI RX|----------------#-------------------------
**** v1    0.2 CLI RX|
**** v1    0.2 CLI RX|Running VCC-compiler failed, exited with 2
**** v1    0.2 CLI RX|VCL compilation failed
**   v1    0.2 VCL compilation failed (as expected)
***  v1    0.2 Found expected string: ("Unused backend c, defined:")
*    top   0.2 RESETTING after ../../../bin/varnishtest/tests/v00031.vtc
**   v1    0.2 Wait
**** v1    0.2 CLI TX|backend.list
***  v1    0.2 CLI RX  101
**** v1    0.2 CLI RX|Unknown request in manager process (child not running).
**** v1    0.2 CLI RX|Type 'help' for more info.
**   v1    0.2 Stop
**** v1    0.2 CLI TX|stop
***  v1    0.2 CLI RX  300
**** v1    0.2 CLI RX|Child in state stopped
**** v1    0.2 CLI TX|status
***  v1    0.2 CLI RX  200
**** v1    0.2 CLI RX|Child in state stopped
**** v1    0.2 STDOUT poll 0x10
**   v1    0.2 R 20966 Status: 0000 (u 0.060000 s 0.089000)
*    diag  0.0 ............................................................
#    top  TEST ../../../bin/varnishtest/tests/v00031.vtc TIMED OUT (kill -9)
#    top  TEST ../../../bin/varnishtest/tests/v00031.vtc FAILED (60.004) signal=9

1 @ SunOS 5.11 i86pc 1.04 32_gcc4.7 uplex

*    top   0.0 TEST ../../../bin/varnishtest/tests/v00031.vtc starting
[...]
*    top   0.0 TEST param vcc_err_unref
[...]
***  v1    0.3 CLI RX  200
**   v1    0.3 CLI 200 <param.set vcc_err_unref true>
**   top   0.3 === varnish v1 -errvcl {Unused backend c, defined:} {
**** v1    0.3 CLI TX|vcl.inline vcl3 << %XJEIFLH|)Xspa8P
**** v1    0.3 CLI TX|vcl 4.0;
**** v1    0.3 CLI TX|
**** v1    0.3 CLI TX|\tbackend b { .host = "127.0.0.1"; }
**** v1    0.3 CLI TX|\tbackend c { .host = "127.0.0.1"; }
**** v1    0.3 CLI TX|
**** v1    0.3 CLI TX|%XJEIFLH|)Xspa8P
***  v1    0.3 CLI RX  106
**** v1    0.3 CLI RX|Message from VCC-compiler:
**** v1    0.3 CLI RX|Security: Privilege proc_setid missing, will not change uid/gid
**** v1    0.3 CLI RX|Unused backend c, defined:
**** v1    0.3 CLI RX|('<vcl.inline>' Line 4 Pos 17)
**** v1    0.3 CLI RX|        backend c { .host = "127.0.0.1"; }
**** v1    0.3 CLI RX|----------------#-------------------------
**** v1    0.3 CLI RX|
**** v1    0.3 CLI RX|Running VCC-compiler failed, exited with 2
**** v1    0.3 CLI RX|VCL compilation failed
**   v1    0.3 VCL compilation failed (as expected)
***  v1    0.3 Found expected string: ("Unused backend c, defined:")
*    top   0.3 RESETTING after ../../../bin/varnishtest/tests/v00031.vtc
**   v1    0.3 Wait
**** v1    0.3 CLI TX|backend.list
***  v1    0.3 CLI RX  101
**** v1    0.3 CLI RX|Unknown request in manager process (child not running).
**** v1    0.3 CLI RX|Type 'help' for more info.
**   v1    0.3 Stop
**** v1    0.3 CLI TX|stop
***  v1    0.3 CLI RX  300
**** v1    0.3 CLI RX|Child in state stopped
**** v1    0.3 CLI TX|status
***  v1    0.3 CLI RX  200
**** v1    0.3 CLI RX|Child in state stopped
**** v1    0.3 STDOUT poll 0x10
**   v1    0.3 R 6589 Status: 0000 (u 0.066000 s 0.067000)
*    diag  0.0 ............................................................
#    top  TEST ../../../bin/varnishtest/tests/v00031.vtc TIMED OUT (kill -9)
#    top  TEST ../../../bin/varnishtest/tests/v00031.vtc FAILED (60.002) signal=9

1 @ SunOS 5.11 i86pc 1.04 32_sun12.4 uplex

*    top   0.0 TEST ../../../bin/varnishtest/tests/v00031.vtc starting
[...]
*    top   0.0 TEST param vcc_err_unref
[...]
***  v1    0.2 CLI RX  200
**   v1    0.2 CLI 200 <param.set vcc_err_unref true>
**   top   0.2 === varnish v1 -errvcl {Unused backend c, defined:} {
**** v1    0.2 CLI TX|vcl.inline vcl3 << %XJEIFLH|)Xspa8P
**** v1    0.2 CLI TX|vcl 4.0;
**** v1    0.2 CLI TX|
**** v1    0.2 CLI TX|\tbackend b { .host = "127.0.0.1"; }
**** v1    0.2 CLI TX|\tbackend c { .host = "127.0.0.1"; }
**** v1    0.2 CLI TX|
**** v1    0.2 CLI TX|%XJEIFLH|)Xspa8P
***  v1    0.2 CLI RX  106
**** v1    0.2 CLI RX|Message from VCC-compiler:
**** v1    0.2 CLI RX|Security: Privilege proc_setid missing, will not change uid/gid
**** v1    0.2 CLI RX|Unused backend c, defined:
**** v1    0.2 CLI RX|('<vcl.inline>' Line 4 Pos 17)
**** v1    0.2 CLI RX|        backend c { .host = "127.0.0.1"; }
**** v1    0.2 CLI RX|----------------#-------------------------
**** v1    0.2 CLI RX|
**** v1    0.2 CLI RX|Running VCC-compiler failed, exited with 2
**** v1    0.2 CLI RX|VCL compilation failed
**   v1    0.2 VCL compilation failed (as expected)
***  v1    0.2 Found expected string: ("Unused backend c, defined:")
*    top   0.2 RESETTING after ../../../bin/varnishtest/tests/v00031.vtc
**   v1    0.2 Wait
**** v1    0.2 CLI TX|backend.list
***  v1    0.2 CLI RX  101
**** v1    0.2 CLI RX|Unknown request in manager process (child not running).
**** v1    0.2 CLI RX|Type 'help' for more info.
**   v1    0.2 Stop
**** v1    0.2 CLI TX|stop
***  v1    0.2 CLI RX  300
**** v1    0.2 CLI RX|Child in state stopped
**** v1    0.2 CLI TX|status
***  v1    0.2 CLI RX  200
**** v1    0.2 CLI RX|Child in state stopped
**** v1    0.2 STDOUT poll 0x10
**   v1    0.2 R 72654 Status: 0000 (u 0.047000 s 0.055000)
*    diag  0.0 ............................................................
#    top  TEST ../../../bin/varnishtest/tests/v00031.vtc TIMED OUT (kill -9)
#    top  TEST ../../../bin/varnishtest/tests/v00031.vtc FAILED (60.002) signal=9

1 @ SunOS 5.11 i86pc 1.04 32_sun12.4 uplex

*    top   0.0 TEST ../../../bin/varnishtest/tests/v00031.vtc starting
[...]
*    top   0.0 TEST param vcc_err_unref
[...]
***  v1    0.2 CLI RX  200
**   v1    0.2 CLI 200 <param.set vcc_err_unref true>
**   top   0.2 === varnish v1 -errvcl {Unused backend c, defined:} {
**** v1    0.2 CLI TX|vcl.inline vcl3 << %XJEIFLH|)Xspa8P
**** v1    0.2 CLI TX|vcl 4.0;
**** v1    0.2 CLI TX|
**** v1    0.2 CLI TX|\tbackend b { .host = "127.0.0.1"; }
**** v1    0.2 CLI TX|\tbackend c { .host = "127.0.0.1"; }
**** v1    0.2 CLI TX|
**** v1    0.2 CLI TX|%XJEIFLH|)Xspa8P
***  v1    0.2 CLI RX  106
**** v1    0.2 CLI RX|Message from VCC-compiler:
**** v1    0.2 CLI RX|Security: Privilege proc_setid missing, will not change uid/gid
**** v1    0.2 CLI RX|Unused backend c, defined:
**** v1    0.2 CLI RX|('<vcl.inline>' Line 4 Pos 17)
**** v1    0.2 CLI RX|        backend c { .host = "127.0.0.1"; }
**** v1    0.2 CLI RX|----------------#-------------------------
**** v1    0.2 CLI RX|
**** v1    0.2 CLI RX|Running VCC-compiler failed, exited with 2
**** v1    0.2 CLI RX|VCL compilation failed
**   v1    0.2 VCL compilation failed (as expected)
***  v1    0.2 Found expected string: ("Unused backend c, defined:")
*    top   0.2 RESETTING after ../../../bin/varnishtest/tests/v00031.vtc
**   v1    0.2 Wait
**** v1    0.2 CLI TX|backend.list
***  v1    0.2 CLI RX  101
**** v1    0.2 CLI RX|Unknown request in manager process (child not running).
**** v1    0.2 CLI RX|Type 'help' for more info.
**   v1    0.2 Stop
**** v1    0.2 CLI TX|stop
***  v1    0.2 CLI RX  300
**** v1    0.2 CLI RX|Child in state stopped
**** v1    0.2 CLI TX|status
***  v1    0.2 CLI RX  200
**** v1    0.2 CLI RX|Child in state stopped
**** v1    0.2 STDOUT poll 0x10
**   v1    0.2 R 82464 Status: 0000 (u 0.060000 s 0.084000)
*    diag  0.0 ............................................................
#    top  TEST ../../../bin/varnishtest/tests/v00031.vtc TIMED OUT (kill -9)
#    top  TEST ../../../bin/varnishtest/tests/v00031.vtc FAILED (60.002) signal=9

d3baf27

1 @ SunOS 5.11 i86pc 1.04 32_gcc4.7 uplex

*    top   0.0 TEST ../../../bin/varnishtest/tests/v00031.vtc starting
[...]
*    top   0.0 TEST param vcc_err_unref
[...]
***  v1    0.2 CLI RX  200
**   v1    0.2 CLI 200 <param.set vcc_err_unref true>
**   top   0.2 === varnish v1 -errvcl {Unused backend c, defined:} {
**** v1    0.2 CLI TX|vcl.inline vcl3 << %XJEIFLH|)Xspa8P
**** v1    0.2 CLI TX|vcl 4.0;
**** v1    0.2 CLI TX|
**** v1    0.2 CLI TX|\tbackend b { .host = "127.0.0.1"; }
**** v1    0.2 CLI TX|\tbackend c { .host = "127.0.0.1"; }
**** v1    0.2 CLI TX|
**** v1    0.2 CLI TX|%XJEIFLH|)Xspa8P
***  v1    0.3 CLI RX  106
**** v1    0.3 CLI RX|Message from VCC-compiler:
**** v1    0.3 CLI RX|Security: Privilege proc_setid missing, will not change uid/gid
**** v1    0.3 CLI RX|Unused backend c, defined:
**** v1    0.3 CLI RX|('<vcl.inline>' Line 4 Pos 17)
**** v1    0.3 CLI RX|        backend c { .host = "127.0.0.1"; }
**** v1    0.3 CLI RX|----------------#-------------------------
**** v1    0.3 CLI RX|
**** v1    0.3 CLI RX|Running VCC-compiler failed, exited with 2
**** v1    0.3 CLI RX|VCL compilation failed
**   v1    0.3 VCL compilation failed (as expected)
***  v1    0.3 Found expected string: ("Unused backend c, defined:")
*    top   0.3 RESETTING after ../../../bin/varnishtest/tests/v00031.vtc
**   v1    0.3 Wait
**** v1    0.3 CLI TX|backend.list
***  v1    0.3 CLI RX  101
**** v1    0.3 CLI RX|Unknown request in manager process (child not running).
**** v1    0.3 CLI RX|Type 'help' for more info.
**   v1    0.3 Stop
**** v1    0.3 CLI TX|stop
***  v1    0.3 CLI RX  300
**** v1    0.3 CLI RX|Child in state stopped
**** v1    0.3 CLI TX|status
***  v1    0.3 CLI RX  200
**** v1    0.3 CLI RX|Child in state stopped
**** v1    0.3 STDOUT poll 0x10
**   v1    0.3 R 5716 Status: 0000 (u 0.066000 s 0.060000)
*    diag  0.0 ............................................................
#    top  TEST ../../../bin/varnishtest/tests/v00031.vtc TIMED OUT (kill -9)
#    top  TEST ../../../bin/varnishtest/tests/v00031.vtc FAILED (60.002) signal=9

1 @ SunOS 5.11 i86pc 1.04 32_sun12.4 uplex

*    top   0.0 TEST ../../../bin/varnishtest/tests/v00031.vtc starting
[...]
*    top   0.0 TEST param vcc_err_unref
[...]
***  v1    0.2 CLI RX  200
**   v1    0.2 CLI 200 <param.set vcc_err_unref true>
**   top   0.2 === varnish v1 -errvcl {Unused backend c, defined:} {
**** v1    0.2 CLI TX|vcl.inline vcl3 << %XJEIFLH|)Xspa8P
**** v1    0.2 CLI TX|vcl 4.0;
**** v1    0.2 CLI TX|
**** v1    0.2 CLI TX|\tbackend b { .host = "127.0.0.1"; }
**** v1    0.2 CLI TX|\tbackend c { .host = "127.0.0.1"; }
**** v1    0.2 CLI TX|
**** v1    0.2 CLI TX|%XJEIFLH|)Xspa8P
***  v1    0.3 CLI RX  106
**** v1    0.3 CLI RX|Message from VCC-compiler:
**** v1    0.3 CLI RX|Security: Privilege proc_setid missing, will not change uid/gid
**** v1    0.3 CLI RX|Unused backend c, defined:
**** v1    0.3 CLI RX|('<vcl.inline>' Line 4 Pos 17)
**** v1    0.3 CLI RX|        backend c { .host = "127.0.0.1"; }
**** v1    0.3 CLI RX|----------------#-------------------------
**** v1    0.3 CLI RX|
**** v1    0.3 CLI RX|Running VCC-compiler failed, exited with 2
**** v1    0.3 CLI RX|VCL compilation failed
**   v1    0.3 VCL compilation failed (as expected)
***  v1    0.3 Found expected string: ("Unused backend c, defined:")
*    top   0.3 RESETTING after ../../../bin/varnishtest/tests/v00031.vtc
**   v1    0.3 Wait
**** v1    0.3 CLI TX|backend.list
***  v1    0.3 CLI RX  101
**** v1    0.3 CLI RX|Unknown request in manager process (child not running).
**** v1    0.3 CLI RX|Type 'help' for more info.
**   v1    0.3 Stop
**** v1    0.3 CLI TX|stop
***  v1    0.3 CLI RX  300
**** v1    0.3 CLI RX|Child in state stopped
**** v1    0.3 CLI TX|status
***  v1    0.3 CLI RX  200
**** v1    0.3 CLI RX|Child in state stopped
**** v1    0.3 STDOUT poll 0x10
**   v1    0.3 R 34485 Status: 0000 (u 0.079000 s 0.098000)
*    diag  0.0 ............................................................
#    top  TEST ../../../bin/varnishtest/tests/v00031.vtc TIMED OUT (kill -9)
#    top  TEST ../../../bin/varnishtest/tests/v00031.vtc FAILED (60.002) signal=9

1 @ SunOS 5.11 i86pc 1.04 32_gcc4.7 uplex

*    top   0.0 TEST ../../../bin/varnishtest/tests/v00031.vtc starting
[...]
*    top   0.0 TEST param vcc_err_unref
[...]
***  v1    0.2 CLI RX  200
**   v1    0.2 CLI 200 <param.set vcc_err_unref true>
**   top   0.2 === varnish v1 -errvcl {Unused backend c, defined:} {
**** v1    0.2 CLI TX|vcl.inline vcl3 << %XJEIFLH|)Xspa8P
**** v1    0.2 CLI TX|vcl 4.0;
**** v1    0.2 CLI TX|
**** v1    0.2 CLI TX|\tbackend b { .host = "127.0.0.1"; }
**** v1    0.2 CLI TX|\tbackend c { .host = "127.0.0.1"; }
**** v1    0.2 CLI TX|
**** v1    0.2 CLI TX|%XJEIFLH|)Xspa8P
***  v1    0.2 CLI RX  106
**** v1    0.2 CLI RX|Message from VCC-compiler:
**** v1    0.2 CLI RX|Security: Privilege proc_setid missing, will not change uid/gid
**** v1    0.2 CLI RX|Unused backend c, defined:
**** v1    0.2 CLI RX|('<vcl.inline>' Line 4 Pos 17)
**** v1    0.2 CLI RX|        backend c { .host = "127.0.0.1"; }
**** v1    0.2 CLI RX|----------------#-------------------------
**** v1    0.2 CLI RX|
**** v1    0.2 CLI RX|Running VCC-compiler failed, exited with 2
**** v1    0.2 CLI RX|VCL compilation failed
**   v1    0.2 VCL compilation failed (as expected)
***  v1    0.2 Found expected string: ("Unused backend c, defined:")
*    top   0.2 RESETTING after ../../../bin/varnishtest/tests/v00031.vtc
**   v1    0.2 Wait
**** v1    0.2 CLI TX|backend.list
***  v1    0.2 CLI RX  101
**** v1    0.2 CLI RX|Unknown request in manager process (child not running).
**** v1    0.2 CLI RX|Type 'help' for more info.
**   v1    0.2 Stop
**** v1    0.2 CLI TX|stop
***  v1    0.2 CLI RX  300
**** v1    0.2 CLI RX|Child in state stopped
**** v1    0.2 CLI TX|status
***  v1    0.2 CLI RX  200
**** v1    0.2 CLI RX|Child in state stopped
**** v1    0.2 STDOUT poll 0x10
**   v1    0.2 R 21682 Status: 0000 (u 0.063000 s 0.058000)
*    diag  0.0 ............................................................
#    top  TEST ../../../bin/varnishtest/tests/v00031.vtc TIMED OUT (kill -9)
#    top  TEST ../../../bin/varnishtest/tests/v00031.vtc FAILED (60.002) signal=9

1 @ SunOS 5.11 i86pc 1.04 32_gcc4.7 uplex

*    top   0.0 TEST ../../../bin/varnishtest/tests/v00031.vtc starting
[...]
*    top   0.0 TEST param vcc_err_unref
[...]
***  v1    0.2 CLI RX  200
**   v1    0.2 CLI 200 <param.set vcc_err_unref true>
**   top   0.2 === varnish v1 -errvcl {Unused backend c, defined:} {
**** v1    0.2 CLI TX|vcl.inline vcl3 << %XJEIFLH|)Xspa8P
**** v1    0.2 CLI TX|vcl 4.0;
**** v1    0.2 CLI TX|
**** v1    0.2 CLI TX|\tbackend b { .host = "127.0.0.1"; }
**** v1    0.2 CLI TX|\tbackend c { .host = "127.0.0.1"; }
**** v1    0.2 CLI TX|
**** v1    0.2 CLI TX|%XJEIFLH|)Xspa8P
***  v1    0.3 CLI RX  106
**** v1    0.3 CLI RX|Message from VCC-compiler:
**** v1    0.3 CLI RX|Security: Privilege proc_setid missing, will not change uid/gid
**** v1    0.3 CLI RX|Unused backend c, defined:
**** v1    0.3 CLI RX|('<vcl.inline>' Line 4 Pos 17)
**** v1    0.3 CLI RX|        backend c { .host = "127.0.0.1"; }
**** v1    0.3 CLI RX|----------------#-------------------------
**** v1    0.3 CLI RX|
**** v1    0.3 CLI RX|Running VCC-compiler failed, exited with 2
**** v1    0.3 CLI RX|VCL compilation failed
**   v1    0.3 VCL compilation failed (as expected)
***  v1    0.3 Found expected string: ("Unused backend c, defined:")
*    top   0.3 RESETTING after ../../../bin/varnishtest/tests/v00031.vtc
**   v1    0.3 Wait
**** v1    0.3 CLI TX|backend.list
***  v1    0.3 CLI RX  101
**** v1    0.3 CLI RX|Unknown request in manager process (child not running).
**** v1    0.3 CLI RX|Type 'help' for more info.
**   v1    0.3 Stop
**** v1    0.3 CLI TX|stop
***  v1    0.3 CLI RX  300
**** v1    0.3 CLI RX|Child in state stopped
**** v1    0.3 CLI TX|status
***  v1    0.3 CLI RX  200
**** v1    0.3 CLI RX|Child in state stopped
**** v1    0.3 STDOUT poll 0x10
**   v1    0.3 R 59686 Status: 0000 (u 0.065000 s 0.059000)
*    diag  0.0 ............................................................
#    top  TEST ../../../bin/varnishtest/tests/v00031.vtc TIMED OUT (kill -9)
#    top  TEST ../../../bin/varnishtest/tests/v00031.vtc FAILED (60.002) signal=9

1 @ SunOS 5.11 i86pc 1.04 32_sun12.4 uplex

*    top   0.0 TEST ../../../bin/varnishtest/tests/v00031.vtc starting
[...]
*    top   0.0 TEST param vcc_err_unref
[...]
***  v1    0.2 CLI RX  200
**   v1    0.2 CLI 200 <param.set vcc_err_unref true>
**   top   0.2 === varnish v1 -errvcl {Unused backend c, defined:} {
**** v1    0.2 CLI TX|vcl.inline vcl3 << %XJEIFLH|)Xspa8P
**** v1    0.2 CLI TX|vcl 4.0;
**** v1    0.2 CLI TX|
**** v1    0.2 CLI TX|\tbackend b { .host = "127.0.0.1"; }
**** v1    0.2 CLI TX|\tbackend c { .host = "127.0.0.1"; }
**** v1    0.2 CLI TX|
**** v1    0.2 CLI TX|%XJEIFLH|)Xspa8P
***  v1    0.2 CLI RX  106
**** v1    0.2 CLI RX|Message from VCC-compiler:
**** v1    0.2 CLI RX|Security: Privilege proc_setid missing, will not change uid/gid
**** v1    0.2 CLI RX|Unused backend c, defined:
**** v1    0.2 CLI RX|('<vcl.inline>' Line 4 Pos 17)
**** v1    0.2 CLI RX|        backend c { .host = "127.0.0.1"; }
**** v1    0.2 CLI RX|----------------#-------------------------
**** v1    0.2 CLI RX|
**** v1    0.2 CLI RX|Running VCC-compiler failed, exited with 2
**** v1    0.2 CLI RX|VCL compilation failed
**   v1    0.2 VCL compilation failed (as expected)
***  v1    0.2 Found expected string: ("Unused backend c, defined:")
*    top   0.2 RESETTING after ../../../bin/varnishtest/tests/v00031.vtc
**   v1    0.2 Wait
**** v1    0.2 CLI TX|backend.list
***  v1    0.2 CLI RX  101
**** v1    0.2 CLI RX|Unknown request in manager process (child not running).
**** v1    0.2 CLI RX|Type 'help' for more info.
**   v1    0.2 Stop
**** v1    0.2 CLI TX|stop
***  v1    0.2 CLI RX  300
**** v1    0.2 CLI RX|Child in state stopped
**** v1    0.2 CLI TX|status
***  v1    0.2 CLI RX  200
**** v1    0.2 CLI RX|Child in state stopped
**** v1    0.2 STDOUT poll 0x10
**   v1    0.2 R 10044 Status: 0000 (u 0.060000 s 0.076000)
*    diag  0.0 ............................................................
#    top  TEST ../../../bin/varnishtest/tests/v00031.vtc TIMED OUT (kill -9)
#    top  TEST ../../../bin/varnishtest/tests/v00031.vtc FAILED (60.002) signal=9

1 @ SunOS 5.11 i86pc 1.04 32_sun12.4 uplex

*    top   0.0 TEST ../../../bin/varnishtest/tests/v00031.vtc starting
[...]
*    top   0.0 TEST param vcc_err_unref
[...]
***  v1    0.2 CLI RX  200
**   v1    0.2 CLI 200 <param.set vcc_err_unref true>
**   top   0.2 === varnish v1 -errvcl {Unused backend c, defined:} {
**** v1    0.2 CLI TX|vcl.inline vcl3 << %XJEIFLH|)Xspa8P
**** v1    0.2 CLI TX|vcl 4.0;
**** v1    0.2 CLI TX|
**** v1    0.2 CLI TX|\tbackend b { .host = "127.0.0.1"; }
**** v1    0.2 CLI TX|\tbackend c { .host = "127.0.0.1"; }
**** v1    0.2 CLI TX|
**** v1    0.2 CLI TX|%XJEIFLH|)Xspa8P
***  v1    0.2 CLI RX  106
**** v1    0.2 CLI RX|Message from VCC-compiler:
**** v1    0.2 CLI RX|Security: Privilege proc_setid missing, will not change uid/gid
**** v1    0.2 CLI RX|Unused backend c, defined:
**** v1    0.2 CLI RX|('<vcl.inline>' Line 4 Pos 17)
**** v1    0.2 CLI RX|        backend c { .host = "127.0.0.1"; }
**** v1    0.2 CLI RX|----------------#-------------------------
**** v1    0.2 CLI RX|
**** v1    0.2 CLI RX|Running VCC-compiler failed, exited with 2
**** v1    0.2 CLI RX|VCL compilation failed
**   v1    0.2 VCL compilation failed (as expected)
***  v1    0.2 Found expected string: ("Unused backend c, defined:")
*    top   0.2 RESETTING after ../../../bin/varnishtest/tests/v00031.vtc
**   v1    0.2 Wait
**** v1    0.2 CLI TX|backend.list
***  v1    0.2 CLI RX  101
**** v1    0.2 CLI RX|Unknown request in manager process (child not running).
**** v1    0.2 CLI RX|Type 'help' for more info.
**   v1    0.2 Stop
**** v1    0.2 CLI TX|stop
***  v1    0.2 CLI RX  300
**** v1    0.2 CLI RX|Child in state stopped
**** v1    0.2 CLI TX|status
***  v1    0.2 CLI RX  200
**** v1    0.2 CLI RX|Child in state stopped
**** v1    0.2 STDOUT poll 0x10
**   v1    0.2 R 33950 Status: 0000 (u 0.056000 s 0.076000)
*    diag  0.0 ............................................................
#    top  TEST ../../../bin/varnishtest/tests/v00031.vtc TIMED OUT (kill -9)
#    top  TEST ../../../bin/varnishtest/tests/v00031.vtc FAILED (60.002) signal=9

1 @ SunOS 5.11 i86pc 1.04 32_gcc4.7 uplex

*    top   0.0 TEST ../../../bin/varnishtest/tests/v00031.vtc starting
[...]
*    top   0.0 TEST param vcc_err_unref
[...]
***  v1    0.3 CLI RX  200
**   v1    0.3 CLI 200 <param.set vcc_err_unref true>
**   top   0.3 === varnish v1 -errvcl {Unused backend c, defined:} {
**** v1    0.3 CLI TX|vcl.inline vcl3 << %XJEIFLH|)Xspa8P
**** v1    0.3 CLI TX|vcl 4.0;
**** v1    0.3 CLI TX|
**** v1    0.3 CLI TX|\tbackend b { .host = "127.0.0.1"; }
**** v1    0.3 CLI TX|\tbackend c { .host = "127.0.0.1"; }
**** v1    0.3 CLI TX|
**** v1    0.3 CLI TX|%XJEIFLH|)Xspa8P
***  v1    0.3 CLI RX  106
**** v1    0.3 CLI RX|Message from VCC-compiler:
**** v1    0.3 CLI RX|Security: Privilege proc_setid missing, will not change uid/gid
**** v1    0.3 CLI RX|Unused backend c, defined:
**** v1    0.3 CLI RX|('<vcl.inline>' Line 4 Pos 17)
**** v1    0.3 CLI RX|        backend c { .host = "127.0.0.1"; }
**** v1    0.3 CLI RX|----------------#-------------------------
**** v1    0.3 CLI RX|
**** v1    0.3 CLI RX|Running VCC-compiler failed, exited with 2
**** v1    0.3 CLI RX|VCL compilation failed
**   v1    0.3 VCL compilation failed (as expected)
***  v1    0.3 Found expected string: ("Unused backend c, defined:")
*    top   0.3 RESETTING after ../../../bin/varnishtest/tests/v00031.vtc
**   v1    0.3 Wait
**** v1    0.3 CLI TX|backend.list
***  v1    0.3 CLI RX  101
**** v1    0.3 CLI RX|Unknown request in manager process (child not running).
**** v1    0.3 CLI RX|Type 'help' for more info.
**   v1    0.3 Stop
**** v1    0.3 CLI TX|stop
***  v1    0.3 CLI RX  300
**** v1    0.3 CLI RX|Child in state stopped
**** v1    0.3 CLI TX|status
***  v1    0.3 CLI RX  200
**** v1    0.3 CLI RX|Child in state stopped
**** v1    0.3 STDOUT poll 0x10
**   v1    0.3 R 67978 Status: 0000 (u 0.066000 s 0.064000)
*    diag  0.0 ............................................................
#    top  TEST ../../../bin/varnishtest/tests/v00031.vtc TIMED OUT (kill -9)
#    top  TEST ../../../bin/varnishtest/tests/v00031.vtc FAILED (60.003) signal=9

1 @ SunOS 5.11 i86pc 1.04 32_sun12.4 uplex

*    top   0.0 TEST ../../../bin/varnishtest/tests/v00031.vtc starting
[...]
*    top   0.0 TEST param vcc_err_unref
[...]
***  v1    0.2 CLI RX  200
**   v1    0.2 CLI 200 <param.set vcc_err_unref true>
**   top   0.2 === varnish v1 -errvcl {Unused backend c, defined:} {
**** v1    0.2 CLI TX|vcl.inline vcl3 << %XJEIFLH|)Xspa8P
**** v1    0.2 CLI TX|vcl 4.0;
**** v1    0.2 CLI TX|
**** v1    0.2 CLI TX|\tbackend b { .host = "127.0.0.1"; }
**** v1    0.2 CLI TX|\tbackend c { .host = "127.0.0.1"; }
**** v1    0.2 CLI TX|
**** v1    0.2 CLI TX|%XJEIFLH|)Xspa8P
***  v1    0.2 CLI RX  106
**** v1    0.2 CLI RX|Message from VCC-compiler:
**** v1    0.2 CLI RX|Security: Privilege proc_setid missing, will not change uid/gid
**** v1    0.2 CLI RX|Unused backend c, defined:
**** v1    0.2 CLI RX|('<vcl.inline>' Line 4 Pos 17)
**** v1    0.2 CLI RX|        backend c { .host = "127.0.0.1"; }
**** v1    0.2 CLI RX|----------------#-------------------------
**** v1    0.2 CLI RX|
**** v1    0.2 CLI RX|Running VCC-compiler failed, exited with 2
**** v1    0.2 CLI RX|VCL compilation failed
**   v1    0.2 VCL compilation failed (as expected)
***  v1    0.2 Found expected string: ("Unused backend c, defined:")
*    top   0.2 RESETTING after ../../../bin/varnishtest/tests/v00031.vtc
**   v1    0.2 Wait
**** v1    0.2 CLI TX|backend.list
***  v1    0.2 CLI RX  101
**** v1    0.2 CLI RX|Unknown request in manager process (child not running).
**** v1    0.2 CLI RX|Type 'help' for more info.
**   v1    0.2 Stop
**** v1    0.2 CLI TX|stop
***  v1    0.2 CLI RX  300
**** v1    0.2 CLI RX|Child in state stopped
**** v1    0.2 CLI TX|status
***  v1    0.2 CLI RX  200
**** v1    0.2 CLI RX|Child in state stopped
**** v1    0.2 STDOUT poll 0x10
**   v1    0.2 R 23299 Status: 0000 (u 0.056000 s 0.072000)
*    diag  0.0 ............................................................
#    top  TEST ../../../bin/varnishtest/tests/v00031.vtc TIMED OUT (kill -9)
#    top  TEST ../../../bin/varnishtest/tests/v00031.vtc FAILED (60.002) signal=9

1 @ SunOS 5.11 i86pc 1.04 64_sun12.4 uplex

*    top   0.0 TEST ../../../bin/varnishtest/tests/v00031.vtc starting
[...]
*    top   0.0 TEST param vcc_err_unref
[...]
***  v1    0.2 CLI RX  200
**   v1    0.2 CLI 200 <param.set vcc_err_unref true>
**   top   0.2 === varnish v1 -errvcl {Unused backend c, defined:} {
**** v1    0.2 CLI TX|vcl.inline vcl3 << %XJEIFLH|)Xspa8P
**** v1    0.2 CLI TX|vcl 4.0;
**** v1    0.2 CLI TX|
**** v1    0.2 CLI TX|\tbackend b { .host = "127.0.0.1"; }
**** v1    0.2 CLI TX|\tbackend c { .host = "127.0.0.1"; }
**** v1    0.2 CLI TX|
**** v1    0.2 CLI TX|%XJEIFLH|)Xspa8P
***  v1    0.2 CLI RX  106
**** v1    0.2 CLI RX|Message from VCC-compiler:
**** v1    0.2 CLI RX|Security: Privilege proc_setid missing, will not change uid/gid
**** v1    0.2 CLI RX|Unused backend c, defined:
**** v1    0.2 CLI RX|('<vcl.inline>' Line 4 Pos 17)
**** v1    0.2 CLI RX|        backend c { .host = "127.0.0.1"; }
**** v1    0.2 CLI RX|----------------#-------------------------
**** v1    0.2 CLI RX|
**** v1    0.2 CLI RX|Running VCC-compiler failed, exited with 2
**** v1    0.2 CLI RX|VCL compilation failed
**   v1    0.2 VCL compilation failed (as expected)
***  v1    0.2 Found expected string: ("Unused backend c, defined:")
*    top   0.2 RESETTING after ../../../bin/varnishtest/tests/v00031.vtc
**   v1    0.2 Wait
**** v1    0.2 CLI TX|backend.list
***  v1    0.2 CLI RX  101
**** v1    0.2 CLI RX|Unknown request in manager process (child not running).
**** v1    0.2 CLI RX|Type 'help' for more info.
**   v1    0.2 Stop
**** v1    0.2 CLI TX|stop
***  v1    0.2 CLI RX  300
**** v1    0.2 CLI RX|Child in state stopped
**** v1    0.2 CLI TX|status
***  v1    0.2 CLI RX  200
**** v1    0.2 CLI RX|Child in state stopped
**** v1    0.2 STDOUT poll 0x10
**   v1    0.2 R 17652 Status: 0000 (u 0.060000 s 0.090000)
*    diag  0.0 ............................................................
#    top  TEST ../../../bin/varnishtest/tests/v00031.vtc TIMED OUT (kill -9)
#    top  TEST ../../../bin/varnishtest/tests/v00031.vtc FAILED (60.003) signal=9

1 @ SunOS 5.11 i86pc 1.04 32_sun12.4 uplex

*    top   0.0 TEST ../../../bin/varnishtest/tests/v00031.vtc starting
[...]
*    top   0.0 TEST param vcc_err_unref
[...]
***  v1    0.2 CLI RX  200
**   v1    0.2 CLI 200 <param.set vcc_err_unref true>
**   top   0.2 === varnish v1 -errvcl {Unused backend c, defined:} {
**** v1    0.2 CLI TX|vcl.inline vcl3 << %XJEIFLH|)Xspa8P
**** v1    0.2 CLI TX|vcl 4.0;
**** v1    0.2 CLI TX|
**** v1    0.2 CLI TX|\tbackend b { .host = "127.0.0.1"; }
**** v1    0.2 CLI TX|\tbackend c { .host = "127.0.0.1"; }
**** v1    0.2 CLI TX|
**** v1    0.2 CLI TX|%XJEIFLH|)Xspa8P
***  v1    0.2 CLI RX  106
**** v1    0.2 CLI RX|Message from VCC-compiler:
**** v1    0.2 CLI RX|Security: Privilege proc_setid missing, will not change uid/gid
**** v1    0.2 CLI RX|Unused backend c, defined:
**** v1    0.2 CLI RX|('<vcl.inline>' Line 4 Pos 17)
**** v1    0.2 CLI RX|        backend c { .host = "127.0.0.1"; }
**** v1    0.2 CLI RX|----------------#-------------------------
**** v1    0.2 CLI RX|
**** v1    0.2 CLI RX|Running VCC-compiler failed, exited with 2
**** v1    0.2 CLI RX|VCL compilation failed
**   v1    0.2 VCL compilation failed (as expected)
***  v1    0.2 Found expected string: ("Unused backend c, defined:")
*    top   0.2 RESETTING after ../../../bin/varnishtest/tests/v00031.vtc
**   v1    0.2 Wait
**** v1    0.2 CLI TX|backend.list
***  v1    0.2 CLI RX  101
**** v1    0.2 CLI RX|Unknown request in manager process (child not running).
**** v1    0.2 CLI RX|Type 'help' for more info.
**   v1    0.2 Stop
**** v1    0.2 CLI TX|stop
***  v1    0.2 CLI RX  300
**** v1    0.2 CLI RX|Child in state stopped
**** v1    0.2 CLI TX|status
***  v1    0.2 CLI RX  200
**** v1    0.2 CLI RX|Child in state stopped
**** v1    0.2 STDOUT poll 0x10
**   v1    0.2 R 36635 Status: 0000 (u 0.054000 s 0.075000)
*    diag  0.0 ............................................................
#    top  TEST ../../../bin/varnishtest/tests/v00031.vtc TIMED OUT (kill -9)
#    top  TEST ../../../bin/varnishtest/tests/v00031.vtc FAILED (60.002) signal=9

1 @ SunOS 5.11 i86pc 1.04 64_sun12.4 uplex

*    top   0.0 TEST ../../../bin/varnishtest/tests/v00031.vtc starting
[...]
*    top   0.0 TEST param vcc_err_unref
[...]
***  v1    0.2 CLI RX  200
**   v1    0.2 CLI 200 <param.set vcc_err_unref true>
**   top   0.2 === varnish v1 -errvcl {Unused backend c, defined:} {
**** v1    0.2 CLI TX|vcl.inline vcl3 << %XJEIFLH|)Xspa8P
**** v1    0.2 CLI TX|vcl 4.0;
**** v1    0.2 CLI TX|
**** v1    0.2 CLI TX|\tbackend b { .host = "127.0.0.1"; }
**** v1    0.2 CLI TX|\tbackend c { .host = "127.0.0.1"; }
**** v1    0.2 CLI TX|
**** v1    0.2 CLI TX|%XJEIFLH|)Xspa8P
***  v1    0.2 CLI RX  106
**** v1    0.2 CLI RX|Message from VCC-compiler:
**** v1    0.2 CLI RX|Security: Privilege proc_setid missing, will not change uid/gid
**** v1    0.2 CLI RX|Unused backend c, defined:
**** v1    0.2 CLI RX|('<vcl.inline>' Line 4 Pos 17)
**** v1    0.2 CLI RX|        backend c { .host = "127.0.0.1"; }
**** v1    0.2 CLI RX|----------------#-------------------------
**** v1    0.2 CLI RX|
**** v1    0.2 CLI RX|Running VCC-compiler failed, exited with 2
**** v1    0.2 CLI RX|VCL compilation failed
**   v1    0.2 VCL compilation failed (as expected)
***  v1    0.2 Found expected string: ("Unused backend c, defined:")
*    top   0.2 RESETTING after ../../../bin/varnishtest/tests/v00031.vtc
**   v1    0.2 Wait
**** v1    0.2 CLI TX|backend.list
***  v1    0.2 CLI RX  101
**** v1    0.2 CLI RX|Unknown request in manager process (child not running).
**** v1    0.2 CLI RX|Type 'help' for more info.
**   v1    0.2 Stop
**** v1    0.2 CLI TX|stop
***  v1    0.2 CLI RX  300
**** v1    0.2 CLI RX|Child in state stopped
**** v1    0.2 CLI TX|status
***  v1    0.2 CLI RX  200
**** v1    0.2 CLI RX|Child in state stopped
**** v1    0.2 STDOUT poll 0x10
**   v1    0.2 R 98695 Status: 0000 (u 0.058000 s 0.088000)
*    diag  0.0 ............................................................
#    top  TEST ../../../bin/varnishtest/tests/v00031.vtc TIMED OUT (kill -9)
#    top  TEST ../../../bin/varnishtest/tests/v00031.vtc FAILED (60.004) signal=9

1 @ SunOS 5.11 i86pc 1.04 64_sun12.4 uplex

*    top   0.0 TEST ../../../bin/varnishtest/tests/v00031.vtc starting
[...]
*    top   0.0 TEST param vcc_err_unref
[...]
***  v1    0.2 CLI RX  200
**   v1    0.2 CLI 200 <param.set vcc_err_unref true>
**   top   0.2 === varnish v1 -errvcl {Unused backend c, defined:} {
**** v1    0.2 CLI TX|vcl.inline vcl3 << %XJEIFLH|)Xspa8P
**** v1    0.2 CLI TX|vcl 4.0;
**** v1    0.2 CLI TX|
**** v1    0.2 CLI TX|\tbackend b { .host = "127.0.0.1"; }
**** v1    0.2 CLI TX|\tbackend c { .host = "127.0.0.1"; }
**** v1    0.2 CLI TX|
**** v1    0.2 CLI TX|%XJEIFLH|)Xspa8P
***  v1    0.2 CLI RX  106
**** v1    0.2 CLI RX|Message from VCC-compiler:
**** v1    0.2 CLI RX|Security: Privilege proc_setid missing, will not change uid/gid
**** v1    0.2 CLI RX|Unused backend c, defined:
**** v1    0.2 CLI RX|('<vcl.inline>' Line 4 Pos 17)
**** v1    0.2 CLI RX|        backend c { .host = "127.0.0.1"; }
**** v1    0.2 CLI RX|----------------#-------------------------
**** v1    0.2 CLI RX|
**** v1    0.2 CLI RX|Running VCC-compiler failed, exited with 2
**** v1    0.2 CLI RX|VCL compilation failed
**   v1    0.2 VCL compilation failed (as expected)
***  v1    0.2 Found expected string: ("Unused backend c, defined:")
*    top   0.2 RESETTING after ../../../bin/varnishtest/tests/v00031.vtc
**   v1    0.2 Wait
**** v1    0.2 CLI TX|backend.list
***  v1    0.2 CLI RX  101
**** v1    0.2 CLI RX|Unknown request in manager process (child not running).
**** v1    0.2 CLI RX|Type 'help' for more info.
**   v1    0.2 Stop
**** v1    0.2 CLI TX|stop
***  v1    0.2 CLI RX  300
**** v1    0.2 CLI RX|Child in state stopped
**** v1    0.2 CLI TX|status
***  v1    0.2 CLI RX  200
**** v1    0.2 CLI RX|Child in state stopped
**** v1    0.2 STDOUT poll 0x10
**   v1    0.2 R 31284 Status: 0000 (u 0.069000 s 0.102000)
*    diag  0.0 ............................................................
#    top  TEST ../../../bin/varnishtest/tests/v00031.vtc TIMED OUT (kill -9)
#    top  TEST ../../../bin/varnishtest/tests/v00031.vtc FAILED (60.004) signal=9

1 @ SunOS 5.11 i86pc 1.04 32_sun12.4 uplex

*    top   0.0 TEST ../../../bin/varnishtest/tests/v00031.vtc starting
[...]
*    top   0.0 TEST param vcc_err_unref
[...]
***  v1    0.2 CLI RX  200
**   v1    0.2 CLI 200 <param.set vcc_err_unref true>
**   top   0.2 === varnish v1 -errvcl {Unused backend c, defined:} {
**** v1    0.2 CLI TX|vcl.inline vcl3 << %XJEIFLH|)Xspa8P
**** v1    0.2 CLI TX|vcl 4.0;
**** v1    0.2 CLI TX|
**** v1    0.2 CLI TX|\tbackend b { .host = "127.0.0.1"; }
**** v1    0.2 CLI TX|\tbackend c { .host = "127.0.0.1"; }
**** v1    0.2 CLI TX|
**** v1    0.2 CLI TX|%XJEIFLH|)Xspa8P
***  v1    0.2 CLI RX  106
**** v1    0.2 CLI RX|Message from VCC-compiler:
**** v1    0.2 CLI RX|Security: Privilege proc_setid missing, will not change uid/gid
**** v1    0.2 CLI RX|Unused backend c, defined:
**** v1    0.2 CLI RX|('<vcl.inline>' Line 4 Pos 17)
**** v1    0.2 CLI RX|        backend c { .host = "127.0.0.1"; }
**** v1    0.2 CLI RX|----------------#-------------------------
**** v1    0.2 CLI RX|
**** v1    0.2 CLI RX|Running VCC-compiler failed, exited with 2
**** v1    0.2 CLI RX|VCL compilation failed
**   v1    0.2 VCL compilation failed (as expected)
***  v1    0.2 Found expected string: ("Unused backend c, defined:")
*    top   0.2 RESETTING after ../../../bin/varnishtest/tests/v00031.vtc
**   v1    0.2 Wait
**** v1    0.2 CLI TX|backend.list
***  v1    0.2 CLI RX  101
**** v1    0.2 CLI RX|Unknown request in manager process (child not running).
**** v1    0.2 CLI RX|Type 'help' for more info.
**   v1    0.2 Stop
**** v1    0.2 CLI TX|stop
***  v1    0.2 CLI RX  300
**** v1    0.2 CLI RX|Child in state stopped
**** v1    0.2 CLI TX|status
***  v1    0.2 CLI RX  200
**** v1    0.2 CLI RX|Child in state stopped
**** v1    0.2 STDOUT poll 0x10
**   v1    0.2 R 30864 Status: 0000 (u 0.055000 s 0.073000)
*    diag  0.0 ............................................................
#    top  TEST ../../../bin/varnishtest/tests/v00031.vtc TIMED OUT (kill -9)
#    top  TEST ../../../bin/varnishtest/tests/v00031.vtc FAILED (60.002) signal=9

1 @ SunOS 5.11 i86pc 1.04 64_sun12.4 uplex

*    top   0.0 TEST ../../../bin/varnishtest/tests/v00031.vtc starting
[...]
*    top   0.0 TEST param vcc_err_unref
[...]
***  v1    0.2 CLI RX  200
**   v1    0.2 CLI 200 <param.set vcc_err_unref true>
**   top   0.2 === varnish v1 -errvcl {Unused backend c, defined:} {
**** v1    0.2 CLI TX|vcl.inline vcl3 << %XJEIFLH|)Xspa8P
**** v1    0.2 CLI TX|vcl 4.0;
**** v1    0.2 CLI TX|
**** v1    0.2 CLI TX|\tbackend b { .host = "127.0.0.1"; }
**** v1    0.2 CLI TX|\tbackend c { .host = "127.0.0.1"; }
**** v1    0.2 CLI TX|
**** v1    0.2 CLI TX|%XJEIFLH|)Xspa8P
***  v1    0.2 CLI RX  106
**** v1    0.2 CLI RX|Message from VCC-compiler:
**** v1    0.2 CLI RX|Security: Privilege proc_setid missing, will not change uid/gid
**** v1    0.2 CLI RX|Unused backend c, defined:
**** v1    0.2 CLI RX|('<vcl.inline>' Line 4 Pos 17)
**** v1    0.2 CLI RX|        backend c { .host = "127.0.0.1"; }
**** v1    0.2 CLI RX|----------------#-------------------------
**** v1    0.2 CLI RX|
**** v1    0.2 CLI RX|Running VCC-compiler failed, exited with 2
**** v1    0.2 CLI RX|VCL compilation failed
**   v1    0.2 VCL compilation failed (as expected)
***  v1    0.2 Found expected string: ("Unused backend c, defined:")
*    top   0.2 RESETTING after ../../../bin/varnishtest/tests/v00031.vtc
**   v1    0.2 Wait
**** v1    0.2 CLI TX|backend.list
***  v1    0.2 CLI RX  101
**** v1    0.2 CLI RX|Unknown request in manager process (child not running).
**** v1    0.2 CLI RX|Type 'help' for more info.
**   v1    0.2 Stop
**** v1    0.2 CLI TX|stop
***  v1    0.2 CLI RX  300
**** v1    0.2 CLI RX|Child in state stopped
**** v1    0.2 CLI TX|status
***  v1    0.2 CLI RX  200
**** v1    0.2 CLI RX|Child in state stopped
**** v1    0.2 STDOUT poll 0x10
**   v1    0.2 R 5253 Status: 0000 (u 0.059000 s 0.090000)
*    diag  0.0 ............................................................
#    top  TEST ../../../bin/varnishtest/tests/v00031.vtc TIMED OUT (kill -9)
#    top  TEST ../../../bin/varnishtest/tests/v00031.vtc FAILED (60.004) signal=9

1 @ SunOS 5.11 i86pc 1.04 32_sun12.4 uplex

*    top   0.0 TEST ../../../bin/varnishtest/tests/v00031.vtc starting
[...]
*    top   0.0 TEST param vcc_err_unref
[...]
***  v1    0.2 CLI RX  200
**   v1    0.2 CLI 200 <param.set vcc_err_unref true>
**   top   0.2 === varnish v1 -errvcl {Unused backend c, defined:} {
**** v1    0.2 CLI TX|vcl.inline vcl3 << %XJEIFLH|)Xspa8P
**** v1    0.2 CLI TX|vcl 4.0;
**** v1    0.2 CLI TX|
**** v1    0.2 CLI TX|\tbackend b { .host = "127.0.0.1"; }
**** v1    0.2 CLI TX|\tbackend c { .host = "127.0.0.1"; }
**** v1    0.2 CLI TX|
**** v1    0.2 CLI TX|%XJEIFLH|)Xspa8P
***  v1    0.2 CLI RX  106
**** v1    0.2 CLI RX|Message from VCC-compiler:
**** v1    0.2 CLI RX|Security: Privilege proc_setid missing, will not change uid/gid
**** v1    0.2 CLI RX|Unused backend c, defined:
**** v1    0.2 CLI RX|('<vcl.inline>' Line 4 Pos 17)
**** v1    0.2 CLI RX|        backend c { .host = "127.0.0.1"; }
**** v1    0.2 CLI RX|----------------#-------------------------
**** v1    0.2 CLI RX|
**** v1    0.2 CLI RX|Running VCC-compiler failed, exited with 2
**** v1    0.2 CLI RX|VCL compilation failed
**   v1    0.2 VCL compilation failed (as expected)
***  v1    0.2 Found expected string: ("Unused backend c, defined:")
*    top   0.2 RESETTING after ../../../bin/varnishtest/tests/v00031.vtc
**   v1    0.2 Wait
**** v1    0.2 CLI TX|backend.list
***  v1    0.2 CLI RX  101
**** v1    0.2 CLI RX|Unknown request in manager process (child not running).
**** v1    0.2 CLI RX|Type 'help' for more info.
**   v1    0.2 Stop
**** v1    0.2 CLI TX|stop
***  v1    0.2 CLI RX  300
**** v1    0.2 CLI RX|Child in state stopped
**** v1    0.2 CLI TX|status
***  v1    0.2 CLI RX  200
**** v1    0.2 CLI RX|Child in state stopped
**** v1    0.2 STDOUT poll 0x10
**   v1    0.2 R 36199 Status: 0000 (u 0.055000 s 0.073000)
*    diag  0.0 ............................................................
#    top  TEST ../../../bin/varnishtest/tests/v00031.vtc TIMED OUT (kill -9)
#    top  TEST ../../../bin/varnishtest/tests/v00031.vtc FAILED (60.002) signal=9

1 @ SunOS 5.11 i86pc 1.04 64_sun12.4 uplex

*    top   0.0 TEST ../../../bin/varnishtest/tests/v00031.vtc starting
[...]
*    top   0.0 TEST param vcc_err_unref
[...]
***  v1    0.2 CLI RX  200
**   v1    0.2 CLI 200 <param.set vcc_err_unref true>
**   top   0.2 === varnish v1 -errvcl {Unused backend c, defined:} {
**** v1    0.2 CLI TX|vcl.inline vcl3 << %XJEIFLH|)Xspa8P
**** v1    0.2 CLI TX|vcl 4.0;
**** v1    0.2 CLI TX|
**** v1    0.2 CLI TX|\tbackend b { .host = "127.0.0.1"; }
**** v1    0.2 CLI TX|\tbackend c { .host = "127.0.0.1"; }
**** v1    0.2 CLI TX|
**** v1    0.2 CLI TX|%XJEIFLH|)Xspa8P
***  v1    0.2 CLI RX  106
**** v1    0.2 CLI RX|Message from VCC-compiler:
**** v1    0.2 CLI RX|Security: Privilege proc_setid missing, will not change uid/gid
**** v1    0.2 CLI RX|Unused backend c, defined:
**** v1    0.2 CLI RX|('<vcl.inline>' Line 4 Pos 17)
**** v1    0.2 CLI RX|        backend c { .host = "127.0.0.1"; }
**** v1    0.2 CLI RX|----------------#-------------------------
**** v1    0.2 CLI RX|
**** v1    0.2 CLI RX|Running VCC-compiler failed, exited with 2
**** v1    0.2 CLI RX|VCL compilation failed
**   v1    0.2 VCL compilation failed (as expected)
***  v1    0.2 Found expected string: ("Unused backend c, defined:")
*    top   0.2 RESETTING after ../../../bin/varnishtest/tests/v00031.vtc
**   v1    0.2 Wait
**** v1    0.2 CLI TX|backend.list
***  v1    0.2 CLI RX  101
**** v1    0.2 CLI RX|Unknown request in manager process (child not running).
**** v1    0.2 CLI RX|Type 'help' for more info.
**   v1    0.2 Stop
**** v1    0.2 CLI TX|stop
***  v1    0.2 CLI RX  300
**** v1    0.2 CLI RX|Child in state stopped
**** v1    0.2 CLI TX|status
***  v1    0.2 CLI RX  200
**** v1    0.2 CLI RX|Child in state stopped
**** v1    0.2 STDOUT poll 0x10
**   v1    0.2 R 13762 Status: 0000 (u 0.065000 s 0.094000)
*    diag  0.0 ............................................................
#    top  TEST ../../../bin/varnishtest/tests/v00031.vtc TIMED OUT (kill -9)
#    top  TEST ../../../bin/varnishtest/tests/v00031.vtc FAILED (60.004) signal=9

1 @ SunOS 5.11 i86pc 1.04 32_gcc4.7 uplex

*    top   0.0 TEST ../../../bin/varnishtest/tests/v00031.vtc starting
[...]
*    top   0.0 TEST param vcc_err_unref
[...]
***  v1    0.2 CLI RX  200
**   v1    0.2 CLI 200 <param.set vcc_err_unref true>
**   top   0.2 === varnish v1 -errvcl {Unused backend c, defined:} {
**** v1    0.2 CLI TX|vcl.inline vcl3 << %XJEIFLH|)Xspa8P
**** v1    0.2 CLI TX|vcl 4.0;
**** v1    0.2 CLI TX|
**** v1    0.2 CLI TX|\tbackend b { .host = "127.0.0.1"; }
**** v1    0.2 CLI TX|\tbackend c { .host = "127.0.0.1"; }
**** v1    0.2 CLI TX|
**** v1    0.2 CLI TX|%XJEIFLH|)Xspa8P
***  v1    0.2 CLI RX  106
**** v1    0.2 CLI RX|Message from VCC-compiler:
**** v1    0.2 CLI RX|Security: Privilege proc_setid missing, will not change uid/gid
**** v1    0.2 CLI RX|Unused backend c, defined:
**** v1    0.2 CLI RX|('<vcl.inline>' Line 4 Pos 17)
**** v1    0.2 CLI RX|        backend c { .host = "127.0.0.1"; }
**** v1    0.2 CLI RX|----------------#-------------------------
**** v1    0.2 CLI RX|
**** v1    0.2 CLI RX|Running VCC-compiler failed, exited with 2
**** v1    0.2 CLI RX|VCL compilation failed
**   v1    0.2 VCL compilation failed (as expected)
***  v1    0.2 Found expected string: ("Unused backend c, defined:")
*    top   0.2 RESETTING after ../../../bin/varnishtest/tests/v00031.vtc
**   v1    0.2 Wait
**** v1    0.2 CLI TX|backend.list
***  v1    0.2 CLI RX  101
**** v1    0.2 CLI RX|Unknown request in manager process (child not running).
**** v1    0.2 CLI RX|Type 'help' for more info.
**   v1    0.2 Stop
**** v1    0.2 CLI TX|stop
***  v1    0.2 CLI RX  300
**** v1    0.2 CLI RX|Child in state stopped
**** v1    0.2 CLI TX|status
***  v1    0.2 CLI RX  200
**** v1    0.2 CLI RX|Child in state stopped
**** v1    0.2 STDOUT poll 0x10
**   v1    0.2 R 32323 Status: 0000 (u 0.064000 s 0.057000)
*    diag  0.0 ............................................................
#    top  TEST ../../../bin/varnishtest/tests/v00031.vtc TIMED OUT (kill -9)
#    top  TEST ../../../bin/varnishtest/tests/v00031.vtc FAILED (60.002) signal=9

1 @ SunOS 5.11 i86pc 1.04 64_sun12.4 uplex

*    top   0.0 TEST ../../../bin/varnishtest/tests/v00031.vtc starting
[...]
*    top   0.0 TEST param vcc_err_unref
[...]
***  v1    0.2 CLI RX  200
**   v1    0.2 CLI 200 <param.set vcc_err_unref true>
**   top   0.2 === varnish v1 -errvcl {Unused backend c, defined:} {
**** v1    0.2 CLI TX|vcl.inline vcl3 << %XJEIFLH|)Xspa8P
**** v1    0.2 CLI TX|vcl 4.0;
**** v1    0.2 CLI TX|
**** v1    0.2 CLI TX|\tbackend b { .host = "127.0.0.1"; }
**** v1    0.2 CLI TX|\tbackend c { .host = "127.0.0.1"; }
**** v1    0.2 CLI TX|
**** v1    0.2 CLI TX|%XJEIFLH|)Xspa8P
***  v1    0.2 CLI RX  106
**** v1    0.2 CLI RX|Message from VCC-compiler:
**** v1    0.2 CLI RX|Security: Privilege proc_setid missing, will not change uid/gid
**** v1    0.2 CLI RX|Unused backend c, defined:
**** v1    0.2 CLI RX|('<vcl.inline>' Line 4 Pos 17)
**** v1    0.2 CLI RX|        backend c { .host = "127.0.0.1"; }
**** v1    0.2 CLI RX|----------------#-------------------------
**** v1    0.2 CLI RX|
**** v1    0.2 CLI RX|Running VCC-compiler failed, exited with 2
**** v1    0.2 CLI RX|VCL compilation failed
**   v1    0.2 VCL compilation failed (as expected)
***  v1    0.2 Found expected string: ("Unused backend c, defined:")
*    top   0.2 RESETTING after ../../../bin/varnishtest/tests/v00031.vtc
**   v1    0.2 Wait
**** v1    0.2 CLI TX|backend.list
***  v1    0.2 CLI RX  101
**** v1    0.2 CLI RX|Unknown request in manager process (child not running).
**** v1    0.2 CLI RX|Type 'help' for more info.
**   v1    0.2 Stop
**** v1    0.2 CLI TX|stop
***  v1    0.2 CLI RX  300
**** v1    0.2 CLI RX|Child in state stopped
**** v1    0.2 CLI TX|status
***  v1    0.2 CLI RX  200
**** v1    0.2 CLI RX|Child in state stopped
**** v1    0.2 STDOUT poll 0x10
**   v1    0.2 R 9339 Status: 0000 (u 0.059000 s 0.089000)
*    diag  0.0 ............................................................
#    top  TEST ../../../bin/varnishtest/tests/v00031.vtc TIMED OUT (kill -9)
#    top  TEST ../../../bin/varnishtest/tests/v00031.vtc FAILED (60.004) signal=9

1 @ SunOS 5.11 i86pc 1.04 32_gcc4.7 uplex

*    top   0.0 TEST ../../../bin/varnishtest/tests/v00031.vtc starting
[...]
*    top   0.0 TEST param vcc_err_unref
[...]
***  v1    0.2 CLI RX  200
**   v1    0.2 CLI 200 <param.set vcc_err_unref true>
**   top   0.2 === varnish v1 -errvcl {Unused backend c, defined:} {
**** v1    0.2 CLI TX|vcl.inline vcl3 << %XJEIFLH|)Xspa8P
**** v1    0.2 CLI TX|vcl 4.0;
**** v1    0.2 CLI TX|
**** v1    0.2 CLI TX|\tbackend b { .host = "127.0.0.1"; }
**** v1    0.2 CLI TX|\tbackend c { .host = "127.0.0.1"; }
**** v1    0.2 CLI TX|
**** v1    0.2 CLI TX|%XJEIFLH|)Xspa8P
***  v1    0.3 CLI RX  106
**** v1    0.3 CLI RX|Message from VCC-compiler:
**** v1    0.3 CLI RX|Security: Privilege proc_setid missing, will not change uid/gid
**** v1    0.3 CLI RX|Unused backend c, defined:
**** v1    0.3 CLI RX|('<vcl.inline>' Line 4 Pos 17)
**** v1    0.3 CLI RX|        backend c { .host = "127.0.0.1"; }
**** v1    0.3 CLI RX|----------------#-------------------------
**** v1    0.3 CLI RX|
**** v1    0.3 CLI RX|Running VCC-compiler failed, exited with 2
**** v1    0.3 CLI RX|VCL compilation failed
**   v1    0.3 VCL compilation failed (as expected)
***  v1    0.3 Found expected string: ("Unused backend c, defined:")
*    top   0.3 RESETTING after ../../../bin/varnishtest/tests/v00031.vtc
**   v1    0.3 Wait
**** v1    0.3 CLI TX|backend.list
***  v1    0.3 CLI RX  101
**** v1    0.3 CLI RX|Unknown request in manager process (child not running).
**** v1    0.3 CLI RX|Type 'help' for more info.
**   v1    0.3 Stop
**** v1    0.3 CLI TX|stop
***  v1    0.3 CLI RX  300
**** v1    0.3 CLI RX|Child in state stopped
**** v1    0.3 CLI TX|status
***  v1    0.3 CLI RX  200
**** v1    0.3 CLI RX|Child in state stopped
**** v1    0.3 STDOUT poll 0x10
**   v1    0.3 R 43938 Status: 0000 (u 0.064000 s 0.058000)
*    diag  0.0 ............................................................
#    top  TEST ../../../bin/varnishtest/tests/v00031.vtc TIMED OUT (kill -9)
#    top  TEST ../../../bin/varnishtest/tests/v00031.vtc FAILED (60.002) signal=9

1 @ SunOS 5.11 i86pc 1.04 64_sun12.4 uplex

*    top   0.0 TEST ../../../bin/varnishtest/tests/v00031.vtc starting
[...]
*    top   0.0 TEST param vcc_err_unref
[...]
***  v1    0.2 CLI RX  200
**   v1    0.2 CLI 200 <param.set vcc_err_unref true>
**   top   0.2 === varnish v1 -errvcl {Unused backend c, defined:} {
**** v1    0.2 CLI TX|vcl.inline vcl3 << %XJEIFLH|)Xspa8P
**** v1    0.2 CLI TX|vcl 4.0;
**** v1    0.2 CLI TX|
**** v1    0.2 CLI TX|\tbackend b { .host = "127.0.0.1"; }
**** v1    0.2 CLI TX|\tbackend c { .host = "127.0.0.1"; }
**** v1    0.2 CLI TX|
**** v1    0.2 CLI TX|%XJEIFLH|)Xspa8P
***  v1    0.2 CLI RX  106
**** v1    0.2 CLI RX|Message from VCC-compiler:
**** v1    0.2 CLI RX|Security: Privilege proc_setid missing, will not change uid/gid
**** v1    0.2 CLI RX|Unused backend c, defined:
**** v1    0.2 CLI RX|('<vcl.inline>' Line 4 Pos 17)
**** v1    0.2 CLI RX|        backend c { .host = "127.0.0.1"; }
**** v1    0.2 CLI RX|----------------#-------------------------
**** v1    0.2 CLI RX|
**** v1    0.2 CLI RX|Running VCC-compiler failed, exited with 2
**** v1    0.2 CLI RX|VCL compilation failed
**   v1    0.2 VCL compilation failed (as expected)
***  v1    0.2 Found expected string: ("Unused backend c, defined:")
*    top   0.2 RESETTING after ../../../bin/varnishtest/tests/v00031.vtc
**   v1    0.2 Wait
**** v1    0.2 CLI TX|backend.list
***  v1    0.2 CLI RX  101
**** v1    0.2 CLI RX|Unknown request in manager process (child not running).
**** v1    0.2 CLI RX|Type 'help' for more info.
**   v1    0.2 Stop
**** v1    0.2 CLI TX|stop
***  v1    0.2 CLI RX  300
**** v1    0.2 CLI RX|Child in state stopped
**** v1    0.2 CLI TX|status
***  v1    0.2 CLI RX  200
**** v1    0.2 CLI RX|Child in state stopped
**** v1    0.2 STDOUT poll 0x10
**   v1    0.2 R 6197 Status: 0000 (u 0.060000 s 0.089000)
*    diag  0.0 ............................................................
#    top  TEST ../../../bin/varnishtest/tests/v00031.vtc TIMED OUT (kill -9)
#    top  TEST ../../../bin/varnishtest/tests/v00031.vtc FAILED (60.003) signal=9

1 @ SunOS 5.11 i86pc 1.04 32_sun12.4 uplex

*    top   0.0 TEST ../../../bin/varnishtest/tests/v00031.vtc starting
[...]
*    top   0.0 TEST param vcc_err_unref
[...]
***  v1    0.2 CLI RX  200
**   v1    0.2 CLI 200 <param.set vcc_err_unref true>
**   top   0.2 === varnish v1 -errvcl {Unused backend c, defined:} {
**** v1    0.2 CLI TX|vcl.inline vcl3 << %XJEIFLH|)Xspa8P
**** v1    0.2 CLI TX|vcl 4.0;
**** v1    0.2 CLI TX|
**** v1    0.2 CLI TX|\tbackend b { .host = "127.0.0.1"; }
**** v1    0.2 CLI TX|\tbackend c { .host = "127.0.0.1"; }
**** v1    0.2 CLI TX|
**** v1    0.2 CLI TX|%XJEIFLH|)Xspa8P
***  v1    0.2 CLI RX  106
**** v1    0.2 CLI RX|Message from VCC-compiler:
**** v1    0.2 CLI RX|Security: Privilege proc_setid missing, will not change uid/gid
**** v1    0.2 CLI RX|Unused backend c, defined:
**** v1    0.2 CLI RX|('<vcl.inline>' Line 4 Pos 17)
**** v1    0.2 CLI RX|        backend c { .host = "127.0.0.1"; }
**** v1    0.2 CLI RX|----------------#-------------------------
**** v1    0.2 CLI RX|
**** v1    0.2 CLI RX|Running VCC-compiler failed, exited with 2
**** v1    0.2 CLI RX|VCL compilation failed
**   v1    0.2 VCL compilation failed (as expected)
***  v1    0.2 Found expected string: ("Unused backend c, defined:")
*    top   0.2 RESETTING after ../../../bin/varnishtest/tests/v00031.vtc
**   v1    0.2 Wait
**** v1    0.2 CLI TX|backend.list
***  v1    0.2 CLI RX  101
**** v1    0.2 CLI RX|Unknown request in manager process (child not running).
**** v1    0.2 CLI RX|Type 'help' for more info.
**   v1    0.2 Stop
**** v1    0.2 CLI TX|stop
***  v1    0.2 CLI RX  300
**** v1    0.2 CLI RX|Child in state stopped
**** v1    0.2 CLI TX|status
***  v1    0.2 CLI RX  200
**** v1    0.2 CLI RX|Child in state stopped
**** v1    0.2 STDOUT poll 0x10
**   v1    0.2 R 55388 Status: 0000 (u 0.059000 s 0.081000)
*    diag  0.0 ............................................................
#    top  TEST ../../../bin/varnishtest/tests/v00031.vtc TIMED OUT (kill -9)
#    top  TEST ../../../bin/varnishtest/tests/v00031.vtc FAILED (60.004) signal=9

1 @ SunOS 5.11 i86pc 1.04 32_sun12.4 uplex

*    top   0.0 TEST ../../../bin/varnishtest/tests/v00031.vtc starting
[...]
*    top   0.0 TEST param vcc_err_unref
[...]
***  v1    0.2 CLI RX  200
**   v1    0.2 CLI 200 <param.set vcc_err_unref true>
**   top   0.2 === varnish v1 -errvcl {Unused backend c, defined:} {
**** v1    0.2 CLI TX|vcl.inline vcl3 << %XJEIFLH|)Xspa8P
**** v1    0.2 CLI TX|vcl 4.0;
**** v1    0.2 CLI TX|
**** v1    0.2 CLI TX|\tbackend b { .host = "127.0.0.1"; }
**** v1    0.2 CLI TX|\tbackend c { .host = "127.0.0.1"; }
**** v1    0.2 CLI TX|
**** v1    0.2 CLI TX|%XJEIFLH|)Xspa8P
***  v1    0.2 CLI RX  106
**** v1    0.2 CLI RX|Message from VCC-compiler:
**** v1    0.2 CLI RX|Security: Privilege proc_setid missing, will not change uid/gid
**** v1    0.2 CLI RX|Unused backend c, defined:
**** v1    0.2 CLI RX|('<vcl.inline>' Line 4 Pos 17)
**** v1    0.2 CLI RX|        backend c { .host = "127.0.0.1"; }
**** v1    0.2 CLI RX|----------------#-------------------------
**** v1    0.2 CLI RX|
**** v1    0.2 CLI RX|Running VCC-compiler failed, exited with 2
**** v1    0.2 CLI RX|VCL compilation failed
**   v1    0.2 VCL compilation failed (as expected)
***  v1    0.2 Found expected string: ("Unused backend c, defined:")
*    top   0.2 RESETTING after ../../../bin/varnishtest/tests/v00031.vtc
**   v1    0.2 Wait
**** v1    0.2 CLI TX|backend.list
***  v1    0.2 CLI RX  101
**** v1    0.2 CLI RX|Unknown request in manager process (child not running).
**** v1    0.2 CLI RX|Type 'help' for more info.
**   v1    0.2 Stop
**** v1    0.2 CLI TX|stop
***  v1    0.2 CLI RX  300
**** v1    0.2 CLI RX|Child in state stopped
**** v1    0.2 CLI TX|status
***  v1    0.2 CLI RX  200
**** v1    0.2 CLI RX|Child in state stopped
**** v1    0.2 STDOUT poll 0x10
**   v1    0.2 R 48858 Status: 0000 (u 0.056000 s 0.073000)
*    diag  0.0 ............................................................
#    top  TEST ../../../bin/varnishtest/tests/v00031.vtc TIMED OUT (kill -9)
#    top  TEST ../../../bin/varnishtest/tests/v00031.vtc FAILED (60.002) signal=9

1 @ SunOS 5.11 i86pc 1.04 32_gcc4.7 uplex

*    top   0.0 TEST ../../../bin/varnishtest/tests/v00031.vtc starting
[...]
*    top   0.0 TEST param vcc_err_unref
[...]
***  v1    0.2 CLI RX  200
**   v1    0.2 CLI 200 <param.set vcc_err_unref true>
**   top   0.2 === varnish v1 -errvcl {Unused backend c, defined:} {
**** v1    0.2 CLI TX|vcl.inline vcl3 << %XJEIFLH|)Xspa8P
**** v1    0.2 CLI TX|vcl 4.0;
**** v1    0.2 CLI TX|
**** v1    0.2 CLI TX|\tbackend b { .host = "127.0.0.1"; }
**** v1    0.2 CLI TX|\tbackend c { .host = "127.0.0.1"; }
**** v1    0.2 CLI TX|
**** v1    0.2 CLI TX|%XJEIFLH|)Xspa8P
***  v1    0.3 CLI RX  106
**** v1    0.3 CLI RX|Message from VCC-compiler:
**** v1    0.3 CLI RX|Security: Privilege proc_setid missing, will not change uid/gid
**** v1    0.3 CLI RX|Unused backend c, defined:
**** v1    0.3 CLI RX|('<vcl.inline>' Line 4 Pos 17)
**** v1    0.3 CLI RX|        backend c { .host = "127.0.0.1"; }
**** v1    0.3 CLI RX|----------------#-------------------------
**** v1    0.3 CLI RX|
**** v1    0.3 CLI RX|Running VCC-compiler failed, exited with 2
**** v1    0.3 CLI RX|VCL compilation failed
**   v1    0.3 VCL compilation failed (as expected)
***  v1    0.3 Found expected string: ("Unused backend c, defined:")
*    top   0.3 RESETTING after ../../../bin/varnishtest/tests/v00031.vtc
**   v1    0.3 Wait
**** v1    0.3 CLI TX|backend.list
***  v1    0.3 CLI RX  101
**** v1    0.3 CLI RX|Unknown request in manager process (child not running).
**** v1    0.3 CLI RX|Type 'help' for more info.
**   v1    0.3 Stop
**** v1    0.3 CLI TX|stop
***  v1    0.3 CLI RX  300
**** v1    0.3 CLI RX|Child in state stopped
**** v1    0.3 CLI TX|status
***  v1    0.3 CLI RX  200
**** v1    0.3 CLI RX|Child in state stopped
**** v1    0.3 STDOUT poll 0x10
**   v1    0.3 R 62010 Status: 0000 (u 0.064000 s 0.060000)
*    diag  0.0 ............................................................
#    top  TEST ../../../bin/varnishtest/tests/v00031.vtc TIMED OUT (kill -9)
#    top  TEST ../../../bin/varnishtest/tests/v00031.vtc FAILED (60.004) signal=9

1 @ SunOS 5.11 i86pc 1.04 32_gcc4.7 uplex

*    top   0.0 TEST ../../../bin/varnishtest/tests/v00031.vtc starting
[...]
*    top   0.0 TEST param vcc_err_unref
[...]
***  v1    0.2 CLI RX  200
**   v1    0.2 CLI 200 <param.set vcc_err_unref true>
**   top   0.2 === varnish v1 -errvcl {Unused backend c, defined:} {
**** v1    0.2 CLI TX|vcl.inline vcl3 << %XJEIFLH|)Xspa8P
**** v1    0.2 CLI TX|vcl 4.0;
**** v1    0.2 CLI TX|
**** v1    0.2 CLI TX|\tbackend b { .host = "127.0.0.1"; }
**** v1    0.2 CLI TX|\tbackend c { .host = "127.0.0.1"; }
**** v1    0.2 CLI TX|
**** v1    0.2 CLI TX|%XJEIFLH|)Xspa8P
***  v1    0.3 CLI RX  106
**** v1    0.3 CLI RX|Message from VCC-compiler:
**** v1    0.3 CLI RX|Security: Privilege proc_setid missing, will not change uid/gid
**** v1    0.3 CLI RX|Unused backend c, defined:
**** v1    0.3 CLI RX|('<vcl.inline>' Line 4 Pos 17)
**** v1    0.3 CLI RX|        backend c { .host = "127.0.0.1"; }
**** v1    0.3 CLI RX|----------------#-------------------------
**** v1    0.3 CLI RX|
**** v1    0.3 CLI RX|Running VCC-compiler failed, exited with 2
**** v1    0.3 CLI RX|VCL compilation failed
**   v1    0.3 VCL compilation failed (as expected)
***  v1    0.3 Found expected string: ("Unused backend c, defined:")
*    top   0.3 RESETTING after ../../../bin/varnishtest/tests/v00031.vtc
**   v1    0.3 Wait
**** v1    0.3 CLI TX|backend.list
***  v1    0.3 CLI RX  101
**** v1    0.3 CLI RX|Unknown request in manager process (child not running).
**** v1    0.3 CLI RX|Type 'help' for more info.
**   v1    0.3 Stop
**** v1    0.3 CLI TX|stop
***  v1    0.3 CLI RX  300
**** v1    0.3 CLI RX|Child in state stopped
**** v1    0.3 CLI TX|status
***  v1    0.3 CLI RX  200
**** v1    0.3 CLI RX|Child in state stopped
**** v1    0.3 STDOUT poll 0x10
**   v1    0.3 R 40986 Status: 0000 (u 0.066000 s 0.063000)
*    diag  0.0 ............................................................
#    top  TEST ../../../bin/varnishtest/tests/v00031.vtc TIMED OUT (kill -9)
#    top  TEST ../../../bin/varnishtest/tests/v00031.vtc FAILED (60.002) signal=9

1 @ SunOS 5.11 i86pc 1.04 64_sun12.4 uplex

*    top   0.0 TEST ../../../bin/varnishtest/tests/v00031.vtc starting
[...]
*    top   0.0 TEST param vcc_err_unref
[...]
***  v1    0.2 CLI RX  200
**   v1    0.2 CLI 200 <param.set vcc_err_unref true>
**   top   0.2 === varnish v1 -errvcl {Unused backend c, defined:} {
**** v1    0.2 CLI TX|vcl.inline vcl3 << %XJEIFLH|)Xspa8P
**** v1    0.2 CLI TX|vcl 4.0;
**** v1    0.2 CLI TX|
**** v1    0.2 CLI TX|\tbackend b { .host = "127.0.0.1"; }
**** v1    0.2 CLI TX|\tbackend c { .host = "127.0.0.1"; }
**** v1    0.2 CLI TX|
**** v1    0.2 CLI TX|%XJEIFLH|)Xspa8P
***  v1    0.2 CLI RX  106
**** v1    0.2 CLI RX|Message from VCC-compiler:
**** v1    0.2 CLI RX|Security: Privilege proc_setid missing, will not change uid/gid
**** v1    0.2 CLI RX|Unused backend c, defined:
**** v1    0.2 CLI RX|('<vcl.inline>' Line 4 Pos 17)
**** v1    0.2 CLI RX|        backend c { .host = "127.0.0.1"; }
**** v1    0.2 CLI RX|----------------#-------------------------
**** v1    0.2 CLI RX|
**** v1    0.2 CLI RX|Running VCC-compiler failed, exited with 2
**** v1    0.2 CLI RX|VCL compilation failed
**   v1    0.2 VCL compilation failed (as expected)
***  v1    0.2 Found expected string: ("Unused backend c, defined:")
*    top   0.2 RESETTING after ../../../bin/varnishtest/tests/v00031.vtc
**   v1    0.2 Wait
**** v1    0.2 CLI TX|backend.list
***  v1    0.2 CLI RX  101
**** v1    0.2 CLI RX|Unknown request in manager process (child not running).
**** v1    0.2 CLI RX|Type 'help' for more info.
**   v1    0.2 Stop
**** v1    0.2 CLI TX|stop
***  v1    0.2 CLI RX  300
**** v1    0.2 CLI RX|Child in state stopped
**** v1    0.2 CLI TX|status
***  v1    0.2 CLI RX  200
**** v1    0.2 CLI RX|Child in state stopped
**** v1    0.2 STDOUT poll 0x10
**   v1    0.2 R 29824 Status: 0000 (u 0.067000 s 0.098000)
*    diag  0.0 ............................................................
#    top  TEST ../../../bin/varnishtest/tests/v00031.vtc TIMED OUT (kill -9)
#    top  TEST ../../../bin/varnishtest/tests/v00031.vtc FAILED (60.004) signal=9

bd4794e

1 @ SunOS 5.11 i86pc 1.04 32_sun12.4 uplex

*    top   0.0 TEST ../../../bin/varnishtest/tests/v00031.vtc starting
[...]
*    top   0.0 TEST param vcc_err_unref
[...]
**** v1    0.2 CLI TX|param.set vcc_err_unref true
***  v1    0.2 CLI RX  200
**   v1    0.2 CLI 200 <param.set vcc_err_unref true>
**   top   0.2 === varnish v1 -errvcl {Unused backend c, defined:} {
**** v1    0.2 CLI TX|vcl.inline vcl3 << %XJEIFLH|)Xspa8P
**** v1    0.2 CLI TX|vcl 4.0;
**** v1    0.2 CLI TX|
**** v1    0.2 CLI TX|\tbackend b { .host = "127.0.0.1"; }
**** v1    0.2 CLI TX|\tbackend c { .host = "127.0.0.1"; }
**** v1    0.2 CLI TX|
**** v1    0.2 CLI TX|%XJEIFLH|)Xspa8P
***  v1    0.2 CLI RX  106
**** v1    0.2 CLI RX|Message from VCC-compiler:
**** v1    0.2 CLI RX|Security: Privilege proc_setid missing, will not change uid/gid
**** v1    0.2 CLI RX|Unused backend c, defined:
**** v1    0.2 CLI RX|('<vcl.inline>' Line 4 Pos 17)
**** v1    0.2 CLI RX|        backend c { .host = "127.0.0.1"; }
**** v1    0.2 CLI RX|----------------#-------------------------
**** v1    0.2 CLI RX|
**** v1    0.2 CLI RX|Running VCC-compiler failed, exited with 2
**** v1    0.2 CLI RX|VCL compilation failed
**   v1    0.2 VCL compilation failed (as expected)
***  v1    0.2 Found expected string: ("Unused backend c, defined:")
*    top   0.2 RESETTING after ../../../bin/varnishtest/tests/v00031.vtc
**   v1    0.2 Wait
**** v1    0.2 CLI TX|backend.list
***  v1    0.2 CLI RX  101
**** v1    0.2 CLI RX|Unknown request in manager process (child not running).
**** v1    0.2 CLI RX|Type 'help' for more info.
**   v1    0.2 Stop
**** v1    0.2 CLI TX|stop
***  v1    0.2 CLI RX  300
**** v1    0.2 CLI RX|Child in state stopped
**** v1    0.2 CLI TX|status
***  v1    0.2 CLI RX  200
**** v1    0.2 CLI RX|Child in state stopped
**** v1    0.2 STDOUT poll 0x10
**   v1    0.2 R 50204 Status: 0000 (u 0.058000 s 0.076000)
#    top  TEST ../../../bin/varnishtest/tests/v00031.vtc TIMED OUT (kill -9)
#    top  TEST ../../../bin/varnishtest/tests/v00031.vtc FAILED (60.002) signal=9

1 @ SunOS 5.11 i86pc 1.04 32_gcc4.7 uplex

*    top   0.0 TEST ../../../bin/varnishtest/tests/v00031.vtc starting
[...]
*    top   0.0 TEST param vcc_err_unref
[...]
**** v1    0.2 CLI TX|param.set vcc_err_unref true
***  v1    0.2 CLI RX  200
**   v1    0.2 CLI 200 <param.set vcc_err_unref true>
**   top   0.2 === varnish v1 -errvcl {Unused backend c, defined:} {
**** v1    0.2 CLI TX|vcl.inline vcl3 << %XJEIFLH|)Xspa8P
**** v1    0.2 CLI TX|vcl 4.0;
**** v1    0.2 CLI TX|
**** v1    0.2 CLI TX|\tbackend b { .host = "127.0.0.1"; }
**** v1    0.2 CLI TX|\tbackend c { .host = "127.0.0.1"; }
**** v1    0.2 CLI TX|
**** v1    0.2 CLI TX|%XJEIFLH|)Xspa8P
***  v1    0.2 CLI RX  106
**** v1    0.2 CLI RX|Message from VCC-compiler:
**** v1    0.2 CLI RX|Security: Privilege proc_setid missing, will not change uid/gid
**** v1    0.2 CLI RX|Unused backend c, defined:
**** v1    0.2 CLI RX|('<vcl.inline>' Line 4 Pos 17)
**** v1    0.2 CLI RX|        backend c { .host = "127.0.0.1"; }
**** v1    0.2 CLI RX|----------------#-------------------------
**** v1    0.2 CLI RX|
**** v1    0.2 CLI RX|Running VCC-compiler failed, exited with 2
**** v1    0.2 CLI RX|VCL compilation failed
**   v1    0.2 VCL compilation failed (as expected)
***  v1    0.2 Found expected string: ("Unused backend c, defined:")
*    top   0.2 RESETTING after ../../../bin/varnishtest/tests/v00031.vtc
**   v1    0.2 Wait
**** v1    0.2 CLI TX|backend.list
***  v1    0.2 CLI RX  101
**** v1    0.2 CLI RX|Unknown request in manager process (child not running).
**** v1    0.2 CLI RX|Type 'help' for more info.
**   v1    0.2 Stop
**** v1    0.2 CLI TX|stop
***  v1    0.2 CLI RX  300
**** v1    0.2 CLI RX|Child in state stopped
**** v1    0.2 CLI TX|status
***  v1    0.2 CLI RX  200
**** v1    0.2 CLI RX|Child in state stopped
**** v1    0.2 STDOUT poll 0x10
**   v1    0.2 R 90220 Status: 0000 (u 0.063000 s 0.057000)
#    top  TEST ../../../bin/varnishtest/tests/v00031.vtc TIMED OUT (kill -9)
#    top  TEST ../../../bin/varnishtest/tests/v00031.vtc FAILED (60.002) signal=9

1 @ SunOS 5.11 i86pc 1.04 32_gcc4.7 uplex

*    top   0.0 TEST ../../../bin/varnishtest/tests/v00031.vtc starting
[...]
*    top   0.0 TEST param vcc_err_unref
[...]
**** v1    0.3 CLI TX|param.set vcc_err_unref true
***  v1    0.3 CLI RX  200
**   v1    0.3 CLI 200 <param.set vcc_err_unref true>
**   top   0.3 === varnish v1 -errvcl {Unused backend c, defined:} {
**** v1    0.3 CLI TX|vcl.inline vcl3 << %XJEIFLH|)Xspa8P
**** v1    0.3 CLI TX|vcl 4.0;
**** v1    0.3 CLI TX|
**** v1    0.3 CLI TX|\tbackend b { .host = "127.0.0.1"; }
**** v1    0.3 CLI TX|\tbackend c { .host = "127.0.0.1"; }
**** v1    0.3 CLI TX|
**** v1    0.3 CLI TX|%XJEIFLH|)Xspa8P
***  v1    0.3 CLI RX  106
**** v1    0.3 CLI RX|Message from VCC-compiler:
**** v1    0.3 CLI RX|Security: Privilege proc_setid missing, will not change uid/gid
**** v1    0.3 CLI RX|Unused backend c, defined:
**** v1    0.3 CLI RX|('<vcl.inline>' Line 4 Pos 17)
**** v1    0.3 CLI RX|        backend c { .host = "127.0.0.1"; }
**** v1    0.3 CLI RX|----------------#-------------------------
**** v1    0.3 CLI RX|
**** v1    0.3 CLI RX|Running VCC-compiler failed, exited with 2
**** v1    0.3 CLI RX|VCL compilation failed
**   v1    0.3 VCL compilation failed (as expected)
***  v1    0.3 Found expected string: ("Unused backend c, defined:")
*    top   0.3 RESETTING after ../../../bin/varnishtest/tests/v00031.vtc
**   v1    0.3 Wait
**** v1    0.3 CLI TX|backend.list
***  v1    0.3 CLI RX  101
**** v1    0.3 CLI RX|Unknown request in manager process (child not running).
**** v1    0.3 CLI RX|Type 'help' for more info.
**   v1    0.3 Stop
**** v1    0.3 CLI TX|stop
***  v1    0.3 CLI RX  300
**** v1    0.3 CLI RX|Child in state stopped
**** v1    0.3 CLI TX|status
***  v1    0.3 CLI RX  200
**** v1    0.3 CLI RX|Child in state stopped
**** v1    0.3 STDOUT poll 0x10
**   v1    0.3 R 51130 Status: 0000 (u 0.067000 s 0.063000)
#    top  TEST ../../../bin/varnishtest/tests/v00031.vtc TIMED OUT (kill -9)
#    top  TEST ../../../bin/varnishtest/tests/v00031.vtc FAILED (60.002) signal=9

1 @ SunOS 5.11 i86pc 1.04 64_sun12.4 uplex

*    top   0.0 TEST ../../../bin/varnishtest/tests/v00031.vtc starting
[...]
*    top   0.0 TEST param vcc_err_unref
[...]
**** v1    0.2 CLI TX|param.set vcc_err_unref true
***  v1    0.2 CLI RX  200
**   v1    0.2 CLI 200 <param.set vcc_err_unref true>
**   top   0.2 === varnish v1 -errvcl {Unused backend c, defined:} {
**** v1    0.2 CLI TX|vcl.inline vcl3 << %XJEIFLH|)Xspa8P
**** v1    0.2 CLI TX|vcl 4.0;
**** v1    0.2 CLI TX|
**** v1    0.2 CLI TX|\tbackend b { .host = "127.0.0.1"; }
**** v1    0.2 CLI TX|\tbackend c { .host = "127.0.0.1"; }
**** v1    0.2 CLI TX|
**** v1    0.2 CLI TX|%XJEIFLH|)Xspa8P
***  v1    0.2 CLI RX  106
**** v1    0.2 CLI RX|Message from VCC-compiler:
**** v1    0.2 CLI RX|Security: Privilege proc_setid missing, will not change uid/gid
**** v1    0.2 CLI RX|Unused backend c, defined:
**** v1    0.2 CLI RX|('<vcl.inline>' Line 4 Pos 17)
**** v1    0.2 CLI RX|        backend c { .host = "127.0.0.1"; }
**** v1    0.2 CLI RX|----------------#-------------------------
**** v1    0.2 CLI RX|
**** v1    0.2 CLI RX|Running VCC-compiler failed, exited with 2
**** v1    0.2 CLI RX|VCL compilation failed
**   v1    0.2 VCL compilation failed (as expected)
***  v1    0.2 Found expected string: ("Unused backend c, defined:")
*    top   0.2 RESETTING after ../../../bin/varnishtest/tests/v00031.vtc
**   v1    0.2 Wait
**** v1    0.2 CLI TX|backend.list
***  v1    0.2 CLI RX  101
**** v1    0.2 CLI RX|Unknown request in manager process (child not running).
**** v1    0.2 CLI RX|Type 'help' for more info.
**   v1    0.2 Stop
**** v1    0.2 CLI TX|stop
***  v1    0.2 CLI RX  300
**** v1    0.2 CLI RX|Child in state stopped
**** v1    0.2 CLI TX|status
***  v1    0.2 CLI RX  200
**** v1    0.2 CLI RX|Child in state stopped
**** v1    0.2 STDOUT poll 0x10
**   v1    0.2 R 68569 Status: 0000 (u 0.060000 s 0.091000)
#    top  TEST ../../../bin/varnishtest/tests/v00031.vtc TIMED OUT (kill -9)
#    top  TEST ../../../bin/varnishtest/tests/v00031.vtc FAILED (60.003) signal=9

1 @ SunOS 5.11 i86pc 1.04 64_sun12.4 uplex

*    top   0.0 TEST ../../../bin/varnishtest/tests/v00031.vtc starting
[...]
*    top   0.0 TEST param vcc_err_unref
[...]
**** v1    0.2 CLI TX|param.set vcc_err_unref true
***  v1    0.2 CLI RX  200
**   v1    0.2 CLI 200 <param.set vcc_err_unref true>
**   top   0.2 === varnish v1 -errvcl {Unused backend c, defined:} {
**** v1    0.2 CLI TX|vcl.inline vcl3 << %XJEIFLH|)Xspa8P
**** v1    0.2 CLI TX|vcl 4.0;
**** v1    0.2 CLI TX|
**** v1    0.2 CLI TX|\tbackend b { .host = "127.0.0.1"; }
**** v1    0.2 CLI TX|\tbackend c { .host = "127.0.0.1"; }
**** v1    0.2 CLI TX|
**** v1    0.2 CLI TX|%XJEIFLH|)Xspa8P
***  v1    0.2 CLI RX  106
**** v1    0.2 CLI RX|Message from VCC-compiler:
**** v1    0.2 CLI RX|Security: Privilege proc_setid missing, will not change uid/gid
**** v1    0.2 CLI RX|Unused backend c, defined:
**** v1    0.2 CLI RX|('<vcl.inline>' Line 4 Pos 17)
**** v1    0.2 CLI RX|        backend c { .host = "127.0.0.1"; }
**** v1    0.2 CLI RX|----------------#-------------------------
**** v1    0.2 CLI RX|
**** v1    0.2 CLI RX|Running VCC-compiler failed, exited with 2
**** v1    0.2 CLI RX|VCL compilation failed
**   v1    0.2 VCL compilation failed (as expected)
***  v1    0.2 Found expected string: ("Unused backend c, defined:")
*    top   0.2 RESETTING after ../../../bin/varnishtest/tests/v00031.vtc
**   v1    0.2 Wait
**** v1    0.2 CLI TX|backend.list
***  v1    0.2 CLI RX  101
**** v1    0.2 CLI RX|Unknown request in manager process (child not running).
**** v1    0.2 CLI RX|Type 'help' for more info.
**   v1    0.2 Stop
**** v1    0.2 CLI TX|stop
***  v1    0.2 CLI RX  300
**** v1    0.2 CLI RX|Child in state stopped
**** v1    0.2 CLI TX|status
***  v1    0.2 CLI RX  200
**** v1    0.2 CLI RX|Child in state stopped
**** v1    0.2 STDOUT poll 0x10
**   v1    0.2 R 66887 Status: 0000 (u 0.060000 s 0.087000)
#    top  TEST ../../../bin/varnishtest/tests/v00031.vtc TIMED OUT (kill -9)
#    top  TEST ../../../bin/varnishtest/tests/v00031.vtc FAILED (60.003) signal=9

1 @ SunOS 5.11 i86pc 1.04 64_sun12.4 uplex

*    top   0.0 TEST ../../../bin/varnishtest/tests/v00031.vtc starting
[...]
*    top   0.0 TEST param vcc_err_unref
[...]
**** v1    0.2 CLI TX|param.set vcc_err_unref true
***  v1    0.2 CLI RX  200
**   v1    0.2 CLI 200 <param.set vcc_err_unref true>
**   top   0.2 === varnish v1 -errvcl {Unused backend c, defined:} {
**** v1    0.2 CLI TX|vcl.inline vcl3 << %XJEIFLH|)Xspa8P
**** v1    0.2 CLI TX|vcl 4.0;
**** v1    0.2 CLI TX|
**** v1    0.2 CLI TX|\tbackend b { .host = "127.0.0.1"; }
**** v1    0.2 CLI TX|\tbackend c { .host = "127.0.0.1"; }
**** v1    0.2 CLI TX|
**** v1    0.2 CLI TX|%XJEIFLH|)Xspa8P
***  v1    0.2 CLI RX  106
**** v1    0.2 CLI RX|Message from VCC-compiler:
**** v1    0.2 CLI RX|Security: Privilege proc_setid missing, will not change uid/gid
**** v1    0.2 CLI RX|Unused backend c, defined:
**** v1    0.2 CLI RX|('<vcl.inline>' Line 4 Pos 17)
**** v1    0.2 CLI RX|        backend c { .host = "127.0.0.1"; }
**** v1    0.2 CLI RX|----------------#-------------------------
**** v1    0.2 CLI RX|
**** v1    0.2 CLI RX|Running VCC-compiler failed, exited with 2
**** v1    0.2 CLI RX|VCL compilation failed
**   v1    0.2 VCL compilation failed (as expected)
***  v1    0.2 Found expected string: ("Unused backend c, defined:")
*    top   0.2 RESETTING after ../../../bin/varnishtest/tests/v00031.vtc
**   v1    0.2 Wait
**** v1    0.2 CLI TX|backend.list
***  v1    0.2 CLI RX  101
**** v1    0.2 CLI RX|Unknown request in manager process (child not running).
**** v1    0.2 CLI RX|Type 'help' for more info.
**   v1    0.2 Stop
**** v1    0.2 CLI TX|stop
***  v1    0.2 CLI RX  300
**** v1    0.2 CLI RX|Child in state stopped
**** v1    0.2 CLI TX|status
***  v1    0.2 CLI RX  200
**** v1    0.2 CLI RX|Child in state stopped
**** v1    0.2 STDOUT poll 0x10
**   v1    0.2 R 10234 Status: 0000 (u 0.065000 s 0.094000)
#    top  TEST ../../../bin/varnishtest/tests/v00031.vtc TIMED OUT (kill -9)
#    top  TEST ../../../bin/varnishtest/tests/v00031.vtc FAILED (60.004) signal=9

1 @ SunOS 5.11 i86pc 1.04 32_gcc4.7 uplex

*    top   0.0 TEST ../../../bin/varnishtest/tests/v00031.vtc starting
[...]
*    top   0.0 TEST param vcc_err_unref
[...]
**** v1    0.2 CLI TX|param.set vcc_err_unref true
***  v1    0.2 CLI RX  200
**   v1    0.2 CLI 200 <param.set vcc_err_unref true>
**   top   0.2 === varnish v1 -errvcl {Unused backend c, defined:} {
**** v1    0.2 CLI TX|vcl.inline vcl3 << %XJEIFLH|)Xspa8P
**** v1    0.2 CLI TX|vcl 4.0;
**** v1    0.2 CLI TX|
**** v1    0.2 CLI TX|\tbackend b { .host = "127.0.0.1"; }
**** v1    0.2 CLI TX|\tbackend c { .host = "127.0.0.1"; }
**** v1    0.2 CLI TX|
**** v1    0.2 CLI TX|%XJEIFLH|)Xspa8P
***  v1    0.3 CLI RX  106
**** v1    0.3 CLI RX|Message from VCC-compiler:
**** v1    0.3 CLI RX|Security: Privilege proc_setid missing, will not change uid/gid
**** v1    0.3 CLI RX|Unused backend c, defined:
**** v1    0.3 CLI RX|('<vcl.inline>' Line 4 Pos 17)
**** v1    0.3 CLI RX|        backend c { .host = "127.0.0.1"; }
**** v1    0.3 CLI RX|----------------#-------------------------
**** v1    0.3 CLI RX|
**** v1    0.3 CLI RX|Running VCC-compiler failed, exited with 2
**** v1    0.3 CLI RX|VCL compilation failed
**   v1    0.3 VCL compilation failed (as expected)
***  v1    0.3 Found expected string: ("Unused backend c, defined:")
*    top   0.3 RESETTING after ../../../bin/varnishtest/tests/v00031.vtc
**   v1    0.3 Wait
**** v1    0.3 CLI TX|backend.list
***  v1    0.3 CLI RX  101
**** v1    0.3 CLI RX|Unknown request in manager process (child not running).
**** v1    0.3 CLI RX|Type 'help' for more info.
**   v1    0.3 Stop
**** v1    0.3 CLI TX|stop
***  v1    0.3 CLI RX  300
**** v1    0.3 CLI RX|Child in state stopped
**** v1    0.3 CLI TX|status
***  v1    0.3 CLI RX  200
**** v1    0.3 CLI RX|Child in state stopped
**** v1    0.3 STDOUT poll 0x10
**   v1    0.3 R 53420 Status: 0000 (u 0.067000 s 0.061000)
#    top  TEST ../../../bin/varnishtest/tests/v00031.vtc TIMED OUT (kill -9)
#    top  TEST ../../../bin/varnishtest/tests/v00031.vtc FAILED (60.002) signal=9

1 @ SunOS 5.11 i86pc 1.04 32_gcc4.7 uplex

*    top   0.0 TEST ../../../bin/varnishtest/tests/v00031.vtc starting
[...]
*    top   0.0 TEST param vcc_err_unref
[...]
**** v1    0.3 CLI TX|param.set vcc_err_unref true
***  v1    0.3 CLI RX  200
**   v1    0.3 CLI 200 <param.set vcc_err_unref true>
**   top   0.3 === varnish v1 -errvcl {Unused backend c, defined:} {
**** v1    0.3 CLI TX|vcl.inline vcl3 << %XJEIFLH|)Xspa8P
**** v1    0.3 CLI TX|vcl 4.0;
**** v1    0.3 CLI TX|
**** v1    0.3 CLI TX|\tbackend b { .host = "127.0.0.1"; }
**** v1    0.3 CLI TX|\tbackend c { .host = "127.0.0.1"; }
**** v1    0.3 CLI TX|
**** v1    0.3 CLI TX|%XJEIFLH|)Xspa8P
***  v1    0.3 CLI RX  106
**** v1    0.3 CLI RX|Message from VCC-compiler:
**** v1    0.3 CLI RX|Security: Privilege proc_setid missing, will not change uid/gid
**** v1    0.3 CLI RX|Unused backend c, defined:
**** v1    0.3 CLI RX|('<vcl.inline>' Line 4 Pos 17)
**** v1    0.3 CLI RX|        backend c { .host = "127.0.0.1"; }
**** v1    0.3 CLI RX|----------------#-------------------------
**** v1    0.3 CLI RX|
**** v1    0.3 CLI RX|Running VCC-compiler failed, exited with 2
**** v1    0.3 CLI RX|VCL compilation failed
**   v1    0.3 VCL compilation failed (as expected)
***  v1    0.3 Found expected string: ("Unused backend c, defined:")
*    top   0.3 RESETTING after ../../../bin/varnishtest/tests/v00031.vtc
**   v1    0.3 Wait
**** v1    0.3 CLI TX|backend.list
***  v1    0.3 CLI RX  101
**** v1    0.3 CLI RX|Unknown request in manager process (child not running).
**** v1    0.3 CLI RX|Type 'help' for more info.
**   v1    0.3 Stop
**** v1    0.3 CLI TX|stop
***  v1    0.3 CLI RX  300
**** v1    0.3 CLI RX|Child in state stopped
**** v1    0.3 CLI TX|status
***  v1    0.3 CLI RX  200
**** v1    0.3 CLI RX|Child in state stopped
**** v1    0.3 STDOUT poll 0x10
**   v1    0.3 R 7038 Status: 0000 (u 0.064000 s 0.064000)
#    top  TEST ../../../bin/varnishtest/tests/v00031.vtc TIMED OUT (kill -9)
#    top  TEST ../../../bin/varnishtest/tests/v00031.vtc FAILED (60.001) signal=9

1 @ SunOS 5.11 i86pc 1.04 32_sun12.4 uplex

*    top   0.0 TEST ../../../bin/varnishtest/tests/v00031.vtc starting
[...]
*    top   0.0 TEST param vcc_err_unref
[...]
**** v1    0.2 CLI TX|param.set vcc_err_unref true
***  v1    0.2 CLI RX  200
**   v1    0.2 CLI 200 <param.set vcc_err_unref true>
**   top   0.2 === varnish v1 -errvcl {Unused backend c, defined:} {
**** v1    0.2 CLI TX|vcl.inline vcl3 << %XJEIFLH|)Xspa8P
**** v1    0.2 CLI TX|vcl 4.0;
**** v1    0.2 CLI TX|
**** v1    0.2 CLI TX|\tbackend b { .host = "127.0.0.1"; }
**** v1    0.2 CLI TX|\tbackend c { .host = "127.0.0.1"; }
**** v1    0.2 CLI TX|
**** v1    0.2 CLI TX|%XJEIFLH|)Xspa8P
***  v1    0.2 CLI RX  106
**** v1    0.2 CLI RX|Message from VCC-compiler:
**** v1    0.2 CLI RX|Security: Privilege proc_setid missing, will not change uid/gid
**** v1    0.2 CLI RX|Unused backend c, defined:
**** v1    0.2 CLI RX|('<vcl.inline>' Line 4 Pos 17)
**** v1    0.2 CLI RX|        backend c { .host = "127.0.0.1"; }
**** v1    0.2 CLI RX|----------------#-------------------------
**** v1    0.2 CLI RX|
**** v1    0.2 CLI RX|Running VCC-compiler failed, exited with 2
**** v1    0.2 CLI RX|VCL compilation failed
**   v1    0.2 VCL compilation failed (as expected)
***  v1    0.2 Found expected string: ("Unused backend c, defined:")
*    top   0.2 RESETTING after ../../../bin/varnishtest/tests/v00031.vtc
**   v1    0.2 Wait
**** v1    0.2 CLI TX|backend.list
***  v1    0.2 CLI RX  101
**** v1    0.2 CLI RX|Unknown request in manager process (child not running).
**** v1    0.2 CLI RX|Type 'help' for more info.
**   v1    0.2 Stop
**** v1    0.2 CLI TX|stop
***  v1    0.2 CLI RX  300
**** v1    0.2 CLI RX|Child in state stopped
**** v1    0.2 CLI TX|status
***  v1    0.2 CLI RX  200
**** v1    0.2 CLI RX|Child in state stopped
**** v1    0.2 STDOUT poll 0x10
**   v1    0.2 R 36385 Status: 0000 (u 0.057000 s 0.075000)
#    top  TEST ../../../bin/varnishtest/tests/v00031.vtc TIMED OUT (kill -9)
#    top  TEST ../../../bin/varnishtest/tests/v00031.vtc FAILED (60.002) signal=9

1 @ SunOS 5.11 i86pc 1.04 64_sun12.4 uplex

*    top   0.0 TEST ../../../bin/varnishtest/tests/v00031.vtc starting
[...]
*    top   0.0 TEST param vcc_err_unref
[...]
**** v1    0.2 CLI TX|param.set vcc_err_unref true
***  v1    0.2 CLI RX  200
**   v1    0.2 CLI 200 <param.set vcc_err_unref true>
**   top   0.2 === varnish v1 -errvcl {Unused backend c, defined:} {
**** v1    0.2 CLI TX|vcl.inline vcl3 << %XJEIFLH|)Xspa8P
**** v1    0.2 CLI TX|vcl 4.0;
**** v1    0.2 CLI TX|
**** v1    0.2 CLI TX|\tbackend b { .host = "127.0.0.1"; }
**** v1    0.2 CLI TX|\tbackend c { .host = "127.0.0.1"; }
**** v1    0.2 CLI TX|
**** v1    0.2 CLI TX|%XJEIFLH|)Xspa8P
***  v1    0.2 CLI RX  106
**** v1    0.2 CLI RX|Message from VCC-compiler:
**** v1    0.2 CLI RX|Security: Privilege proc_setid missing, will not change uid/gid
**** v1    0.2 CLI RX|Unused backend c, defined:
**** v1    0.2 CLI RX|('<vcl.inline>' Line 4 Pos 17)
**** v1    0.2 CLI RX|        backend c { .host = "127.0.0.1"; }
**** v1    0.2 CLI RX|----------------#-------------------------
**** v1    0.2 CLI RX|
**** v1    0.2 CLI RX|Running VCC-compiler failed, exited with 2
**** v1    0.2 CLI RX|VCL compilation failed
**   v1    0.2 VCL compilation failed (as expected)
***  v1    0.2 Found expected string: ("Unused backend c, defined:")
*    top   0.2 RESETTING after ../../../bin/varnishtest/tests/v00031.vtc
**   v1    0.2 Wait
**** v1    0.2 CLI TX|backend.list
***  v1    0.2 CLI RX  101
**** v1    0.2 CLI RX|Unknown request in manager process (child not running).
**** v1    0.2 CLI RX|Type 'help' for more info.
**   v1    0.2 Stop
**** v1    0.2 CLI TX|stop
***  v1    0.2 CLI RX  300
**** v1    0.2 CLI RX|Child in state stopped
**** v1    0.2 CLI TX|status
***  v1    0.2 CLI RX  200
**** v1    0.2 CLI RX|Child in state stopped
**** v1    0.2 STDOUT poll 0x10
**   v1    0.2 R 68447 Status: 0000 (u 0.072000 s 0.108000)
#    top  TEST ../../../bin/varnishtest/tests/v00031.vtc TIMED OUT (kill -9)
#    top  TEST ../../../bin/varnishtest/tests/v00031.vtc FAILED (60.004) signal=9

1 @ SunOS 5.11 i86pc 1.04 32_sun12.4 uplex

*    top   0.0 TEST ../../../bin/varnishtest/tests/v00031.vtc starting
[...]
*    top   0.0 TEST param vcc_err_unref
[...]
**** v1    0.2 CLI TX|param.set vcc_err_unref true
***  v1    0.2 CLI RX  200
**   v1    0.2 CLI 200 <param.set vcc_err_unref true>
**   top   0.2 === varnish v1 -errvcl {Unused backend c, defined:} {
**** v1    0.2 CLI TX|vcl.inline vcl3 << %XJEIFLH|)Xspa8P
**** v1    0.2 CLI TX|vcl 4.0;
**** v1    0.2 CLI TX|
**** v1    0.2 CLI TX|\tbackend b { .host = "127.0.0.1"; }
**** v1    0.2 CLI TX|\tbackend c { .host = "127.0.0.1"; }
**** v1    0.2 CLI TX|
**** v1    0.2 CLI TX|%XJEIFLH|)Xspa8P
***  v1    0.2 CLI RX  106
**** v1    0.2 CLI RX|Message from VCC-compiler:
**** v1    0.2 CLI RX|Security: Privilege proc_setid missing, will not change uid/gid
**** v1    0.2 CLI RX|Unused backend c, defined:
**** v1    0.2 CLI RX|('<vcl.inline>' Line 4 Pos 17)
**** v1    0.2 CLI RX|        backend c { .host = "127.0.0.1"; }
**** v1    0.2 CLI RX|----------------#-------------------------
**** v1    0.2 CLI RX|
**** v1    0.2 CLI RX|Running VCC-compiler failed, exited with 2
**** v1    0.2 CLI RX|VCL compilation failed
**   v1    0.2 VCL compilation failed (as expected)
***  v1    0.2 Found expected string: ("Unused backend c, defined:")
*    top   0.2 RESETTING after ../../../bin/varnishtest/tests/v00031.vtc
**   v1    0.2 Wait
**** v1    0.2 CLI TX|backend.list
***  v1    0.2 CLI RX  101
**** v1    0.2 CLI RX|Unknown request in manager process (child not running).
**** v1    0.2 CLI RX|Type 'help' for more info.
**   v1    0.2 Stop
**** v1    0.2 CLI TX|stop
***  v1    0.2 CLI RX  300
**** v1    0.2 CLI RX|Child in state stopped
**** v1    0.2 CLI TX|status
***  v1    0.2 CLI RX  200
**** v1    0.2 CLI RX|Child in state stopped
**** v1    0.2 STDOUT poll 0x10
**   v1    0.2 R 80595 Status: 0000 (u 0.056000 s 0.075000)
#    top  TEST ../../../bin/varnishtest/tests/v00031.vtc TIMED OUT (kill -9)
#    top  TEST ../../../bin/varnishtest/tests/v00031.vtc FAILED (60.001) signal=9

1 @ SunOS 5.11 i86pc 1.04 64_sun12.4 uplex

*    top   0.0 TEST ../../../bin/varnishtest/tests/v00031.vtc starting
[...]
*    top   0.0 TEST param vcc_err_unref
[...]
**** v1    0.2 CLI TX|param.set vcc_err_unref true
***  v1    0.2 CLI RX  200
**   v1    0.2 CLI 200 <param.set vcc_err_unref true>
**   top   0.2 === varnish v1 -errvcl {Unused backend c, defined:} {
**** v1    0.2 CLI TX|vcl.inline vcl3 << %XJEIFLH|)Xspa8P
**** v1    0.2 CLI TX|vcl 4.0;
**** v1    0.2 CLI TX|
**** v1    0.2 CLI TX|\tbackend b { .host = "127.0.0.1"; }
**** v1    0.2 CLI TX|\tbackend c { .host = "127.0.0.1"; }
**** v1    0.2 CLI TX|
**** v1    0.2 CLI TX|%XJEIFLH|)Xspa8P
***  v1    0.2 CLI RX  106
**** v1    0.2 CLI RX|Message from VCC-compiler:
**** v1    0.2 CLI RX|Security: Privilege proc_setid missing, will not change uid/gid
**** v1    0.2 CLI RX|Unused backend c, defined:
**** v1    0.2 CLI RX|('<vcl.inline>' Line 4 Pos 17)
**** v1    0.2 CLI RX|        backend c { .host = "127.0.0.1"; }
**** v1    0.2 CLI RX|----------------#-------------------------
**** v1    0.2 CLI RX|
**** v1    0.2 CLI RX|Running VCC-compiler failed, exited with 2
**** v1    0.2 CLI RX|VCL compilation failed
**   v1    0.2 VCL compilation failed (as expected)
***  v1    0.2 Found expected string: ("Unused backend c, defined:")
*    top   0.2 RESETTING after ../../../bin/varnishtest/tests/v00031.vtc
**   v1    0.2 Wait
**** v1    0.2 CLI TX|backend.list
***  v1    0.2 CLI RX  101
**** v1    0.2 CLI RX|Unknown request in manager process (child not running).
**** v1    0.2 CLI RX|Type 'help' for more info.
**   v1    0.2 Stop
**** v1    0.2 CLI TX|stop
***  v1    0.2 CLI RX  300
**** v1    0.2 CLI RX|Child in state stopped
**** v1    0.2 CLI TX|status
***  v1    0.2 CLI RX  200
**** v1    0.2 CLI RX|Child in state stopped
**** v1    0.2 STDOUT poll 0x10
**   v1    0.2 R 62293 Status: 0000 (u 0.062000 s 0.088000)
#    top  TEST ../../../bin/varnishtest/tests/v00031.vtc TIMED OUT (kill -9)
#    top  TEST ../../../bin/varnishtest/tests/v00031.vtc FAILED (60.003) signal=9

1 @ SunOS 5.11 i86pc 1.04 32_sun12.4 uplex

*    top   0.0 TEST ../../../bin/varnishtest/tests/v00031.vtc starting
[...]
*    top   0.0 TEST param vcc_err_unref
[...]
**** v1    0.2 CLI TX|param.set vcc_err_unref true
***  v1    0.2 CLI RX  200
**   v1    0.2 CLI 200 <param.set vcc_err_unref true>
**   top   0.2 === varnish v1 -errvcl {Unused backend c, defined:} {
**** v1    0.2 CLI TX|vcl.inline vcl3 << %XJEIFLH|)Xspa8P
**** v1    0.2 CLI TX|vcl 4.0;
**** v1    0.2 CLI TX|
**** v1    0.2 CLI TX|\tbackend b { .host = "127.0.0.1"; }
**** v1    0.2 CLI TX|\tbackend c { .host = "127.0.0.1"; }
**** v1    0.2 CLI TX|
**** v1    0.2 CLI TX|%XJEIFLH|)Xspa8P
***  v1    0.2 CLI RX  106
**** v1    0.2 CLI RX|Message from VCC-compiler:
**** v1    0.2 CLI RX|Security: Privilege proc_setid missing, will not change uid/gid
**** v1    0.2 CLI RX|Unused backend c, defined:
**** v1    0.2 CLI RX|('<vcl.inline>' Line 4 Pos 17)
**** v1    0.2 CLI RX|        backend c { .host = "127.0.0.1"; }
**** v1    0.2 CLI RX|----------------#-------------------------
**** v1    0.2 CLI RX|
**** v1    0.2 CLI RX|Running VCC-compiler failed, exited with 2
**** v1    0.2 CLI RX|VCL compilation failed
**   v1    0.2 VCL compilation failed (as expected)
***  v1    0.2 Found expected string: ("Unused backend c, defined:")
*    top   0.2 RESETTING after ../../../bin/varnishtest/tests/v00031.vtc
**   v1    0.2 Wait
**** v1    0.2 CLI TX|backend.list
***  v1    0.2 CLI RX  101
**** v1    0.2 CLI RX|Unknown request in manager process (child not running).
**** v1    0.2 CLI RX|Type 'help' for more info.
**   v1    0.2 Stop
**** v1    0.2 CLI TX|stop
***  v1    0.2 CLI RX  300
**** v1    0.2 CLI RX|Child in state stopped
**** v1    0.2 CLI TX|status
***  v1    0.2 CLI RX  200
**** v1    0.2 CLI RX|Child in state stopped
**** v1    0.2 STDOUT poll 0x10
**   v1    0.2 R 70629 Status: 0000 (u 0.060000 s 0.084000)
#    top  TEST ../../../bin/varnishtest/tests/v00031.vtc TIMED OUT (kill -9)
#    top  TEST ../../../bin/varnishtest/tests/v00031.vtc FAILED (60.002) signal=9

1 @ SunOS 5.11 i86pc 1.04 32_sun12.4 uplex

*    top   0.0 TEST ../../../bin/varnishtest/tests/v00031.vtc starting
[...]
*    top   0.0 TEST param vcc_err_unref
[...]
**** v1    0.2 CLI TX|param.set vcc_err_unref true
***  v1    0.2 CLI RX  200
**   v1    0.2 CLI 200 <param.set vcc_err_unref true>
**   top   0.2 === varnish v1 -errvcl {Unused backend c, defined:} {
**** v1    0.2 CLI TX|vcl.inline vcl3 << %XJEIFLH|)Xspa8P
**** v1    0.2 CLI TX|vcl 4.0;
**** v1    0.2 CLI TX|
**** v1    0.2 CLI TX|\tbackend b { .host = "127.0.0.1"; }
**** v1    0.2 CLI TX|\tbackend c { .host = "127.0.0.1"; }
**** v1    0.2 CLI TX|
**** v1    0.2 CLI TX|%XJEIFLH|)Xspa8P
***  v1    0.2 CLI RX  106
**** v1    0.2 CLI RX|Message from VCC-compiler:
**** v1    0.2 CLI RX|Security: Privilege proc_setid missing, will not change uid/gid
**** v1    0.2 CLI RX|Unused backend c, defined:
**** v1    0.2 CLI RX|('<vcl.inline>' Line 4 Pos 17)
**** v1    0.2 CLI RX|        backend c { .host = "127.0.0.1"; }
**** v1    0.2 CLI RX|----------------#-------------------------
**** v1    0.2 CLI RX|
**** v1    0.2 CLI RX|Running VCC-compiler failed, exited with 2
**** v1    0.2 CLI RX|VCL compilation failed
**   v1    0.2 VCL compilation failed (as expected)
***  v1    0.2 Found expected string: ("Unused backend c, defined:")
*    top   0.2 RESETTING after ../../../bin/varnishtest/tests/v00031.vtc
**   v1    0.2 Wait
**** v1    0.2 CLI TX|backend.list
***  v1    0.2 CLI RX  101
**** v1    0.2 CLI RX|Unknown request in manager process (child not running).
**** v1    0.2 CLI RX|Type 'help' for more info.
**   v1    0.2 Stop
**** v1    0.2 CLI TX|stop
***  v1    0.2 CLI RX  300
**** v1    0.2 CLI RX|Child in state stopped
**** v1    0.2 CLI TX|status
***  v1    0.2 CLI RX  200
**** v1    0.2 CLI RX|Child in state stopped
**** v1    0.2 STDOUT poll 0x10
**   v1    0.2 R 40638 Status: 0000 (u 0.055000 s 0.074000)
#    top  TEST ../../../bin/varnishtest/tests/v00031.vtc TIMED OUT (kill -9)
#    top  TEST ../../../bin/varnishtest/tests/v00031.vtc FAILED (60.002) signal=9

1 @ SunOS 5.11 i86pc 1.04 32_gcc4.7 uplex

*    top   0.0 TEST ../../../bin/varnishtest/tests/v00031.vtc starting
[...]
*    top   0.0 TEST param vcc_err_unref
[...]
**** v1    0.2 CLI TX|param.set vcc_err_unref true
***  v1    0.2 CLI RX  200
**   v1    0.2 CLI 200 <param.set vcc_err_unref true>
**   top   0.2 === varnish v1 -errvcl {Unused backend c, defined:} {
**** v1    0.2 CLI TX|vcl.inline vcl3 << %XJEIFLH|)Xspa8P
**** v1    0.2 CLI TX|vcl 4.0;
**** v1    0.2 CLI TX|
**** v1    0.2 CLI TX|\tbackend b { .host = "127.0.0.1"; }
**** v1    0.2 CLI TX|\tbackend c { .host = "127.0.0.1"; }
**** v1    0.2 CLI TX|
**** v1    0.2 CLI TX|%XJEIFLH|)Xspa8P
***  v1    0.2 CLI RX  106
**** v1    0.2 CLI RX|Message from VCC-compiler:
**** v1    0.2 CLI RX|Security: Privilege proc_setid missing, will not change uid/gid
**** v1    0.2 CLI RX|Unused backend c, defined:
**** v1    0.2 CLI RX|('<vcl.inline>' Line 4 Pos 17)
**** v1    0.2 CLI RX|        backend c { .host = "127.0.0.1"; }
**** v1    0.2 CLI RX|----------------#-------------------------
**** v1    0.2 CLI RX|
**** v1    0.2 CLI RX|Running VCC-compiler failed, exited with 2
**** v1    0.2 CLI RX|VCL compilation failed
**   v1    0.2 VCL compilation failed (as expected)
***  v1    0.2 Found expected string: ("Unused backend c, defined:")
*    top   0.2 RESETTING after ../../../bin/varnishtest/tests/v00031.vtc
**   v1    0.2 Wait
**** v1    0.2 CLI TX|backend.list
***  v1    0.2 CLI RX  101
**** v1    0.2 CLI RX|Unknown request in manager process (child not running).
**** v1    0.2 CLI RX|Type 'help' for more info.
**   v1    0.2 Stop
**** v1    0.2 CLI TX|stop
***  v1    0.2 CLI RX  300
**** v1    0.2 CLI RX|Child in state stopped
**** v1    0.2 CLI TX|status
***  v1    0.2 CLI RX  200
**** v1    0.2 CLI RX|Child in state stopped
**** v1    0.2 STDOUT poll 0x10
**   v1    0.3 R 91563 Status: 0000 (u 0.065000 s 0.059000)
#    top  TEST ../../../bin/varnishtest/tests/v00031.vtc TIMED OUT (kill -9)
#    top  TEST ../../../bin/varnishtest/tests/v00031.vtc FAILED (60.002) signal=9

1 @ SunOS 5.11 i86pc 1.04 32_sun12.4 uplex

*    top   0.0 TEST ../../../bin/varnishtest/tests/v00031.vtc starting
[...]
*    top   0.0 TEST param vcc_err_unref
[...]
**** v1    0.2 CLI TX|param.set vcc_err_unref true
***  v1    0.2 CLI RX  200
**   v1    0.2 CLI 200 <param.set vcc_err_unref true>
**   top   0.2 === varnish v1 -errvcl {Unused backend c, defined:} {
**** v1    0.2 CLI TX|vcl.inline vcl3 << %XJEIFLH|)Xspa8P
**** v1    0.2 CLI TX|vcl 4.0;
**** v1    0.2 CLI TX|
**** v1    0.2 CLI TX|\tbackend b { .host = "127.0.0.1"; }
**** v1    0.2 CLI TX|\tbackend c { .host = "127.0.0.1"; }
**** v1    0.2 CLI TX|
**** v1    0.2 CLI TX|%XJEIFLH|)Xspa8P
***  v1    0.2 CLI RX  106
**** v1    0.2 CLI RX|Message from VCC-compiler:
**** v1    0.2 CLI RX|Security: Privilege proc_setid missing, will not change uid/gid
**** v1    0.2 CLI RX|Unused backend c, defined:
**** v1    0.2 CLI RX|('<vcl.inline>' Line 4 Pos 17)
**** v1    0.2 CLI RX|        backend c { .host = "127.0.0.1"; }
**** v1    0.2 CLI RX|----------------#-------------------------
**** v1    0.2 CLI RX|
**** v1    0.2 CLI RX|Running VCC-compiler failed, exited with 2
**** v1    0.2 CLI RX|VCL compilation failed
**   v1    0.2 VCL compilation failed (as expected)
***  v1    0.2 Found expected string: ("Unused backend c, defined:")
*    top   0.2 RESETTING after ../../../bin/varnishtest/tests/v00031.vtc
**   v1    0.2 Wait
**** v1    0.2 CLI TX|backend.list
***  v1    0.2 CLI RX  101
**** v1    0.2 CLI RX|Unknown request in manager process (child not running).
**** v1    0.2 CLI RX|Type 'help' for more info.
**   v1    0.2 Stop
**** v1    0.2 CLI TX|stop
***  v1    0.2 CLI RX  300
**** v1    0.2 CLI RX|Child in state stopped
**** v1    0.2 CLI TX|status
***  v1    0.2 CLI RX  200
**** v1    0.2 CLI RX|Child in state stopped
**** v1    0.2 STDOUT poll 0x10
**   v1    0.2 R 59790 Status: 0000 (u 0.055000 s 0.074000)
#    top  TEST ../../../bin/varnishtest/tests/v00031.vtc TIMED OUT (kill -9)
#    top  TEST ../../../bin/varnishtest/tests/v00031.vtc FAILED (60.002) signal=9

1 @ SunOS 5.11 i86pc 1.04 32_gcc4.7 uplex

*    top   0.0 TEST ../../../bin/varnishtest/tests/v00031.vtc starting
[...]
*    top   0.0 TEST param vcc_err_unref
[...]
**** v1    0.2 CLI TX|param.set vcc_err_unref true
***  v1    0.2 CLI RX  200
**   v1    0.2 CLI 200 <param.set vcc_err_unref true>
**   top   0.2 === varnish v1 -errvcl {Unused backend c, defined:} {
**** v1    0.2 CLI TX|vcl.inline vcl3 << %XJEIFLH|)Xspa8P
**** v1    0.2 CLI TX|vcl 4.0;
**** v1    0.2 CLI TX|
**** v1    0.2 CLI TX|\tbackend b { .host = "127.0.0.1"; }
**** v1    0.2 CLI TX|\tbackend c { .host = "127.0.0.1"; }
**** v1    0.2 CLI TX|
**** v1    0.2 CLI TX|%XJEIFLH|)Xspa8P
***  v1    0.3 CLI RX  106
**** v1    0.3 CLI RX|Message from VCC-compiler:
**** v1    0.3 CLI RX|Security: Privilege proc_setid missing, will not change uid/gid
**** v1    0.3 CLI RX|Unused backend c, defined:
**** v1    0.3 CLI RX|('<vcl.inline>' Line 4 Pos 17)
**** v1    0.3 CLI RX|        backend c { .host = "127.0.0.1"; }
**** v1    0.3 CLI RX|----------------#-------------------------
**** v1    0.3 CLI RX|
**** v1    0.3 CLI RX|Running VCC-compiler failed, exited with 2
**** v1    0.3 CLI RX|VCL compilation failed
**   v1    0.3 VCL compilation failed (as expected)
***  v1    0.3 Found expected string: ("Unused backend c, defined:")
*    top   0.3 RESETTING after ../../../bin/varnishtest/tests/v00031.vtc
**   v1    0.3 Wait
**** v1    0.3 CLI TX|backend.list
***  v1    0.3 CLI RX  101
**** v1    0.3 CLI RX|Unknown request in manager process (child not running).
**** v1    0.3 CLI RX|Type 'help' for more info.
**   v1    0.3 Stop
**** v1    0.3 CLI TX|stop
***  v1    0.3 CLI RX  300
**** v1    0.3 CLI RX|Child in state stopped
**** v1    0.3 CLI TX|status
***  v1    0.3 CLI RX  200
**** v1    0.3 CLI RX|Child in state stopped
**** v1    0.3 STDOUT poll 0x10
**   v1    0.3 R 91295 Status: 0000 (u 0.064000 s 0.062000)
#    top  TEST ../../../bin/varnishtest/tests/v00031.vtc TIMED OUT (kill -9)
#    top  TEST ../../../bin/varnishtest/tests/v00031.vtc FAILED (60.001) signal=9

1 @ SunOS 5.11 i86pc 1.04 32_gcc4.7 uplex

*    top   0.0 TEST ../../../bin/varnishtest/tests/v00031.vtc starting
[...]
*    top   0.0 TEST param vcc_err_unref
[...]
**** v1    0.2 CLI TX|param.set vcc_err_unref true
***  v1    0.2 CLI RX  200
**   v1    0.2 CLI 200 <param.set vcc_err_unref true>
**   top   0.2 === varnish v1 -errvcl {Unused backend c, defined:} {
**** v1    0.2 CLI TX|vcl.inline vcl3 << %XJEIFLH|)Xspa8P
**** v1    0.2 CLI TX|vcl 4.0;
**** v1    0.2 CLI TX|
**** v1    0.2 CLI TX|\tbackend b { .host = "127.0.0.1"; }
**** v1    0.2 CLI TX|\tbackend c { .host = "127.0.0.1"; }
**** v1    0.2 CLI TX|
**** v1    0.2 CLI TX|%XJEIFLH|)Xspa8P
***  v1    0.3 CLI RX  106
**** v1    0.3 CLI RX|Message from VCC-compiler:
**** v1    0.3 CLI RX|Security: Privilege proc_setid missing, will not change uid/gid
**** v1    0.3 CLI RX|Unused backend c, defined:
**** v1    0.3 CLI RX|('<vcl.inline>' Line 4 Pos 17)
**** v1    0.3 CLI RX|        backend c { .host = "127.0.0.1"; }
**** v1    0.3 CLI RX|----------------#-------------------------
**** v1    0.3 CLI RX|
**** v1    0.3 CLI RX|Running VCC-compiler failed, exited with 2
**** v1    0.3 CLI RX|VCL compilation failed
**   v1    0.3 VCL compilation failed (as expected)
***  v1    0.3 Found expected string: ("Unused backend c, defined:")
*    top   0.3 RESETTING after ../../../bin/varnishtest/tests/v00031.vtc
**   v1    0.3 Wait
**** v1    0.3 CLI TX|backend.list
***  v1    0.3 CLI RX  101
**** v1    0.3 CLI RX|Unknown request in manager process (child not running).
**** v1    0.3 CLI RX|Type 'help' for more info.
**   v1    0.3 Stop
**** v1    0.3 CLI TX|stop
***  v1    0.3 CLI RX  300
**** v1    0.3 CLI RX|Child in state stopped
**** v1    0.3 CLI TX|status
***  v1    0.3 CLI RX  200
**** v1    0.3 CLI RX|Child in state stopped
**** v1    0.3 STDOUT poll 0x10
**   v1    0.3 R 84907 Status: 0000 (u 0.065000 s 0.061000)
#    top  TEST ../../../bin/varnishtest/tests/v00031.vtc TIMED OUT (kill -9)
#    top  TEST ../../../bin/varnishtest/tests/v00031.vtc FAILED (60.001) signal=9

1 @ SunOS 5.11 i86pc 1.04 64_sun12.4 uplex

*    top   0.0 TEST ../../../bin/varnishtest/tests/v00031.vtc starting
[...]
*    top   0.0 TEST param vcc_err_unref
[...]
**** v1    0.2 CLI TX|param.set vcc_err_unref true
***  v1    0.2 CLI RX  200
**   v1    0.2 CLI 200 <param.set vcc_err_unref true>
**   top   0.2 === varnish v1 -errvcl {Unused backend c, defined:} {
**** v1    0.2 CLI TX|vcl.inline vcl3 << %XJEIFLH|)Xspa8P
**** v1    0.2 CLI TX|vcl 4.0;
**** v1    0.2 CLI TX|
**** v1    0.2 CLI TX|\tbackend b { .host = "127.0.0.1"; }
**** v1    0.2 CLI TX|\tbackend c { .host = "127.0.0.1"; }
**** v1    0.2 CLI TX|
**** v1    0.2 CLI TX|%XJEIFLH|)Xspa8P
***  v1    0.2 CLI RX  106
**** v1    0.2 CLI RX|Message from VCC-compiler:
**** v1    0.2 CLI RX|Security: Privilege proc_setid missing, will not change uid/gid
**** v1    0.2 CLI RX|Unused backend c, defined:
**** v1    0.2 CLI RX|('<vcl.inline>' Line 4 Pos 17)
**** v1    0.2 CLI RX|        backend c { .host = "127.0.0.1"; }
**** v1    0.2 CLI RX|----------------#-------------------------
**** v1    0.2 CLI RX|
**** v1    0.2 CLI RX|Running VCC-compiler failed, exited with 2
**** v1    0.2 CLI RX|VCL compilation failed
**   v1    0.2 VCL compilation failed (as expected)
***  v1    0.2 Found expected string: ("Unused backend c, defined:")
*    top   0.2 RESETTING after ../../../bin/varnishtest/tests/v00031.vtc
**   v1    0.2 Wait
**** v1    0.2 CLI TX|backend.list
***  v1    0.2 CLI RX  101
**** v1    0.2 CLI RX|Unknown request in manager process (child not running).
**** v1    0.2 CLI RX|Type 'help' for more info.
**   v1    0.2 Stop
**** v1    0.2 CLI TX|stop
***  v1    0.2 CLI RX  300
**** v1    0.2 CLI RX|Child in state stopped
**** v1    0.2 CLI TX|status
***  v1    0.2 CLI RX  200
**** v1    0.2 CLI RX|Child in state stopped
**** v1    0.2 STDOUT poll 0x10
**   v1    0.2 R 11490 Status: 0000 (u 0.061000 s 0.092000)
#    top  TEST ../../../bin/varnishtest/tests/v00031.vtc TIMED OUT (kill -9)
#    top  TEST ../../../bin/varnishtest/tests/v00031.vtc FAILED (60.004) signal=9

1 @ SunOS 5.11 i86pc 1.04 32_sun12.4 uplex

*    top   0.0 TEST ../../../bin/varnishtest/tests/v00031.vtc starting
[...]
*    top   0.0 TEST param vcc_err_unref
[...]
**** v1    0.2 CLI TX|param.set vcc_err_unref true
***  v1    0.2 CLI RX  200
**   v1    0.2 CLI 200 <param.set vcc_err_unref true>
**   top   0.2 === varnish v1 -errvcl {Unused backend c, defined:} {
**** v1    0.2 CLI TX|vcl.inline vcl3 << %XJEIFLH|)Xspa8P
**** v1    0.2 CLI TX|vcl 4.0;
**** v1    0.2 CLI TX|
**** v1    0.2 CLI TX|\tbackend b { .host = "127.0.0.1"; }
**** v1    0.2 CLI TX|\tbackend c { .host = "127.0.0.1"; }
**** v1    0.2 CLI TX|
**** v1    0.2 CLI TX|%XJEIFLH|)Xspa8P
***  v1    0.2 CLI RX  106
**** v1    0.2 CLI RX|Message from VCC-compiler:
**** v1    0.2 CLI RX|Security: Privilege proc_setid missing, will not change uid/gid
**** v1    0.2 CLI RX|Unused backend c, defined:
**** v1    0.2 CLI RX|('<vcl.inline>' Line 4 Pos 17)
**** v1    0.2 CLI RX|        backend c { .host = "127.0.0.1"; }
**** v1    0.2 CLI RX|----------------#-------------------------
**** v1    0.2 CLI RX|
**** v1    0.2 CLI RX|Running VCC-compiler failed, exited with 2
**** v1    0.2 CLI RX|VCL compilation failed
**   v1    0.2 VCL compilation failed (as expected)
***  v1    0.2 Found expected string: ("Unused backend c, defined:")
*    top   0.2 RESETTING after ../../../bin/varnishtest/tests/v00031.vtc
**   v1    0.2 Wait
**** v1    0.2 CLI TX|backend.list
***  v1    0.2 CLI RX  101
**** v1    0.2 CLI RX|Unknown request in manager process (child not running).
**** v1    0.2 CLI RX|Type 'help' for more info.
**   v1    0.2 Stop
**** v1    0.2 CLI TX|stop
***  v1    0.2 CLI RX  300
**** v1    0.2 CLI RX|Child in state stopped
**** v1    0.2 CLI TX|status
***  v1    0.2 CLI RX  200
**** v1    0.2 CLI RX|Child in state stopped
**** v1    0.2 STDOUT poll 0x10
**   v1    0.2 R 45870 Status: 0000 (u 0.063000 s 0.087000)
#    top  TEST ../../../bin/varnishtest/tests/v00031.vtc TIMED OUT (kill -9)
#    top  TEST ../../../bin/varnishtest/tests/v00031.vtc FAILED (60.002) signal=9

1 @ SunOS 5.11 i86pc 1.04 64_sun12.4 uplex

*    top   0.0 TEST ../../../bin/varnishtest/tests/v00031.vtc starting
[...]
*    top   0.0 TEST param vcc_err_unref
[...]
**** v1    0.2 CLI TX|param.set vcc_err_unref true
***  v1    0.2 CLI RX  200
**   v1    0.2 CLI 200 <param.set vcc_err_unref true>
**   top   0.2 === varnish v1 -errvcl {Unused backend c, defined:} {
**** v1    0.2 CLI TX|vcl.inline vcl3 << %XJEIFLH|)Xspa8P
**** v1    0.2 CLI TX|vcl 4.0;
**** v1    0.2 CLI TX|
**** v1    0.2 CLI TX|\tbackend b { .host = "127.0.0.1"; }
**** v1    0.2 CLI TX|\tbackend c { .host = "127.0.0.1"; }
**** v1    0.2 CLI TX|
**** v1    0.2 CLI TX|%XJEIFLH|)Xspa8P
***  v1    0.3 CLI RX  106
**** v1    0.3 CLI RX|Message from VCC-compiler:
**** v1    0.3 CLI RX|Security: Privilege proc_setid missing, will not change uid/gid
**** v1    0.3 CLI RX|Unused backend c, defined:
**** v1    0.3 CLI RX|('<vcl.inline>' Line 4 Pos 17)
**** v1    0.3 CLI RX|        backend c { .host = "127.0.0.1"; }
**** v1    0.3 CLI RX|----------------#-------------------------
**** v1    0.3 CLI RX|
**** v1    0.3 CLI RX|Running VCC-compiler failed, exited with 2
**** v1    0.3 CLI RX|VCL compilation failed
**   v1    0.3 VCL compilation failed (as expected)
***  v1    0.3 Found expected string: ("Unused backend c, defined:")
*    top   0.3 RESETTING after ../../../bin/varnishtest/tests/v00031.vtc
**   v1    0.3 Wait
**** v1    0.3 CLI TX|backend.list
***  v1    0.3 CLI RX  101
**** v1    0.3 CLI RX|Unknown request in manager process (child not running).
**** v1    0.3 CLI RX|Type 'help' for more info.
**   v1    0.3 Stop
**** v1    0.3 CLI TX|stop
***  v1    0.3 CLI RX  300
**** v1    0.3 CLI RX|Child in state stopped
**** v1    0.3 CLI TX|status
***  v1    0.3 CLI RX  200
**** v1    0.3 CLI RX|Child in state stopped
**** v1    0.3 STDOUT poll 0x10
**   v1    0.3 R 32038 Status: 0000 (u 0.070000 s 0.106000)
#    top  TEST ../../../bin/varnishtest/tests/v00031.vtc TIMED OUT (kill -9)
#    top  TEST ../../../bin/varnishtest/tests/v00031.vtc FAILED (60.005) signal=9

1 @ SunOS 5.11 i86pc 1.04 32_sun12.4 uplex

*    top   0.0 TEST ../../../bin/varnishtest/tests/v00031.vtc starting
[...]
*    top   0.0 TEST param vcc_err_unref
[...]
**** v1    0.2 CLI TX|param.set vcc_err_unref true
***  v1    0.2 CLI RX  200
**   v1    0.2 CLI 200 <param.set vcc_err_unref true>
**   top   0.2 === varnish v1 -errvcl {Unused backend c, defined:} {
**** v1    0.2 CLI TX|vcl.inline vcl3 << %XJEIFLH|)Xspa8P
**** v1    0.2 CLI TX|vcl 4.0;
**** v1    0.2 CLI TX|
**** v1    0.2 CLI TX|\tbackend b { .host = "127.0.0.1"; }
**** v1    0.2 CLI TX|\tbackend c { .host = "127.0.0.1"; }
**** v1    0.2 CLI TX|
**** v1    0.2 CLI TX|%XJEIFLH|)Xspa8P
***  v1    0.2 CLI RX  106
**** v1    0.2 CLI RX|Message from VCC-compiler:
**** v1    0.2 CLI RX|Security: Privilege proc_setid missing, will not change uid/gid
**** v1    0.2 CLI RX|Unused backend c, defined:
**** v1    0.2 CLI RX|('<vcl.inline>' Line 4 Pos 17)
**** v1    0.2 CLI RX|        backend c { .host = "127.0.0.1"; }
**** v1    0.2 CLI RX|----------------#-------------------------
**** v1    0.2 CLI RX|
**** v1    0.2 CLI RX|Running VCC-compiler failed, exited with 2
**** v1    0.2 CLI RX|VCL compilation failed
**   v1    0.2 VCL compilation failed (as expected)
***  v1    0.2 Found expected string: ("Unused backend c, defined:")
*    top   0.2 RESETTING after ../../../bin/varnishtest/tests/v00031.vtc
**   v1    0.2 Wait
**** v1    0.2 CLI TX|backend.list
***  v1    0.2 CLI RX  101
**** v1    0.2 CLI RX|Unknown request in manager process (child not running).
**** v1    0.2 CLI RX|Type 'help' for more info.
**   v1    0.2 Stop
**** v1    0.2 CLI TX|stop
***  v1    0.2 CLI RX  300
**** v1    0.2 CLI RX|Child in state stopped
**** v1    0.2 CLI TX|status
***  v1    0.2 CLI RX  200
**** v1    0.2 CLI RX|Child in state stopped
**** v1    0.2 STDOUT poll 0x10
**   v1    0.2 R 72723 Status: 0000 (u 0.057000 s 0.077000)
#    top  TEST ../../../bin/varnishtest/tests/v00031.vtc TIMED OUT (kill -9)
#    top  TEST ../../../bin/varnishtest/tests/v00031.vtc FAILED (60.002) signal=9

1 @ SunOS 5.11 i86pc 1.04 64_sun12.4 uplex

*    top   0.0 TEST ../../../bin/varnishtest/tests/v00031.vtc starting
[...]
*    top   0.0 TEST param vcc_err_unref
[...]
**** v1    0.2 CLI TX|param.set vcc_err_unref true
***  v1    0.2 CLI RX  200
**   v1    0.2 CLI 200 <param.set vcc_err_unref true>
**   top   0.2 === varnish v1 -errvcl {Unused backend c, defined:} {
**** v1    0.2 CLI TX|vcl.inline vcl3 << %XJEIFLH|)Xspa8P
**** v1    0.2 CLI TX|vcl 4.0;
**** v1    0.2 CLI TX|
**** v1    0.2 CLI TX|\tbackend b { .host = "127.0.0.1"; }
**** v1    0.2 CLI TX|\tbackend c { .host = "127.0.0.1"; }
**** v1    0.2 CLI TX|
**** v1    0.2 CLI TX|%XJEIFLH|)Xspa8P
***  v1    0.2 CLI RX  106
**** v1    0.2 CLI RX|Message from VCC-compiler:
**** v1    0.2 CLI RX|Security: Privilege proc_setid missing, will not change uid/gid
**** v1    0.2 CLI RX|Unused backend c, defined:
**** v1    0.2 CLI RX|('<vcl.inline>' Line 4 Pos 17)
**** v1    0.2 CLI RX|        backend c { .host = "127.0.0.1"; }
**** v1    0.2 CLI RX|----------------#-------------------------
**** v1    0.2 CLI RX|
**** v1    0.2 CLI RX|Running VCC-compiler failed, exited with 2
**** v1    0.2 CLI RX|VCL compilation failed
**   v1    0.2 VCL compilation failed (as expected)
***  v1    0.2 Found expected string: ("Unused backend c, defined:")
*    top   0.2 RESETTING after ../../../bin/varnishtest/tests/v00031.vtc
**   v1    0.2 Wait
**** v1    0.2 CLI TX|backend.list
***  v1    0.2 CLI RX  101
**** v1    0.2 CLI RX|Unknown request in manager process (child not running).
**** v1    0.2 CLI RX|Type 'help' for more info.
**   v1    0.2 Stop
**** v1    0.2 CLI TX|stop
***  v1    0.2 CLI RX  300
**** v1    0.2 CLI RX|Child in state stopped
**** v1    0.2 CLI TX|status
***  v1    0.2 CLI RX  200
**** v1    0.2 CLI RX|Child in state stopped
**** v1    0.2 STDOUT poll 0x10
**   v1    0.2 R 67086 Status: 0000 (u 0.060000 s 0.087000)
#    top  TEST ../../../bin/varnishtest/tests/v00031.vtc TIMED OUT (kill -9)
#    top  TEST ../../../bin/varnishtest/tests/v00031.vtc FAILED (60.003) signal=9

1 @ SunOS 5.11 i86pc 1.04 64_sun12.4 uplex

*    top   0.0 TEST ../../../bin/varnishtest/tests/v00031.vtc starting
[...]
*    top   0.0 TEST param vcc_err_unref
[...]
**** v1    0.2 CLI TX|param.set vcc_err_unref true
***  v1    0.2 CLI RX  200
**   v1    0.2 CLI 200 <param.set vcc_err_unref true>
**   top   0.2 === varnish v1 -errvcl {Unused backend c, defined:} {
**** v1    0.2 CLI TX|vcl.inline vcl3 << %XJEIFLH|)Xspa8P
**** v1    0.2 CLI TX|vcl 4.0;
**** v1    0.2 CLI TX|
**** v1    0.2 CLI TX|\tbackend b { .host = "127.0.0.1"; }
**** v1    0.2 CLI TX|\tbackend c { .host = "127.0.0.1"; }
**** v1    0.2 CLI TX|
**** v1    0.2 CLI TX|%XJEIFLH|)Xspa8P
***  v1    0.2 CLI RX  106
**** v1    0.2 CLI RX|Message from VCC-compiler:
**** v1    0.2 CLI RX|Security: Privilege proc_setid missing, will not change uid/gid
**** v1    0.2 CLI RX|Unused backend c, defined:
**** v1    0.2 CLI RX|('<vcl.inline>' Line 4 Pos 17)
**** v1    0.2 CLI RX|        backend c { .host = "127.0.0.1"; }
**** v1    0.2 CLI RX|----------------#-------------------------
**** v1    0.2 CLI RX|
**** v1    0.2 CLI RX|Running VCC-compiler failed, exited with 2
**** v1    0.2 CLI RX|VCL compilation failed
**   v1    0.2 VCL compilation failed (as expected)
***  v1    0.2 Found expected string: ("Unused backend c, defined:")
*    top   0.2 RESETTING after ../../../bin/varnishtest/tests/v00031.vtc
**   v1    0.2 Wait
**** v1    0.2 CLI TX|backend.list
***  v1    0.2 CLI RX  101
**** v1    0.2 CLI RX|Unknown request in manager process (child not running).
**** v1    0.2 CLI RX|Type 'help' for more info.
**   v1    0.2 Stop
**** v1    0.2 CLI TX|stop
***  v1    0.2 CLI RX  300
**** v1    0.2 CLI RX|Child in state stopped
**** v1    0.2 CLI TX|status
***  v1    0.2 CLI RX  200
**** v1    0.2 CLI RX|Child in state stopped
**** v1    0.2 STDOUT poll 0x10
**   v1    0.2 R 29470 Status: 0000 (u 0.062000 s 0.088000)
#    top  TEST ../../../bin/varnishtest/tests/v00031.vtc TIMED OUT (kill -9)
#    top  TEST ../../../bin/varnishtest/tests/v00031.vtc FAILED (60.003) signal=9

1 @ SunOS 5.11 i86pc 1.04 32_sun12.4 uplex

*    top   0.0 TEST ../../../bin/varnishtest/tests/v00031.vtc starting
[...]
*    top   0.0 TEST param vcc_err_unref
[...]
**** v1    0.2 CLI TX|param.set vcc_err_unref true
***  v1    0.2 CLI RX  200
**   v1    0.2 CLI 200 <param.set vcc_err_unref true>
**   top   0.2 === varnish v1 -errvcl {Unused backend c, defined:} {
**** v1    0.2 CLI TX|vcl.inline vcl3 << %XJEIFLH|)Xspa8P
**** v1    0.2 CLI TX|vcl 4.0;
**** v1    0.2 CLI TX|
**** v1    0.2 CLI TX|\tbackend b { .host = "127.0.0.1"; }
**** v1    0.2 CLI TX|\tbackend c { .host = "127.0.0.1"; }
**** v1    0.2 CLI TX|
**** v1    0.2 CLI TX|%XJEIFLH|)Xspa8P
***  v1    0.2 CLI RX  106
**** v1    0.2 CLI RX|Message from VCC-compiler:
**** v1    0.2 CLI RX|Security: Privilege proc_setid missing, will not change uid/gid
**** v1    0.2 CLI RX|Unused backend c, defined:
**** v1    0.2 CLI RX|('<vcl.inline>' Line 4 Pos 17)
**** v1    0.2 CLI RX|        backend c { .host = "127.0.0.1"; }
**** v1    0.2 CLI RX|----------------#-------------------------
**** v1    0.2 CLI RX|
**** v1    0.2 CLI RX|Running VCC-compiler failed, exited with 2
**** v1    0.2 CLI RX|VCL compilation failed
**   v1    0.2 VCL compilation failed (as expected)
***  v1    0.2 Found expected string: ("Unused backend c, defined:")
*    top   0.2 RESETTING after ../../../bin/varnishtest/tests/v00031.vtc
**   v1    0.2 Wait
**** v1    0.2 CLI TX|backend.list
***  v1    0.2 CLI RX  101
**** v1    0.2 CLI RX|Unknown request in manager process (child not running).
**** v1    0.2 CLI RX|Type 'help' for more info.
**   v1    0.2 Stop
**** v1    0.2 CLI TX|stop
***  v1    0.2 CLI RX  300
**** v1    0.2 CLI RX|Child in state stopped
**** v1    0.2 CLI TX|status
***  v1    0.2 CLI RX  200
**** v1    0.2 CLI RX|Child in state stopped
**** v1    0.2 STDOUT poll 0x10
**   v1    0.2 R 82003 Status: 0000 (u 0.058000 s 0.077000)
#    top  TEST ../../../bin/varnishtest/tests/v00031.vtc TIMED OUT (kill -9)
#    top  TEST ../../../bin/varnishtest/tests/v00031.vtc FAILED (60.002) signal=9