v00038

8bbbdfa

1 @ SunOS 5.11 i86pc 1.04 32_sun12.4 uplex

*    top   0.0 TEST ../../../bin/varnishtest/tests/v00038.vtc starting
[...]
*    top   0.0 TEST VCL compiler coverage test: vcc_backend.c
[...]
**** v1    0.2 CLI RX|
**** v1    0.2 CLI RX|Running VCC-compiler failed, exited with 2
**** v1    0.2 CLI RX|VCL compilation failed
**   v1    0.2 VCL compilation failed (as expected)
***  v1    0.2 Found expected string: ("Unknown field:")
**   top   0.2 === varnish v1 -errvcl "Mandatory field 'host' missing." {
**** v1    0.2 CLI TX|vcl.inline vcl12 << %XJEIFLH|)Xspa8P
**** v1    0.2 CLI TX|vcl 4.0;
**** v1    0.2 CLI TX|
**** v1    0.2 CLI TX|\tbackend b1 {
**** v1    0.2 CLI TX|\t\t.port = "NONE";
**** v1    0.2 CLI TX|\t}
**** v1    0.2 CLI TX|
**** v1    0.2 CLI TX|%XJEIFLH|)Xspa8P
***  v1    0.2 CLI RX  106
**** v1    0.2 CLI RX|Message from VCC-compiler:
**** v1    0.2 CLI RX|Security: Privilege proc_setid missing, will not change uid/gid
**** v1    0.2 CLI RX|Mandatory field 'host' missing.
**** v1    0.2 CLI RX|Running VCC-compiler failed, exited with 2
**** v1    0.2 CLI RX|VCL compilation failed
**   v1    0.2 VCL compilation failed (as expected)
***  v1    0.2 Found expected string: ("Mandatory field 'host' missing.")
*    top   0.2 RESETTING after ../../../bin/varnishtest/tests/v00038.vtc
**   v1    0.2 Wait
**** v1    0.2 CLI TX|backend.list
***  v1    0.2 CLI RX  101
**** v1    0.2 CLI RX|Unknown request in manager process (child not running).
**** v1    0.2 CLI RX|Type 'help' for more info.
**   v1    0.2 Stop
**** v1    0.2 CLI TX|stop
***  v1    0.2 CLI RX  300
**** v1    0.2 CLI RX|Child in state stopped
**** v1    0.2 CLI TX|status
***  v1    0.2 CLI RX  200
**** v1    0.2 CLI RX|Child in state stopped
**** v1    0.2 STDOUT poll 0x10
**   v1    0.2 R 83967 Status: 0000 (u 0.005000 s 0.032000)
*    diag  0.0 ............................................................
#    top  TEST ../../../bin/varnishtest/tests/v00038.vtc TIMED OUT (kill -9)
#    top  TEST ../../../bin/varnishtest/tests/v00038.vtc FAILED (60.002) signal=9

1 @ SunOS 5.11 i86pc 1.04 32_sun12.4 uplex

*    top   0.0 TEST ../../../bin/varnishtest/tests/v00038.vtc starting
[...]
*    top   0.0 TEST VCL compiler coverage test: vcc_backend.c
[...]
**** v1    0.2 CLI RX|
**** v1    0.2 CLI RX|Running VCC-compiler failed, exited with 2
**** v1    0.2 CLI RX|VCL compilation failed
**   v1    0.2 VCL compilation failed (as expected)
***  v1    0.2 Found expected string: ("Unknown field:")
**   top   0.2 === varnish v1 -errvcl "Mandatory field 'host' missing." {
**** v1    0.2 CLI TX|vcl.inline vcl12 << %XJEIFLH|)Xspa8P
**** v1    0.2 CLI TX|vcl 4.0;
**** v1    0.2 CLI TX|
**** v1    0.2 CLI TX|\tbackend b1 {
**** v1    0.2 CLI TX|\t\t.port = "NONE";
**** v1    0.2 CLI TX|\t}
**** v1    0.2 CLI TX|
**** v1    0.2 CLI TX|%XJEIFLH|)Xspa8P
***  v1    0.2 CLI RX  106
**** v1    0.2 CLI RX|Message from VCC-compiler:
**** v1    0.2 CLI RX|Security: Privilege proc_setid missing, will not change uid/gid
**** v1    0.2 CLI RX|Mandatory field 'host' missing.
**** v1    0.2 CLI RX|Running VCC-compiler failed, exited with 2
**** v1    0.2 CLI RX|VCL compilation failed
**   v1    0.2 VCL compilation failed (as expected)
***  v1    0.2 Found expected string: ("Mandatory field 'host' missing.")
*    top   0.2 RESETTING after ../../../bin/varnishtest/tests/v00038.vtc
**   v1    0.2 Wait
**** v1    0.2 CLI TX|backend.list
***  v1    0.2 CLI RX  101
**** v1    0.2 CLI RX|Unknown request in manager process (child not running).
**** v1    0.2 CLI RX|Type 'help' for more info.
**   v1    0.2 Stop
**** v1    0.2 CLI TX|stop
***  v1    0.2 CLI RX  300
**** v1    0.2 CLI RX|Child in state stopped
**** v1    0.2 CLI TX|status
***  v1    0.2 CLI RX  200
**** v1    0.2 CLI RX|Child in state stopped
**** v1    0.2 STDOUT poll 0x10
**   v1    0.2 R 65825 Status: 0000 (u 0.005000 s 0.032000)
*    diag  0.0 ............................................................
#    top  TEST ../../../bin/varnishtest/tests/v00038.vtc TIMED OUT (kill -9)
#    top  TEST ../../../bin/varnishtest/tests/v00038.vtc FAILED (60.002) signal=9

1 @ SunOS 5.11 i86pc 1.04 32_gcc4.7 uplex

*    top   0.0 TEST ../../../bin/varnishtest/tests/v00038.vtc starting
[...]
*    top   0.0 TEST VCL compiler coverage test: vcc_backend.c
[...]
**** v1    0.2 CLI RX|
**** v1    0.2 CLI RX|Running VCC-compiler failed, exited with 2
**** v1    0.2 CLI RX|VCL compilation failed
**   v1    0.2 VCL compilation failed (as expected)
***  v1    0.2 Found expected string: ("Unknown field:")
**   top   0.2 === varnish v1 -errvcl "Mandatory field 'host' missing." {
**** v1    0.2 CLI TX|vcl.inline vcl12 << %XJEIFLH|)Xspa8P
**** v1    0.2 CLI TX|vcl 4.0;
**** v1    0.2 CLI TX|
**** v1    0.2 CLI TX|\tbackend b1 {
**** v1    0.2 CLI TX|\t\t.port = "NONE";
**** v1    0.2 CLI TX|\t}
**** v1    0.2 CLI TX|
**** v1    0.2 CLI TX|%XJEIFLH|)Xspa8P
***  v1    0.2 CLI RX  106
**** v1    0.2 CLI RX|Message from VCC-compiler:
**** v1    0.2 CLI RX|Security: Privilege proc_setid missing, will not change uid/gid
**** v1    0.2 CLI RX|Mandatory field 'host' missing.
**** v1    0.2 CLI RX|Running VCC-compiler failed, exited with 2
**** v1    0.2 CLI RX|VCL compilation failed
**   v1    0.2 VCL compilation failed (as expected)
***  v1    0.2 Found expected string: ("Mandatory field 'host' missing.")
*    top   0.2 RESETTING after ../../../bin/varnishtest/tests/v00038.vtc
**   v1    0.2 Wait
**** v1    0.2 CLI TX|backend.list
***  v1    0.2 CLI RX  101
**** v1    0.2 CLI RX|Unknown request in manager process (child not running).
**** v1    0.2 CLI RX|Type 'help' for more info.
**   v1    0.2 Stop
**** v1    0.2 CLI TX|stop
***  v1    0.2 CLI RX  300
**** v1    0.2 CLI RX|Child in state stopped
**** v1    0.2 CLI TX|status
***  v1    0.2 CLI RX  200
**** v1    0.2 CLI RX|Child in state stopped
**** v1    0.2 STDOUT poll 0x10
**   v1    0.2 R 7209 Status: 0000 (u 0.005000 s 0.032000)
*    diag  0.0 ............................................................
#    top  TEST ../../../bin/varnishtest/tests/v00038.vtc TIMED OUT (kill -9)
#    top  TEST ../../../bin/varnishtest/tests/v00038.vtc FAILED (60.002) signal=9

1 @ SunOS 5.11 i86pc 1.04 64_sun12.4 uplex

*    top   0.0 TEST ../../../bin/varnishtest/tests/v00038.vtc starting
[...]
*    top   0.0 TEST VCL compiler coverage test: vcc_backend.c
[...]
**** v1    0.2 CLI RX|
**** v1    0.2 CLI RX|Running VCC-compiler failed, exited with 2
**** v1    0.2 CLI RX|VCL compilation failed
**   v1    0.2 VCL compilation failed (as expected)
***  v1    0.2 Found expected string: ("Unknown field:")
**   top   0.2 === varnish v1 -errvcl "Mandatory field 'host' missing." {
**** v1    0.2 CLI TX|vcl.inline vcl12 << %XJEIFLH|)Xspa8P
**** v1    0.2 CLI TX|vcl 4.0;
**** v1    0.2 CLI TX|
**** v1    0.2 CLI TX|\tbackend b1 {
**** v1    0.2 CLI TX|\t\t.port = "NONE";
**** v1    0.2 CLI TX|\t}
**** v1    0.2 CLI TX|
**** v1    0.2 CLI TX|%XJEIFLH|)Xspa8P
***  v1    0.2 CLI RX  106
**** v1    0.2 CLI RX|Message from VCC-compiler:
**** v1    0.2 CLI RX|Security: Privilege proc_setid missing, will not change uid/gid
**** v1    0.2 CLI RX|Mandatory field 'host' missing.
**** v1    0.2 CLI RX|Running VCC-compiler failed, exited with 2
**** v1    0.2 CLI RX|VCL compilation failed
**   v1    0.2 VCL compilation failed (as expected)
***  v1    0.2 Found expected string: ("Mandatory field 'host' missing.")
*    top   0.2 RESETTING after ../../../bin/varnishtest/tests/v00038.vtc
**   v1    0.2 Wait
**** v1    0.2 CLI TX|backend.list
***  v1    0.2 CLI RX  101
**** v1    0.2 CLI RX|Unknown request in manager process (child not running).
**** v1    0.2 CLI RX|Type 'help' for more info.
**   v1    0.2 Stop
**** v1    0.2 CLI TX|stop
***  v1    0.2 CLI RX  300
**** v1    0.2 CLI RX|Child in state stopped
**** v1    0.2 CLI TX|status
***  v1    0.2 CLI RX  200
**** v1    0.2 CLI RX|Child in state stopped
**** v1    0.2 STDOUT poll 0x10
**   v1    0.2 R 59647 Status: 0000 (u 0.023000 s 0.071000)
*    diag  0.0 ............................................................
#    top  TEST ../../../bin/varnishtest/tests/v00038.vtc TIMED OUT (kill -9)
#    top  TEST ../../../bin/varnishtest/tests/v00038.vtc FAILED (60.005) signal=9

1 @ SunOS 5.11 i86pc 1.04 64_gcc4.7 uplex

*    top   0.0 TEST ../../../bin/varnishtest/tests/v00038.vtc starting
[...]
*    top   0.0 TEST VCL compiler coverage test: vcc_backend.c
[...]
**** v1    0.2 CLI RX|
**** v1    0.2 CLI RX|Running VCC-compiler failed, exited with 2
**** v1    0.2 CLI RX|VCL compilation failed
**   v1    0.2 VCL compilation failed (as expected)
***  v1    0.2 Found expected string: ("Unknown field:")
**   top   0.2 === varnish v1 -errvcl "Mandatory field 'host' missing." {
**** v1    0.2 CLI TX|vcl.inline vcl12 << %XJEIFLH|)Xspa8P
**** v1    0.2 CLI TX|vcl 4.0;
**** v1    0.2 CLI TX|
**** v1    0.2 CLI TX|\tbackend b1 {
**** v1    0.2 CLI TX|\t\t.port = "NONE";
**** v1    0.2 CLI TX|\t}
**** v1    0.2 CLI TX|
**** v1    0.2 CLI TX|%XJEIFLH|)Xspa8P
***  v1    0.2 CLI RX  106
**** v1    0.2 CLI RX|Message from VCC-compiler:
**** v1    0.2 CLI RX|Security: Privilege proc_setid missing, will not change uid/gid
**** v1    0.2 CLI RX|Mandatory field 'host' missing.
**** v1    0.2 CLI RX|Running VCC-compiler failed, exited with 2
**** v1    0.2 CLI RX|VCL compilation failed
**   v1    0.2 VCL compilation failed (as expected)
***  v1    0.2 Found expected string: ("Mandatory field 'host' missing.")
*    top   0.2 RESETTING after ../../../bin/varnishtest/tests/v00038.vtc
**   v1    0.2 Wait
**** v1    0.2 CLI TX|backend.list
***  v1    0.2 CLI RX  101
**** v1    0.2 CLI RX|Unknown request in manager process (child not running).
**** v1    0.2 CLI RX|Type 'help' for more info.
**   v1    0.2 Stop
**** v1    0.2 CLI TX|stop
***  v1    0.2 CLI RX  300
**** v1    0.2 CLI RX|Child in state stopped
**** v1    0.2 CLI TX|status
***  v1    0.2 CLI RX  200
**** v1    0.2 CLI RX|Child in state stopped
**** v1    0.2 STDOUT poll 0x10
**   v1    0.2 R 11982 Status: 0000 (u 0.016000 s 0.060000)
*    diag  0.0 ............................................................
#    top  TEST ../../../bin/varnishtest/tests/v00038.vtc TIMED OUT (kill -9)
#    top  TEST ../../../bin/varnishtest/tests/v00038.vtc FAILED (60.003) signal=9

1 @ SunOS 5.11 i86pc 1.04 64_gcc4.7 uplex

*    top   0.0 TEST ../../../bin/varnishtest/tests/v00038.vtc starting
[...]
*    top   0.0 TEST VCL compiler coverage test: vcc_backend.c
[...]
**** v1    0.2 CLI RX|
**** v1    0.2 CLI RX|Running VCC-compiler failed, exited with 2
**** v1    0.2 CLI RX|VCL compilation failed
**   v1    0.2 VCL compilation failed (as expected)
***  v1    0.2 Found expected string: ("Unknown field:")
**   top   0.2 === varnish v1 -errvcl "Mandatory field 'host' missing." {
**** v1    0.2 CLI TX|vcl.inline vcl12 << %XJEIFLH|)Xspa8P
**** v1    0.2 CLI TX|vcl 4.0;
**** v1    0.2 CLI TX|
**** v1    0.2 CLI TX|\tbackend b1 {
**** v1    0.2 CLI TX|\t\t.port = "NONE";
**** v1    0.2 CLI TX|\t}
**** v1    0.2 CLI TX|
**** v1    0.2 CLI TX|%XJEIFLH|)Xspa8P
***  v1    0.2 CLI RX  106
**** v1    0.2 CLI RX|Message from VCC-compiler:
**** v1    0.2 CLI RX|Security: Privilege proc_setid missing, will not change uid/gid
**** v1    0.2 CLI RX|Mandatory field 'host' missing.
**** v1    0.2 CLI RX|Running VCC-compiler failed, exited with 2
**** v1    0.2 CLI RX|VCL compilation failed
**   v1    0.2 VCL compilation failed (as expected)
***  v1    0.2 Found expected string: ("Mandatory field 'host' missing.")
*    top   0.2 RESETTING after ../../../bin/varnishtest/tests/v00038.vtc
**   v1    0.2 Wait
**** v1    0.2 CLI TX|backend.list
***  v1    0.2 CLI RX  101
**** v1    0.2 CLI RX|Unknown request in manager process (child not running).
**** v1    0.2 CLI RX|Type 'help' for more info.
**   v1    0.2 Stop
**** v1    0.2 CLI TX|stop
***  v1    0.2 CLI RX  300
**** v1    0.2 CLI RX|Child in state stopped
**** v1    0.2 CLI TX|status
***  v1    0.2 CLI RX  200
**** v1    0.2 CLI RX|Child in state stopped
**** v1    0.2 STDOUT poll 0x10
**   v1    0.2 R 97000 Status: 0000 (u 0.017000 s 0.058000)
*    diag  0.0 ............................................................
#    top  TEST ../../../bin/varnishtest/tests/v00038.vtc TIMED OUT (kill -9)
#    top  TEST ../../../bin/varnishtest/tests/v00038.vtc FAILED (60.004) signal=9

1 @ SunOS 5.11 i86pc 1.04 32_gcc4.7 uplex

*    top   0.0 TEST ../../../bin/varnishtest/tests/v00038.vtc starting
[...]
*    top   0.0 TEST VCL compiler coverage test: vcc_backend.c
[...]
**** v1    0.2 CLI RX|
**** v1    0.2 CLI RX|Running VCC-compiler failed, exited with 2
**** v1    0.2 CLI RX|VCL compilation failed
**   v1    0.2 VCL compilation failed (as expected)
***  v1    0.2 Found expected string: ("Unknown field:")
**   top   0.2 === varnish v1 -errvcl "Mandatory field 'host' missing." {
**** v1    0.2 CLI TX|vcl.inline vcl12 << %XJEIFLH|)Xspa8P
**** v1    0.2 CLI TX|vcl 4.0;
**** v1    0.2 CLI TX|
**** v1    0.2 CLI TX|\tbackend b1 {
**** v1    0.2 CLI TX|\t\t.port = "NONE";
**** v1    0.2 CLI TX|\t}
**** v1    0.2 CLI TX|
**** v1    0.2 CLI TX|%XJEIFLH|)Xspa8P
***  v1    0.2 CLI RX  106
**** v1    0.2 CLI RX|Message from VCC-compiler:
**** v1    0.2 CLI RX|Security: Privilege proc_setid missing, will not change uid/gid
**** v1    0.2 CLI RX|Mandatory field 'host' missing.
**** v1    0.2 CLI RX|Running VCC-compiler failed, exited with 2
**** v1    0.2 CLI RX|VCL compilation failed
**   v1    0.2 VCL compilation failed (as expected)
***  v1    0.2 Found expected string: ("Mandatory field 'host' missing.")
*    top   0.2 RESETTING after ../../../bin/varnishtest/tests/v00038.vtc
**   v1    0.2 Wait
**** v1    0.2 CLI TX|backend.list
***  v1    0.2 CLI RX  101
**** v1    0.2 CLI RX|Unknown request in manager process (child not running).
**** v1    0.2 CLI RX|Type 'help' for more info.
**   v1    0.2 Stop
**** v1    0.2 CLI TX|stop
***  v1    0.2 CLI RX  300
**** v1    0.2 CLI RX|Child in state stopped
**** v1    0.2 CLI TX|status
***  v1    0.2 CLI RX  200
**** v1    0.2 CLI RX|Child in state stopped
**** v1    0.2 STDOUT poll 0x10
**   v1    0.2 R 4350 Status: 0000 (u 0.005000 s 0.032000)
*    diag  0.0 ............................................................
#    top  TEST ../../../bin/varnishtest/tests/v00038.vtc TIMED OUT (kill -9)
#    top  TEST ../../../bin/varnishtest/tests/v00038.vtc FAILED (60.002) signal=9

1 @ SunOS 5.11 i86pc 1.04 32_sun12.4 uplex

*    top   0.0 TEST ../../../bin/varnishtest/tests/v00038.vtc starting
[...]
*    top   0.0 TEST VCL compiler coverage test: vcc_backend.c
[...]
**** v1    0.2 CLI RX|
**** v1    0.2 CLI RX|Running VCC-compiler failed, exited with 2
**** v1    0.2 CLI RX|VCL compilation failed
**   v1    0.2 VCL compilation failed (as expected)
***  v1    0.2 Found expected string: ("Unknown field:")
**   top   0.2 === varnish v1 -errvcl "Mandatory field 'host' missing." {
**** v1    0.2 CLI TX|vcl.inline vcl12 << %XJEIFLH|)Xspa8P
**** v1    0.2 CLI TX|vcl 4.0;
**** v1    0.2 CLI TX|
**** v1    0.2 CLI TX|\tbackend b1 {
**** v1    0.2 CLI TX|\t\t.port = "NONE";
**** v1    0.2 CLI TX|\t}
**** v1    0.2 CLI TX|
**** v1    0.2 CLI TX|%XJEIFLH|)Xspa8P
***  v1    0.2 CLI RX  106
**** v1    0.2 CLI RX|Message from VCC-compiler:
**** v1    0.2 CLI RX|Security: Privilege proc_setid missing, will not change uid/gid
**** v1    0.2 CLI RX|Mandatory field 'host' missing.
**** v1    0.2 CLI RX|Running VCC-compiler failed, exited with 2
**** v1    0.2 CLI RX|VCL compilation failed
**   v1    0.2 VCL compilation failed (as expected)
***  v1    0.2 Found expected string: ("Mandatory field 'host' missing.")
*    top   0.2 RESETTING after ../../../bin/varnishtest/tests/v00038.vtc
**   v1    0.2 Wait
**** v1    0.2 CLI TX|backend.list
***  v1    0.2 CLI RX  101
**** v1    0.2 CLI RX|Unknown request in manager process (child not running).
**** v1    0.2 CLI RX|Type 'help' for more info.
**   v1    0.2 Stop
**** v1    0.2 CLI TX|stop
***  v1    0.2 CLI RX  300
**** v1    0.2 CLI RX|Child in state stopped
**** v1    0.2 CLI TX|status
***  v1    0.2 CLI RX  200
**** v1    0.2 CLI RX|Child in state stopped
**** v1    0.2 STDOUT poll 0x10
**   v1    0.2 R 68171 Status: 0000 (u 0.006000 s 0.036000)
*    diag  0.0 ............................................................
#    top  TEST ../../../bin/varnishtest/tests/v00038.vtc TIMED OUT (kill -9)
#    top  TEST ../../../bin/varnishtest/tests/v00038.vtc FAILED (60.002) signal=9

1 @ SunOS 5.11 i86pc 1.04 32_sun12.4 uplex

*    top   0.0 TEST ../../../bin/varnishtest/tests/v00038.vtc starting
[...]
*    top   0.0 TEST VCL compiler coverage test: vcc_backend.c
[...]
**** v1    0.2 CLI RX|
**** v1    0.2 CLI RX|Running VCC-compiler failed, exited with 2
**** v1    0.2 CLI RX|VCL compilation failed
**   v1    0.2 VCL compilation failed (as expected)
***  v1    0.2 Found expected string: ("Unknown field:")
**   top   0.2 === varnish v1 -errvcl "Mandatory field 'host' missing." {
**** v1    0.2 CLI TX|vcl.inline vcl12 << %XJEIFLH|)Xspa8P
**** v1    0.2 CLI TX|vcl 4.0;
**** v1    0.2 CLI TX|
**** v1    0.2 CLI TX|\tbackend b1 {
**** v1    0.2 CLI TX|\t\t.port = "NONE";
**** v1    0.2 CLI TX|\t}
**** v1    0.2 CLI TX|
**** v1    0.2 CLI TX|%XJEIFLH|)Xspa8P
***  v1    0.2 CLI RX  106
**** v1    0.2 CLI RX|Message from VCC-compiler:
**** v1    0.2 CLI RX|Security: Privilege proc_setid missing, will not change uid/gid
**** v1    0.2 CLI RX|Mandatory field 'host' missing.
**** v1    0.2 CLI RX|Running VCC-compiler failed, exited with 2
**** v1    0.2 CLI RX|VCL compilation failed
**   v1    0.2 VCL compilation failed (as expected)
***  v1    0.2 Found expected string: ("Mandatory field 'host' missing.")
*    top   0.2 RESETTING after ../../../bin/varnishtest/tests/v00038.vtc
**   v1    0.2 Wait
**** v1    0.2 CLI TX|backend.list
***  v1    0.2 CLI RX  101
**** v1    0.2 CLI RX|Unknown request in manager process (child not running).
**** v1    0.2 CLI RX|Type 'help' for more info.
**   v1    0.2 Stop
**** v1    0.2 CLI TX|stop
***  v1    0.2 CLI RX  300
**** v1    0.2 CLI RX|Child in state stopped
**** v1    0.2 CLI TX|status
***  v1    0.2 CLI RX  200
**** v1    0.2 CLI RX|Child in state stopped
**** v1    0.2 STDOUT poll 0x10
**   v1    0.2 R 20499 Status: 0000 (u 0.005000 s 0.032000)
*    diag  0.0 ............................................................
#    top  TEST ../../../bin/varnishtest/tests/v00038.vtc TIMED OUT (kill -9)
#    top  TEST ../../../bin/varnishtest/tests/v00038.vtc FAILED (60.002) signal=9

1 @ SunOS 5.11 i86pc 1.04 32_gcc4.7 uplex

*    top   0.0 TEST ../../../bin/varnishtest/tests/v00038.vtc starting
[...]
*    top   0.0 TEST VCL compiler coverage test: vcc_backend.c
[...]
**** v1    0.2 CLI RX|
**** v1    0.2 CLI RX|Running VCC-compiler failed, exited with 2
**** v1    0.2 CLI RX|VCL compilation failed
**   v1    0.2 VCL compilation failed (as expected)
***  v1    0.2 Found expected string: ("Unknown field:")
**   top   0.2 === varnish v1 -errvcl "Mandatory field 'host' missing." {
**** v1    0.2 CLI TX|vcl.inline vcl12 << %XJEIFLH|)Xspa8P
**** v1    0.2 CLI TX|vcl 4.0;
**** v1    0.2 CLI TX|
**** v1    0.2 CLI TX|\tbackend b1 {
**** v1    0.2 CLI TX|\t\t.port = "NONE";
**** v1    0.2 CLI TX|\t}
**** v1    0.2 CLI TX|
**** v1    0.2 CLI TX|%XJEIFLH|)Xspa8P
***  v1    0.2 CLI RX  106
**** v1    0.2 CLI RX|Message from VCC-compiler:
**** v1    0.2 CLI RX|Security: Privilege proc_setid missing, will not change uid/gid
**** v1    0.2 CLI RX|Mandatory field 'host' missing.
**** v1    0.2 CLI RX|Running VCC-compiler failed, exited with 2
**** v1    0.2 CLI RX|VCL compilation failed
**   v1    0.2 VCL compilation failed (as expected)
***  v1    0.2 Found expected string: ("Mandatory field 'host' missing.")
*    top   0.2 RESETTING after ../../../bin/varnishtest/tests/v00038.vtc
**   v1    0.2 Wait
**** v1    0.2 CLI TX|backend.list
***  v1    0.2 CLI RX  101
**** v1    0.2 CLI RX|Unknown request in manager process (child not running).
**** v1    0.2 CLI RX|Type 'help' for more info.
**   v1    0.2 Stop
**** v1    0.2 CLI TX|stop
***  v1    0.2 CLI RX  300
**** v1    0.2 CLI RX|Child in state stopped
**** v1    0.2 CLI TX|status
***  v1    0.2 CLI RX  200
**** v1    0.2 CLI RX|Child in state stopped
**** v1    0.2 STDOUT poll 0x10
**   v1    0.2 R 59551 Status: 0000 (u 0.005000 s 0.032000)
*    diag  0.0 ............................................................
#    top  TEST ../../../bin/varnishtest/tests/v00038.vtc TIMED OUT (kill -9)
#    top  TEST ../../../bin/varnishtest/tests/v00038.vtc FAILED (60.002) signal=9

1 @ SunOS 5.11 i86pc 1.04 64_gcc4.7 uplex

*    top   0.0 TEST ../../../bin/varnishtest/tests/v00038.vtc starting
[...]
*    top   0.0 TEST VCL compiler coverage test: vcc_backend.c
[...]
**** v1    0.2 CLI RX|
**** v1    0.2 CLI RX|Running VCC-compiler failed, exited with 2
**** v1    0.2 CLI RX|VCL compilation failed
**   v1    0.2 VCL compilation failed (as expected)
***  v1    0.2 Found expected string: ("Unknown field:")
**   top   0.2 === varnish v1 -errvcl "Mandatory field 'host' missing." {
**** v1    0.2 CLI TX|vcl.inline vcl12 << %XJEIFLH|)Xspa8P
**** v1    0.2 CLI TX|vcl 4.0;
**** v1    0.2 CLI TX|
**** v1    0.2 CLI TX|\tbackend b1 {
**** v1    0.2 CLI TX|\t\t.port = "NONE";
**** v1    0.2 CLI TX|\t}
**** v1    0.2 CLI TX|
**** v1    0.2 CLI TX|%XJEIFLH|)Xspa8P
***  v1    0.2 CLI RX  106
**** v1    0.2 CLI RX|Message from VCC-compiler:
**** v1    0.2 CLI RX|Security: Privilege proc_setid missing, will not change uid/gid
**** v1    0.2 CLI RX|Mandatory field 'host' missing.
**** v1    0.2 CLI RX|Running VCC-compiler failed, exited with 2
**** v1    0.2 CLI RX|VCL compilation failed
**   v1    0.2 VCL compilation failed (as expected)
***  v1    0.2 Found expected string: ("Mandatory field 'host' missing.")
*    top   0.2 RESETTING after ../../../bin/varnishtest/tests/v00038.vtc
**   v1    0.2 Wait
**** v1    0.2 CLI TX|backend.list
***  v1    0.2 CLI RX  101
**** v1    0.2 CLI RX|Unknown request in manager process (child not running).
**** v1    0.2 CLI RX|Type 'help' for more info.
**   v1    0.2 Stop
**** v1    0.2 CLI TX|stop
***  v1    0.2 CLI RX  300
**** v1    0.2 CLI RX|Child in state stopped
**** v1    0.2 CLI TX|status
***  v1    0.2 CLI RX  200
**** v1    0.2 CLI RX|Child in state stopped
**** v1    0.2 STDOUT poll 0x10
**   v1    0.2 R 36030 Status: 0000 (u 0.018000 s 0.061000)
*    diag  0.0 ............................................................
#    top  TEST ../../../bin/varnishtest/tests/v00038.vtc TIMED OUT (kill -9)
#    top  TEST ../../../bin/varnishtest/tests/v00038.vtc FAILED (60.004) signal=9

1 @ SunOS 5.11 i86pc 1.04 32_gcc4.7 uplex

*    top   0.0 TEST ../../../bin/varnishtest/tests/v00038.vtc starting
[...]
*    top   0.0 TEST VCL compiler coverage test: vcc_backend.c
[...]
**** v1    0.2 CLI RX|
**** v1    0.2 CLI RX|Running VCC-compiler failed, exited with 2
**** v1    0.2 CLI RX|VCL compilation failed
**   v1    0.2 VCL compilation failed (as expected)
***  v1    0.2 Found expected string: ("Unknown field:")
**   top   0.2 === varnish v1 -errvcl "Mandatory field 'host' missing." {
**** v1    0.2 CLI TX|vcl.inline vcl12 << %XJEIFLH|)Xspa8P
**** v1    0.2 CLI TX|vcl 4.0;
**** v1    0.2 CLI TX|
**** v1    0.2 CLI TX|\tbackend b1 {
**** v1    0.2 CLI TX|\t\t.port = "NONE";
**** v1    0.2 CLI TX|\t}
**** v1    0.2 CLI TX|
**** v1    0.2 CLI TX|%XJEIFLH|)Xspa8P
***  v1    0.2 CLI RX  106
**** v1    0.2 CLI RX|Message from VCC-compiler:
**** v1    0.2 CLI RX|Security: Privilege proc_setid missing, will not change uid/gid
**** v1    0.2 CLI RX|Mandatory field 'host' missing.
**** v1    0.2 CLI RX|Running VCC-compiler failed, exited with 2
**** v1    0.2 CLI RX|VCL compilation failed
**   v1    0.2 VCL compilation failed (as expected)
***  v1    0.2 Found expected string: ("Mandatory field 'host' missing.")
*    top   0.2 RESETTING after ../../../bin/varnishtest/tests/v00038.vtc
**   v1    0.2 Wait
**** v1    0.2 CLI TX|backend.list
***  v1    0.2 CLI RX  101
**** v1    0.2 CLI RX|Unknown request in manager process (child not running).
**** v1    0.2 CLI RX|Type 'help' for more info.
**   v1    0.2 Stop
**** v1    0.2 CLI TX|stop
***  v1    0.2 CLI RX  300
**** v1    0.2 CLI RX|Child in state stopped
**** v1    0.2 CLI TX|status
***  v1    0.2 CLI RX  200
**** v1    0.2 CLI RX|Child in state stopped
**** v1    0.2 STDOUT poll 0x10
**   v1    0.2 R 90319 Status: 0000 (u 0.007000 s 0.042000)
*    diag  0.0 ............................................................
#    top  TEST ../../../bin/varnishtest/tests/v00038.vtc TIMED OUT (kill -9)
#    top  TEST ../../../bin/varnishtest/tests/v00038.vtc FAILED (60.003) signal=9

1 @ SunOS 5.11 i86pc 1.04 64_gcc4.7 uplex

*    top   0.0 TEST ../../../bin/varnishtest/tests/v00038.vtc starting
[...]
*    top   0.0 TEST VCL compiler coverage test: vcc_backend.c
[...]
**** v1    0.2 CLI RX|
**** v1    0.2 CLI RX|Running VCC-compiler failed, exited with 2
**** v1    0.2 CLI RX|VCL compilation failed
**   v1    0.2 VCL compilation failed (as expected)
***  v1    0.2 Found expected string: ("Unknown field:")
**   top   0.2 === varnish v1 -errvcl "Mandatory field 'host' missing." {
**** v1    0.2 CLI TX|vcl.inline vcl12 << %XJEIFLH|)Xspa8P
**** v1    0.2 CLI TX|vcl 4.0;
**** v1    0.2 CLI TX|
**** v1    0.2 CLI TX|\tbackend b1 {
**** v1    0.2 CLI TX|\t\t.port = "NONE";
**** v1    0.2 CLI TX|\t}
**** v1    0.2 CLI TX|
**** v1    0.2 CLI TX|%XJEIFLH|)Xspa8P
***  v1    0.2 CLI RX  106
**** v1    0.2 CLI RX|Message from VCC-compiler:
**** v1    0.2 CLI RX|Security: Privilege proc_setid missing, will not change uid/gid
**** v1    0.2 CLI RX|Mandatory field 'host' missing.
**** v1    0.2 CLI RX|Running VCC-compiler failed, exited with 2
**** v1    0.2 CLI RX|VCL compilation failed
**   v1    0.2 VCL compilation failed (as expected)
***  v1    0.2 Found expected string: ("Mandatory field 'host' missing.")
*    top   0.2 RESETTING after ../../../bin/varnishtest/tests/v00038.vtc
**   v1    0.2 Wait
**** v1    0.2 CLI TX|backend.list
***  v1    0.2 CLI RX  101
**** v1    0.2 CLI RX|Unknown request in manager process (child not running).
**** v1    0.2 CLI RX|Type 'help' for more info.
**   v1    0.2 Stop
**** v1    0.2 CLI TX|stop
***  v1    0.2 CLI RX  300
**** v1    0.2 CLI RX|Child in state stopped
**** v1    0.2 CLI TX|status
***  v1    0.2 CLI RX  200
**** v1    0.2 CLI RX|Child in state stopped
**** v1    0.2 STDOUT poll 0x10
**   v1    0.2 R 77134 Status: 0000 (u 0.016000 s 0.061000)
*    diag  0.0 ............................................................
#    top  TEST ../../../bin/varnishtest/tests/v00038.vtc TIMED OUT (kill -9)
#    top  TEST ../../../bin/varnishtest/tests/v00038.vtc FAILED (60.004) signal=9

1 @ SunOS 5.11 i86pc 1.04 64_gcc4.7 uplex

*    top   0.0 TEST ../../../bin/varnishtest/tests/v00038.vtc starting
[...]
*    top   0.0 TEST VCL compiler coverage test: vcc_backend.c
[...]
**** v1    0.2 CLI RX|
**** v1    0.2 CLI RX|Running VCC-compiler failed, exited with 2
**** v1    0.2 CLI RX|VCL compilation failed
**   v1    0.2 VCL compilation failed (as expected)
***  v1    0.2 Found expected string: ("Unknown field:")
**   top   0.2 === varnish v1 -errvcl "Mandatory field 'host' missing." {
**** v1    0.2 CLI TX|vcl.inline vcl12 << %XJEIFLH|)Xspa8P
**** v1    0.2 CLI TX|vcl 4.0;
**** v1    0.2 CLI TX|
**** v1    0.2 CLI TX|\tbackend b1 {
**** v1    0.2 CLI TX|\t\t.port = "NONE";
**** v1    0.2 CLI TX|\t}
**** v1    0.2 CLI TX|
**** v1    0.2 CLI TX|%XJEIFLH|)Xspa8P
***  v1    0.2 CLI RX  106
**** v1    0.2 CLI RX|Message from VCC-compiler:
**** v1    0.2 CLI RX|Security: Privilege proc_setid missing, will not change uid/gid
**** v1    0.2 CLI RX|Mandatory field 'host' missing.
**** v1    0.2 CLI RX|Running VCC-compiler failed, exited with 2
**** v1    0.2 CLI RX|VCL compilation failed
**   v1    0.2 VCL compilation failed (as expected)
***  v1    0.2 Found expected string: ("Mandatory field 'host' missing.")
*    top   0.2 RESETTING after ../../../bin/varnishtest/tests/v00038.vtc
**   v1    0.2 Wait
**** v1    0.2 CLI TX|backend.list
***  v1    0.2 CLI RX  101
**** v1    0.2 CLI RX|Unknown request in manager process (child not running).
**** v1    0.2 CLI RX|Type 'help' for more info.
**   v1    0.2 Stop
**** v1    0.2 CLI TX|stop
***  v1    0.2 CLI RX  300
**** v1    0.2 CLI RX|Child in state stopped
**** v1    0.2 CLI TX|status
***  v1    0.2 CLI RX  200
**** v1    0.2 CLI RX|Child in state stopped
**** v1    0.2 STDOUT poll 0x10
**   v1    0.2 R 55230 Status: 0000 (u 0.019000 s 0.058000)
*    diag  0.0 ............................................................
#    top  TEST ../../../bin/varnishtest/tests/v00038.vtc TIMED OUT (kill -9)
#    top  TEST ../../../bin/varnishtest/tests/v00038.vtc FAILED (60.004) signal=9

1 @ SunOS 5.11 i86pc 1.04 32_gcc4.7 uplex

*    top   0.0 TEST ../../../bin/varnishtest/tests/v00038.vtc starting
[...]
*    top   0.0 TEST VCL compiler coverage test: vcc_backend.c
[...]
**** v1    0.2 CLI RX|
**** v1    0.2 CLI RX|Running VCC-compiler failed, exited with 2
**** v1    0.2 CLI RX|VCL compilation failed
**   v1    0.2 VCL compilation failed (as expected)
***  v1    0.2 Found expected string: ("Unknown field:")
**   top   0.2 === varnish v1 -errvcl "Mandatory field 'host' missing." {
**** v1    0.2 CLI TX|vcl.inline vcl12 << %XJEIFLH|)Xspa8P
**** v1    0.2 CLI TX|vcl 4.0;
**** v1    0.2 CLI TX|
**** v1    0.2 CLI TX|\tbackend b1 {
**** v1    0.2 CLI TX|\t\t.port = "NONE";
**** v1    0.2 CLI TX|\t}
**** v1    0.2 CLI TX|
**** v1    0.2 CLI TX|%XJEIFLH|)Xspa8P
***  v1    0.2 CLI RX  106
**** v1    0.2 CLI RX|Message from VCC-compiler:
**** v1    0.2 CLI RX|Security: Privilege proc_setid missing, will not change uid/gid
**** v1    0.2 CLI RX|Mandatory field 'host' missing.
**** v1    0.2 CLI RX|Running VCC-compiler failed, exited with 2
**** v1    0.2 CLI RX|VCL compilation failed
**   v1    0.2 VCL compilation failed (as expected)
***  v1    0.2 Found expected string: ("Mandatory field 'host' missing.")
*    top   0.2 RESETTING after ../../../bin/varnishtest/tests/v00038.vtc
**   v1    0.2 Wait
**** v1    0.2 CLI TX|backend.list
***  v1    0.2 CLI RX  101
**** v1    0.2 CLI RX|Unknown request in manager process (child not running).
**** v1    0.2 CLI RX|Type 'help' for more info.
**   v1    0.2 Stop
**** v1    0.2 CLI TX|stop
***  v1    0.2 CLI RX  300
**** v1    0.2 CLI RX|Child in state stopped
**** v1    0.2 CLI TX|status
***  v1    0.2 CLI RX  200
**** v1    0.2 CLI RX|Child in state stopped
**** v1    0.2 STDOUT poll 0x10
**   v1    0.2 R 73013 Status: 0000 (u 0.005000 s 0.031000)
*    diag  0.0 ............................................................
#    top  TEST ../../../bin/varnishtest/tests/v00038.vtc TIMED OUT (kill -9)
#    top  TEST ../../../bin/varnishtest/tests/v00038.vtc FAILED (60.002) signal=9

1 @ SunOS 5.11 i86pc 1.04 64_gcc4.7 uplex

*    top   0.0 TEST ../../../bin/varnishtest/tests/v00038.vtc starting
[...]
*    top   0.0 TEST VCL compiler coverage test: vcc_backend.c
[...]
**** v1    0.2 CLI RX|
**** v1    0.2 CLI RX|Running VCC-compiler failed, exited with 2
**** v1    0.2 CLI RX|VCL compilation failed
**   v1    0.2 VCL compilation failed (as expected)
***  v1    0.2 Found expected string: ("Unknown field:")
**   top   0.2 === varnish v1 -errvcl "Mandatory field 'host' missing." {
**** v1    0.2 CLI TX|vcl.inline vcl12 << %XJEIFLH|)Xspa8P
**** v1    0.2 CLI TX|vcl 4.0;
**** v1    0.2 CLI TX|
**** v1    0.2 CLI TX|\tbackend b1 {
**** v1    0.2 CLI TX|\t\t.port = "NONE";
**** v1    0.2 CLI TX|\t}
**** v1    0.2 CLI TX|
**** v1    0.2 CLI TX|%XJEIFLH|)Xspa8P
***  v1    0.2 CLI RX  106
**** v1    0.2 CLI RX|Message from VCC-compiler:
**** v1    0.2 CLI RX|Security: Privilege proc_setid missing, will not change uid/gid
**** v1    0.2 CLI RX|Mandatory field 'host' missing.
**** v1    0.2 CLI RX|Running VCC-compiler failed, exited with 2
**** v1    0.2 CLI RX|VCL compilation failed
**   v1    0.2 VCL compilation failed (as expected)
***  v1    0.2 Found expected string: ("Mandatory field 'host' missing.")
*    top   0.2 RESETTING after ../../../bin/varnishtest/tests/v00038.vtc
**   v1    0.2 Wait
**** v1    0.2 CLI TX|backend.list
***  v1    0.2 CLI RX  101
**** v1    0.2 CLI RX|Unknown request in manager process (child not running).
**** v1    0.2 CLI RX|Type 'help' for more info.
**   v1    0.2 Stop
**** v1    0.2 CLI TX|stop
***  v1    0.2 CLI RX  300
**** v1    0.2 CLI RX|Child in state stopped
**** v1    0.2 CLI TX|status
***  v1    0.2 CLI RX  200
**** v1    0.2 CLI RX|Child in state stopped
**** v1    0.2 STDOUT poll 0x10
**   v1    0.2 R 95486 Status: 0000 (u 0.022000 s 0.061000)
*    diag  0.0 ............................................................
#    top  TEST ../../../bin/varnishtest/tests/v00038.vtc TIMED OUT (kill -9)
#    top  TEST ../../../bin/varnishtest/tests/v00038.vtc FAILED (60.004) signal=9

1 @ SunOS 5.11 i86pc 1.04 32_sun12.4 uplex

*    top   0.0 TEST ../../../bin/varnishtest/tests/v00038.vtc starting
[...]
*    top   0.0 TEST VCL compiler coverage test: vcc_backend.c
[...]
**** v1    0.2 CLI RX|
**** v1    0.2 CLI RX|Running VCC-compiler failed, exited with 2
**** v1    0.2 CLI RX|VCL compilation failed
**   v1    0.2 VCL compilation failed (as expected)
***  v1    0.2 Found expected string: ("Unknown field:")
**   top   0.2 === varnish v1 -errvcl "Mandatory field 'host' missing." {
**** v1    0.2 CLI TX|vcl.inline vcl12 << %XJEIFLH|)Xspa8P
**** v1    0.2 CLI TX|vcl 4.0;
**** v1    0.2 CLI TX|
**** v1    0.2 CLI TX|\tbackend b1 {
**** v1    0.2 CLI TX|\t\t.port = "NONE";
**** v1    0.2 CLI TX|\t}
**** v1    0.2 CLI TX|
**** v1    0.2 CLI TX|%XJEIFLH|)Xspa8P
***  v1    0.2 CLI RX  106
**** v1    0.2 CLI RX|Message from VCC-compiler:
**** v1    0.2 CLI RX|Security: Privilege proc_setid missing, will not change uid/gid
**** v1    0.2 CLI RX|Mandatory field 'host' missing.
**** v1    0.2 CLI RX|Running VCC-compiler failed, exited with 2
**** v1    0.2 CLI RX|VCL compilation failed
**   v1    0.2 VCL compilation failed (as expected)
***  v1    0.2 Found expected string: ("Mandatory field 'host' missing.")
*    top   0.2 RESETTING after ../../../bin/varnishtest/tests/v00038.vtc
**   v1    0.2 Wait
**** v1    0.2 CLI TX|backend.list
***  v1    0.2 CLI RX  101
**** v1    0.2 CLI RX|Unknown request in manager process (child not running).
**** v1    0.2 CLI RX|Type 'help' for more info.
**   v1    0.2 Stop
**** v1    0.2 CLI TX|stop
***  v1    0.2 CLI RX  300
**** v1    0.2 CLI RX|Child in state stopped
**** v1    0.2 CLI TX|status
***  v1    0.2 CLI RX  200
**** v1    0.2 CLI RX|Child in state stopped
**** v1    0.2 STDOUT poll 0x10
**   v1    0.2 R 83761 Status: 0000 (u 0.005000 s 0.031000)
*    diag  0.0 ............................................................
#    top  TEST ../../../bin/varnishtest/tests/v00038.vtc TIMED OUT (kill -9)
#    top  TEST ../../../bin/varnishtest/tests/v00038.vtc FAILED (60.002) signal=9

1 @ SunOS 5.11 i86pc 1.04 64_sun12.4 uplex

*    top   0.0 TEST ../../../bin/varnishtest/tests/v00038.vtc starting
[...]
*    top   0.0 TEST VCL compiler coverage test: vcc_backend.c
[...]
**** v1    0.2 CLI RX|
**** v1    0.2 CLI RX|Running VCC-compiler failed, exited with 2
**** v1    0.2 CLI RX|VCL compilation failed
**   v1    0.2 VCL compilation failed (as expected)
***  v1    0.2 Found expected string: ("Unknown field:")
**   top   0.2 === varnish v1 -errvcl "Mandatory field 'host' missing." {
**** v1    0.2 CLI TX|vcl.inline vcl12 << %XJEIFLH|)Xspa8P
**** v1    0.2 CLI TX|vcl 4.0;
**** v1    0.2 CLI TX|
**** v1    0.2 CLI TX|\tbackend b1 {
**** v1    0.2 CLI TX|\t\t.port = "NONE";
**** v1    0.2 CLI TX|\t}
**** v1    0.2 CLI TX|
**** v1    0.2 CLI TX|%XJEIFLH|)Xspa8P
***  v1    0.2 CLI RX  106
**** v1    0.2 CLI RX|Message from VCC-compiler:
**** v1    0.2 CLI RX|Security: Privilege proc_setid missing, will not change uid/gid
**** v1    0.2 CLI RX|Mandatory field 'host' missing.
**** v1    0.2 CLI RX|Running VCC-compiler failed, exited with 2
**** v1    0.2 CLI RX|VCL compilation failed
**   v1    0.2 VCL compilation failed (as expected)
***  v1    0.2 Found expected string: ("Mandatory field 'host' missing.")
*    top   0.2 RESETTING after ../../../bin/varnishtest/tests/v00038.vtc
**   v1    0.2 Wait
**** v1    0.2 CLI TX|backend.list
***  v1    0.2 CLI RX  101
**** v1    0.2 CLI RX|Unknown request in manager process (child not running).
**** v1    0.2 CLI RX|Type 'help' for more info.
**   v1    0.2 Stop
**** v1    0.2 CLI TX|stop
***  v1    0.2 CLI RX  300
**** v1    0.2 CLI RX|Child in state stopped
**** v1    0.2 CLI TX|status
***  v1    0.2 CLI RX  200
**** v1    0.2 CLI RX|Child in state stopped
**** v1    0.2 STDOUT poll 0x10
**   v1    0.2 R 1059 Status: 0000 (u 0.021000 s 0.059000)
*    diag  0.0 ............................................................
#    top  TEST ../../../bin/varnishtest/tests/v00038.vtc TIMED OUT (kill -9)
#    top  TEST ../../../bin/varnishtest/tests/v00038.vtc FAILED (60.004) signal=9

1 @ SunOS 5.11 i86pc 1.04 32_gcc4.7 uplex

*    top   0.0 TEST ../../../bin/varnishtest/tests/v00038.vtc starting
[...]
*    top   0.0 TEST VCL compiler coverage test: vcc_backend.c
[...]
**** v1    0.2 CLI RX|
**** v1    0.2 CLI RX|Running VCC-compiler failed, exited with 2
**** v1    0.2 CLI RX|VCL compilation failed
**   v1    0.2 VCL compilation failed (as expected)
***  v1    0.2 Found expected string: ("Unknown field:")
**   top   0.2 === varnish v1 -errvcl "Mandatory field 'host' missing." {
**** v1    0.2 CLI TX|vcl.inline vcl12 << %XJEIFLH|)Xspa8P
**** v1    0.2 CLI TX|vcl 4.0;
**** v1    0.2 CLI TX|
**** v1    0.2 CLI TX|\tbackend b1 {
**** v1    0.2 CLI TX|\t\t.port = "NONE";
**** v1    0.2 CLI TX|\t}
**** v1    0.2 CLI TX|
**** v1    0.2 CLI TX|%XJEIFLH|)Xspa8P
***  v1    0.2 CLI RX  106
**** v1    0.2 CLI RX|Message from VCC-compiler:
**** v1    0.2 CLI RX|Security: Privilege proc_setid missing, will not change uid/gid
**** v1    0.2 CLI RX|Mandatory field 'host' missing.
**** v1    0.2 CLI RX|Running VCC-compiler failed, exited with 2
**** v1    0.2 CLI RX|VCL compilation failed
**   v1    0.2 VCL compilation failed (as expected)
***  v1    0.2 Found expected string: ("Mandatory field 'host' missing.")
*    top   0.2 RESETTING after ../../../bin/varnishtest/tests/v00038.vtc
**   v1    0.2 Wait
**** v1    0.2 CLI TX|backend.list
***  v1    0.2 CLI RX  101
**** v1    0.2 CLI RX|Unknown request in manager process (child not running).
**** v1    0.2 CLI RX|Type 'help' for more info.
**   v1    0.2 Stop
**** v1    0.2 CLI TX|stop
***  v1    0.2 CLI RX  300
**** v1    0.2 CLI RX|Child in state stopped
**** v1    0.2 CLI TX|status
***  v1    0.2 CLI RX  200
**** v1    0.2 CLI RX|Child in state stopped
**** v1    0.2 STDOUT poll 0x10
**   v1    0.2 R 53364 Status: 0000 (u 0.005000 s 0.033000)
*    diag  0.0 ............................................................
#    top  TEST ../../../bin/varnishtest/tests/v00038.vtc TIMED OUT (kill -9)
#    top  TEST ../../../bin/varnishtest/tests/v00038.vtc FAILED (60.001) signal=9

1 @ SunOS 5.11 i86pc 1.04 64_sun12.4 uplex

*    top   0.0 TEST ../../../bin/varnishtest/tests/v00038.vtc starting
[...]
*    top   0.0 TEST VCL compiler coverage test: vcc_backend.c
[...]
**** v1    0.2 CLI RX|
**** v1    0.2 CLI RX|Running VCC-compiler failed, exited with 2
**** v1    0.2 CLI RX|VCL compilation failed
**   v1    0.2 VCL compilation failed (as expected)
***  v1    0.2 Found expected string: ("Unknown field:")
**   top   0.2 === varnish v1 -errvcl "Mandatory field 'host' missing." {
**** v1    0.2 CLI TX|vcl.inline vcl12 << %XJEIFLH|)Xspa8P
**** v1    0.2 CLI TX|vcl 4.0;
**** v1    0.2 CLI TX|
**** v1    0.2 CLI TX|\tbackend b1 {
**** v1    0.2 CLI TX|\t\t.port = "NONE";
**** v1    0.2 CLI TX|\t}
**** v1    0.2 CLI TX|
**** v1    0.2 CLI TX|%XJEIFLH|)Xspa8P
***  v1    0.2 CLI RX  106
**** v1    0.2 CLI RX|Message from VCC-compiler:
**** v1    0.2 CLI RX|Security: Privilege proc_setid missing, will not change uid/gid
**** v1    0.2 CLI RX|Mandatory field 'host' missing.
**** v1    0.2 CLI RX|Running VCC-compiler failed, exited with 2
**** v1    0.2 CLI RX|VCL compilation failed
**   v1    0.2 VCL compilation failed (as expected)
***  v1    0.2 Found expected string: ("Mandatory field 'host' missing.")
*    top   0.2 RESETTING after ../../../bin/varnishtest/tests/v00038.vtc
**   v1    0.2 Wait
**** v1    0.2 CLI TX|backend.list
***  v1    0.2 CLI RX  101
**** v1    0.2 CLI RX|Unknown request in manager process (child not running).
**** v1    0.2 CLI RX|Type 'help' for more info.
**   v1    0.2 Stop
**** v1    0.2 CLI TX|stop
***  v1    0.2 CLI RX  300
**** v1    0.2 CLI RX|Child in state stopped
**** v1    0.2 CLI TX|status
***  v1    0.2 CLI RX  200
**** v1    0.2 CLI RX|Child in state stopped
**** v1    0.2 STDOUT poll 0x10
**   v1    0.2 R 246 Status: 0000 (u 0.021000 s 0.058000)
*    diag  0.0 ............................................................
#    top  TEST ../../../bin/varnishtest/tests/v00038.vtc TIMED OUT (kill -9)
#    top  TEST ../../../bin/varnishtest/tests/v00038.vtc FAILED (60.004) signal=9

1 @ SunOS 5.11 i86pc 1.04 32_gcc4.7 uplex

*    top   0.0 TEST ../../../bin/varnishtest/tests/v00038.vtc starting
[...]
*    top   0.0 TEST VCL compiler coverage test: vcc_backend.c
[...]
**** v1    0.2 CLI RX|
**** v1    0.2 CLI RX|Running VCC-compiler failed, exited with 2
**** v1    0.2 CLI RX|VCL compilation failed
**   v1    0.2 VCL compilation failed (as expected)
***  v1    0.2 Found expected string: ("Unknown field:")
**   top   0.2 === varnish v1 -errvcl "Mandatory field 'host' missing." {
**** v1    0.2 CLI TX|vcl.inline vcl12 << %XJEIFLH|)Xspa8P
**** v1    0.2 CLI TX|vcl 4.0;
**** v1    0.2 CLI TX|
**** v1    0.2 CLI TX|\tbackend b1 {
**** v1    0.2 CLI TX|\t\t.port = "NONE";
**** v1    0.2 CLI TX|\t}
**** v1    0.2 CLI TX|
**** v1    0.2 CLI TX|%XJEIFLH|)Xspa8P
***  v1    0.2 CLI RX  106
**** v1    0.2 CLI RX|Message from VCC-compiler:
**** v1    0.2 CLI RX|Security: Privilege proc_setid missing, will not change uid/gid
**** v1    0.2 CLI RX|Mandatory field 'host' missing.
**** v1    0.2 CLI RX|Running VCC-compiler failed, exited with 2
**** v1    0.2 CLI RX|VCL compilation failed
**   v1    0.2 VCL compilation failed (as expected)
***  v1    0.2 Found expected string: ("Mandatory field 'host' missing.")
*    top   0.2 RESETTING after ../../../bin/varnishtest/tests/v00038.vtc
**   v1    0.2 Wait
**** v1    0.2 CLI TX|backend.list
***  v1    0.2 CLI RX  101
**** v1    0.2 CLI RX|Unknown request in manager process (child not running).
**** v1    0.2 CLI RX|Type 'help' for more info.
**   v1    0.2 Stop
**** v1    0.2 CLI TX|stop
***  v1    0.2 CLI RX  300
**** v1    0.2 CLI RX|Child in state stopped
**** v1    0.2 CLI TX|status
***  v1    0.2 CLI RX  200
**** v1    0.2 CLI RX|Child in state stopped
**** v1    0.2 STDOUT poll 0x10
**   v1    0.2 R 86378 Status: 0000 (u 0.005000 s 0.033000)
*    diag  0.0 ............................................................
#    top  TEST ../../../bin/varnishtest/tests/v00038.vtc TIMED OUT (kill -9)
#    top  TEST ../../../bin/varnishtest/tests/v00038.vtc FAILED (60.002) signal=9

1 @ SunOS 5.11 i86pc 1.04 32_gcc4.7 uplex

*    top   0.0 TEST ../../../bin/varnishtest/tests/v00038.vtc starting
[...]
*    top   0.0 TEST VCL compiler coverage test: vcc_backend.c
[...]
**** v1    0.2 CLI RX|
**** v1    0.2 CLI RX|Running VCC-compiler failed, exited with 2
**** v1    0.2 CLI RX|VCL compilation failed
**   v1    0.2 VCL compilation failed (as expected)
***  v1    0.2 Found expected string: ("Unknown field:")
**   top   0.2 === varnish v1 -errvcl "Mandatory field 'host' missing." {
**** v1    0.2 CLI TX|vcl.inline vcl12 << %XJEIFLH|)Xspa8P
**** v1    0.2 CLI TX|vcl 4.0;
**** v1    0.2 CLI TX|
**** v1    0.2 CLI TX|\tbackend b1 {
**** v1    0.2 CLI TX|\t\t.port = "NONE";
**** v1    0.2 CLI TX|\t}
**** v1    0.2 CLI TX|
**** v1    0.2 CLI TX|%XJEIFLH|)Xspa8P
***  v1    0.2 CLI RX  106
**** v1    0.2 CLI RX|Message from VCC-compiler:
**** v1    0.2 CLI RX|Security: Privilege proc_setid missing, will not change uid/gid
**** v1    0.2 CLI RX|Mandatory field 'host' missing.
**** v1    0.2 CLI RX|Running VCC-compiler failed, exited with 2
**** v1    0.2 CLI RX|VCL compilation failed
**   v1    0.2 VCL compilation failed (as expected)
***  v1    0.2 Found expected string: ("Mandatory field 'host' missing.")
*    top   0.2 RESETTING after ../../../bin/varnishtest/tests/v00038.vtc
**   v1    0.2 Wait
**** v1    0.2 CLI TX|backend.list
***  v1    0.2 CLI RX  101
**** v1    0.2 CLI RX|Unknown request in manager process (child not running).
**** v1    0.2 CLI RX|Type 'help' for more info.
**   v1    0.2 Stop
**** v1    0.2 CLI TX|stop
***  v1    0.2 CLI RX  300
**** v1    0.2 CLI RX|Child in state stopped
**** v1    0.2 CLI TX|status
***  v1    0.2 CLI RX  200
**** v1    0.2 CLI RX|Child in state stopped
**** v1    0.2 STDOUT poll 0x10
**   v1    0.2 R 75913 Status: 0000 (u 0.006000 s 0.035000)
*    diag  0.0 ............................................................
#    top  TEST ../../../bin/varnishtest/tests/v00038.vtc TIMED OUT (kill -9)
#    top  TEST ../../../bin/varnishtest/tests/v00038.vtc FAILED (60.002) signal=9

1 @ SunOS 5.11 i86pc 1.04 64_gcc4.7 uplex

*    top   0.0 TEST ../../../bin/varnishtest/tests/v00038.vtc starting
[...]
*    top   0.0 TEST VCL compiler coverage test: vcc_backend.c
[...]
**** v1    0.2 CLI RX|
**** v1    0.2 CLI RX|Running VCC-compiler failed, exited with 2
**** v1    0.2 CLI RX|VCL compilation failed
**   v1    0.2 VCL compilation failed (as expected)
***  v1    0.2 Found expected string: ("Unknown field:")
**   top   0.2 === varnish v1 -errvcl "Mandatory field 'host' missing." {
**** v1    0.2 CLI TX|vcl.inline vcl12 << %XJEIFLH|)Xspa8P
**** v1    0.2 CLI TX|vcl 4.0;
**** v1    0.2 CLI TX|
**** v1    0.2 CLI TX|\tbackend b1 {
**** v1    0.2 CLI TX|\t\t.port = "NONE";
**** v1    0.2 CLI TX|\t}
**** v1    0.2 CLI TX|
**** v1    0.2 CLI TX|%XJEIFLH|)Xspa8P
***  v1    0.2 CLI RX  106
**** v1    0.2 CLI RX|Message from VCC-compiler:
**** v1    0.2 CLI RX|Security: Privilege proc_setid missing, will not change uid/gid
**** v1    0.2 CLI RX|Mandatory field 'host' missing.
**** v1    0.2 CLI RX|Running VCC-compiler failed, exited with 2
**** v1    0.2 CLI RX|VCL compilation failed
**   v1    0.2 VCL compilation failed (as expected)
***  v1    0.2 Found expected string: ("Mandatory field 'host' missing.")
*    top   0.2 RESETTING after ../../../bin/varnishtest/tests/v00038.vtc
**   v1    0.2 Wait
**** v1    0.2 CLI TX|backend.list
***  v1    0.2 CLI RX  101
**** v1    0.2 CLI RX|Unknown request in manager process (child not running).
**** v1    0.2 CLI RX|Type 'help' for more info.
**   v1    0.2 Stop
**** v1    0.2 CLI TX|stop
***  v1    0.2 CLI RX  300
**** v1    0.2 CLI RX|Child in state stopped
**** v1    0.2 CLI TX|status
***  v1    0.2 CLI RX  200
**** v1    0.2 CLI RX|Child in state stopped
**** v1    0.2 STDOUT poll 0x10
**   v1    0.2 R 71364 Status: 0000 (u 0.018000 s 0.063000)
*    diag  0.0 ............................................................
#    top  TEST ../../../bin/varnishtest/tests/v00038.vtc TIMED OUT (kill -9)
#    top  TEST ../../../bin/varnishtest/tests/v00038.vtc FAILED (60.004) signal=9

1 @ SunOS 5.11 i86pc 1.04 32_gcc4.7 uplex

*    top   0.0 TEST ../../../bin/varnishtest/tests/v00038.vtc starting
[...]
*    top   0.0 TEST VCL compiler coverage test: vcc_backend.c
[...]
**** v1    0.2 CLI RX|
**** v1    0.2 CLI RX|Running VCC-compiler failed, exited with 2
**** v1    0.2 CLI RX|VCL compilation failed
**   v1    0.2 VCL compilation failed (as expected)
***  v1    0.2 Found expected string: ("Unknown field:")
**   top   0.2 === varnish v1 -errvcl "Mandatory field 'host' missing." {
**** v1    0.2 CLI TX|vcl.inline vcl12 << %XJEIFLH|)Xspa8P
**** v1    0.2 CLI TX|vcl 4.0;
**** v1    0.2 CLI TX|
**** v1    0.2 CLI TX|\tbackend b1 {
**** v1    0.2 CLI TX|\t\t.port = "NONE";
**** v1    0.2 CLI TX|\t}
**** v1    0.2 CLI TX|
**** v1    0.2 CLI TX|%XJEIFLH|)Xspa8P
***  v1    0.2 CLI RX  106
**** v1    0.2 CLI RX|Message from VCC-compiler:
**** v1    0.2 CLI RX|Security: Privilege proc_setid missing, will not change uid/gid
**** v1    0.2 CLI RX|Mandatory field 'host' missing.
**** v1    0.2 CLI RX|Running VCC-compiler failed, exited with 2
**** v1    0.2 CLI RX|VCL compilation failed
**   v1    0.2 VCL compilation failed (as expected)
***  v1    0.2 Found expected string: ("Mandatory field 'host' missing.")
*    top   0.2 RESETTING after ../../../bin/varnishtest/tests/v00038.vtc
**   v1    0.2 Wait
**** v1    0.2 CLI TX|backend.list
***  v1    0.2 CLI RX  101
**** v1    0.2 CLI RX|Unknown request in manager process (child not running).
**** v1    0.2 CLI RX|Type 'help' for more info.
**   v1    0.2 Stop
**** v1    0.2 CLI TX|stop
***  v1    0.2 CLI RX  300
**** v1    0.2 CLI RX|Child in state stopped
**** v1    0.2 CLI TX|status
***  v1    0.2 CLI RX  200
**** v1    0.2 CLI RX|Child in state stopped
**** v1    0.2 STDOUT poll 0x10
**   v1    0.2 R 12734 Status: 0000 (u 0.006000 s 0.036000)
*    diag  0.0 ............................................................
#    top  TEST ../../../bin/varnishtest/tests/v00038.vtc TIMED OUT (kill -9)
#    top  TEST ../../../bin/varnishtest/tests/v00038.vtc FAILED (60.002) signal=9

1 @ SunOS 5.11 i86pc 1.04 64_gcc4.7 uplex

*    top   0.0 TEST ../../../bin/varnishtest/tests/v00038.vtc starting
[...]
*    top   0.0 TEST VCL compiler coverage test: vcc_backend.c
[...]
**** v1    0.2 CLI RX|
**** v1    0.2 CLI RX|Running VCC-compiler failed, exited with 2
**** v1    0.2 CLI RX|VCL compilation failed
**   v1    0.2 VCL compilation failed (as expected)
***  v1    0.2 Found expected string: ("Unknown field:")
**   top   0.2 === varnish v1 -errvcl "Mandatory field 'host' missing." {
**** v1    0.2 CLI TX|vcl.inline vcl12 << %XJEIFLH|)Xspa8P
**** v1    0.2 CLI TX|vcl 4.0;
**** v1    0.2 CLI TX|
**** v1    0.2 CLI TX|\tbackend b1 {
**** v1    0.2 CLI TX|\t\t.port = "NONE";
**** v1    0.2 CLI TX|\t}
**** v1    0.2 CLI TX|
**** v1    0.2 CLI TX|%XJEIFLH|)Xspa8P
***  v1    0.2 CLI RX  106
**** v1    0.2 CLI RX|Message from VCC-compiler:
**** v1    0.2 CLI RX|Security: Privilege proc_setid missing, will not change uid/gid
**** v1    0.2 CLI RX|Mandatory field 'host' missing.
**** v1    0.2 CLI RX|Running VCC-compiler failed, exited with 2
**** v1    0.2 CLI RX|VCL compilation failed
**   v1    0.2 VCL compilation failed (as expected)
***  v1    0.2 Found expected string: ("Mandatory field 'host' missing.")
*    top   0.2 RESETTING after ../../../bin/varnishtest/tests/v00038.vtc
**   v1    0.2 Wait
**** v1    0.2 CLI TX|backend.list
***  v1    0.2 CLI RX  101
**** v1    0.2 CLI RX|Unknown request in manager process (child not running).
**** v1    0.2 CLI RX|Type 'help' for more info.
**   v1    0.2 Stop
**** v1    0.2 CLI TX|stop
***  v1    0.2 CLI RX  300
**** v1    0.2 CLI RX|Child in state stopped
**** v1    0.2 CLI TX|status
***  v1    0.2 CLI RX  200
**** v1    0.2 CLI RX|Child in state stopped
**** v1    0.2 STDOUT poll 0x10
**   v1    0.2 R 69657 Status: 0000 (u 0.020000 s 0.062000)
*    diag  0.0 ............................................................
#    top  TEST ../../../bin/varnishtest/tests/v00038.vtc TIMED OUT (kill -9)
#    top  TEST ../../../bin/varnishtest/tests/v00038.vtc FAILED (60.004) signal=9

1 @ SunOS 5.11 i86pc 1.04 32_sun12.4 uplex

*    top   0.0 TEST ../../../bin/varnishtest/tests/v00038.vtc starting
[...]
*    top   0.0 TEST VCL compiler coverage test: vcc_backend.c
[...]
**** v1    0.2 CLI RX|
**** v1    0.2 CLI RX|Running VCC-compiler failed, exited with 2
**** v1    0.2 CLI RX|VCL compilation failed
**   v1    0.2 VCL compilation failed (as expected)
***  v1    0.2 Found expected string: ("Unknown field:")
**   top   0.2 === varnish v1 -errvcl "Mandatory field 'host' missing." {
**** v1    0.2 CLI TX|vcl.inline vcl12 << %XJEIFLH|)Xspa8P
**** v1    0.2 CLI TX|vcl 4.0;
**** v1    0.2 CLI TX|
**** v1    0.2 CLI TX|\tbackend b1 {
**** v1    0.2 CLI TX|\t\t.port = "NONE";
**** v1    0.2 CLI TX|\t}
**** v1    0.2 CLI TX|
**** v1    0.2 CLI TX|%XJEIFLH|)Xspa8P
***  v1    0.2 CLI RX  106
**** v1    0.2 CLI RX|Message from VCC-compiler:
**** v1    0.2 CLI RX|Security: Privilege proc_setid missing, will not change uid/gid
**** v1    0.2 CLI RX|Mandatory field 'host' missing.
**** v1    0.2 CLI RX|Running VCC-compiler failed, exited with 2
**** v1    0.2 CLI RX|VCL compilation failed
**   v1    0.2 VCL compilation failed (as expected)
***  v1    0.2 Found expected string: ("Mandatory field 'host' missing.")
*    top   0.2 RESETTING after ../../../bin/varnishtest/tests/v00038.vtc
**   v1    0.2 Wait
**** v1    0.2 CLI TX|backend.list
***  v1    0.2 CLI RX  101
**** v1    0.2 CLI RX|Unknown request in manager process (child not running).
**** v1    0.2 CLI RX|Type 'help' for more info.
**   v1    0.2 Stop
**** v1    0.2 CLI TX|stop
***  v1    0.2 CLI RX  300
**** v1    0.2 CLI RX|Child in state stopped
**** v1    0.2 CLI TX|status
***  v1    0.2 CLI RX  200
**** v1    0.2 CLI RX|Child in state stopped
**** v1    0.2 STDOUT poll 0x10
**   v1    0.2 R 65555 Status: 0000 (u 0.007000 s 0.038000)
*    diag  0.0 ............................................................
#    top  TEST ../../../bin/varnishtest/tests/v00038.vtc TIMED OUT (kill -9)
#    top  TEST ../../../bin/varnishtest/tests/v00038.vtc FAILED (60.002) signal=9

1 @ SunOS 5.11 i86pc 1.04 32_sun12.4 uplex

*    top   0.0 TEST ../../../bin/varnishtest/tests/v00038.vtc starting
[...]
*    top   0.0 TEST VCL compiler coverage test: vcc_backend.c
[...]
**** v1    0.2 CLI RX|
**** v1    0.2 CLI RX|Running VCC-compiler failed, exited with 2
**** v1    0.2 CLI RX|VCL compilation failed
**   v1    0.2 VCL compilation failed (as expected)
***  v1    0.2 Found expected string: ("Unknown field:")
**   top   0.2 === varnish v1 -errvcl "Mandatory field 'host' missing." {
**** v1    0.2 CLI TX|vcl.inline vcl12 << %XJEIFLH|)Xspa8P
**** v1    0.2 CLI TX|vcl 4.0;
**** v1    0.2 CLI TX|
**** v1    0.2 CLI TX|\tbackend b1 {
**** v1    0.2 CLI TX|\t\t.port = "NONE";
**** v1    0.2 CLI TX|\t}
**** v1    0.2 CLI TX|
**** v1    0.2 CLI TX|%XJEIFLH|)Xspa8P
***  v1    0.2 CLI RX  106
**** v1    0.2 CLI RX|Message from VCC-compiler:
**** v1    0.2 CLI RX|Security: Privilege proc_setid missing, will not change uid/gid
**** v1    0.2 CLI RX|Mandatory field 'host' missing.
**** v1    0.2 CLI RX|Running VCC-compiler failed, exited with 2
**** v1    0.2 CLI RX|VCL compilation failed
**   v1    0.2 VCL compilation failed (as expected)
***  v1    0.2 Found expected string: ("Mandatory field 'host' missing.")
*    top   0.2 RESETTING after ../../../bin/varnishtest/tests/v00038.vtc
**   v1    0.2 Wait
**** v1    0.2 CLI TX|backend.list
***  v1    0.2 CLI RX  101
**** v1    0.2 CLI RX|Unknown request in manager process (child not running).
**** v1    0.2 CLI RX|Type 'help' for more info.
**   v1    0.2 Stop
**** v1    0.2 CLI TX|stop
***  v1    0.2 CLI RX  300
**** v1    0.2 CLI RX|Child in state stopped
**** v1    0.2 CLI TX|status
***  v1    0.2 CLI RX  200
**** v1    0.2 CLI RX|Child in state stopped
**** v1    0.2 STDOUT poll 0x10
**   v1    0.2 R 23351 Status: 0000 (u 0.005000 s 0.031000)
*    diag  0.0 ............................................................
#    top  TEST ../../../bin/varnishtest/tests/v00038.vtc TIMED OUT (kill -9)
#    top  TEST ../../../bin/varnishtest/tests/v00038.vtc FAILED (60.002) signal=9

1 @ SunOS 5.11 i86pc 1.04 32_sun12.4 uplex

*    top   0.0 TEST ../../../bin/varnishtest/tests/v00038.vtc starting
[...]
*    top   0.0 TEST VCL compiler coverage test: vcc_backend.c
[...]
**** v1    0.2 CLI RX|
**** v1    0.2 CLI RX|Running VCC-compiler failed, exited with 2
**** v1    0.2 CLI RX|VCL compilation failed
**   v1    0.2 VCL compilation failed (as expected)
***  v1    0.2 Found expected string: ("Unknown field:")
**   top   0.2 === varnish v1 -errvcl "Mandatory field 'host' missing." {
**** v1    0.2 CLI TX|vcl.inline vcl12 << %XJEIFLH|)Xspa8P
**** v1    0.2 CLI TX|vcl 4.0;
**** v1    0.2 CLI TX|
**** v1    0.2 CLI TX|\tbackend b1 {
**** v1    0.2 CLI TX|\t\t.port = "NONE";
**** v1    0.2 CLI TX|\t}
**** v1    0.2 CLI TX|
**** v1    0.2 CLI TX|%XJEIFLH|)Xspa8P
***  v1    0.2 CLI RX  106
**** v1    0.2 CLI RX|Message from VCC-compiler:
**** v1    0.2 CLI RX|Security: Privilege proc_setid missing, will not change uid/gid
**** v1    0.2 CLI RX|Mandatory field 'host' missing.
**** v1    0.2 CLI RX|Running VCC-compiler failed, exited with 2
**** v1    0.2 CLI RX|VCL compilation failed
**   v1    0.2 VCL compilation failed (as expected)
***  v1    0.2 Found expected string: ("Mandatory field 'host' missing.")
*    top   0.2 RESETTING after ../../../bin/varnishtest/tests/v00038.vtc
**   v1    0.2 Wait
**** v1    0.2 CLI TX|backend.list
***  v1    0.2 CLI RX  101
**** v1    0.2 CLI RX|Unknown request in manager process (child not running).
**** v1    0.2 CLI RX|Type 'help' for more info.
**   v1    0.2 Stop
**** v1    0.2 CLI TX|stop
***  v1    0.2 CLI RX  300
**** v1    0.2 CLI RX|Child in state stopped
**** v1    0.2 CLI TX|status
***  v1    0.2 CLI RX  200
**** v1    0.2 CLI RX|Child in state stopped
**** v1    0.2 STDOUT poll 0x10
**   v1    0.2 R 8490 Status: 0000 (u 0.005000 s 0.031000)
*    diag  0.0 ............................................................
#    top  TEST ../../../bin/varnishtest/tests/v00038.vtc TIMED OUT (kill -9)
#    top  TEST ../../../bin/varnishtest/tests/v00038.vtc FAILED (60.002) signal=9

1 @ SunOS 5.11 i86pc 1.04 64_gcc4.7 uplex

*    top   0.0 TEST ../../../bin/varnishtest/tests/v00038.vtc starting
[...]
*    top   0.0 TEST VCL compiler coverage test: vcc_backend.c
[...]
**** v1    0.2 CLI RX|
**** v1    0.2 CLI RX|Running VCC-compiler failed, exited with 2
**** v1    0.2 CLI RX|VCL compilation failed
**   v1    0.2 VCL compilation failed (as expected)
***  v1    0.2 Found expected string: ("Unknown field:")
**   top   0.2 === varnish v1 -errvcl "Mandatory field 'host' missing." {
**** v1    0.2 CLI TX|vcl.inline vcl12 << %XJEIFLH|)Xspa8P
**** v1    0.2 CLI TX|vcl 4.0;
**** v1    0.2 CLI TX|
**** v1    0.2 CLI TX|\tbackend b1 {
**** v1    0.2 CLI TX|\t\t.port = "NONE";
**** v1    0.2 CLI TX|\t}
**** v1    0.2 CLI TX|
**** v1    0.2 CLI TX|%XJEIFLH|)Xspa8P
***  v1    0.2 CLI RX  106
**** v1    0.2 CLI RX|Message from VCC-compiler:
**** v1    0.2 CLI RX|Security: Privilege proc_setid missing, will not change uid/gid
**** v1    0.2 CLI RX|Mandatory field 'host' missing.
**** v1    0.2 CLI RX|Running VCC-compiler failed, exited with 2
**** v1    0.2 CLI RX|VCL compilation failed
**   v1    0.2 VCL compilation failed (as expected)
***  v1    0.2 Found expected string: ("Mandatory field 'host' missing.")
*    top   0.2 RESETTING after ../../../bin/varnishtest/tests/v00038.vtc
**   v1    0.2 Wait
**** v1    0.2 CLI TX|backend.list
***  v1    0.2 CLI RX  101
**** v1    0.2 CLI RX|Unknown request in manager process (child not running).
**** v1    0.2 CLI RX|Type 'help' for more info.
**   v1    0.2 Stop
**** v1    0.2 CLI TX|stop
***  v1    0.2 CLI RX  300
**** v1    0.2 CLI RX|Child in state stopped
**** v1    0.2 CLI TX|status
***  v1    0.2 CLI RX  200
**** v1    0.2 CLI RX|Child in state stopped
**** v1    0.2 STDOUT poll 0x10
**   v1    0.2 R 56485 Status: 0000 (u 0.017000 s 0.059000)
*    diag  0.0 ............................................................
#    top  TEST ../../../bin/varnishtest/tests/v00038.vtc TIMED OUT (kill -9)
#    top  TEST ../../../bin/varnishtest/tests/v00038.vtc FAILED (60.004) signal=9

1 @ SunOS 5.11 i86pc 1.04 64_sun12.4 uplex

*    top   0.0 TEST ../../../bin/varnishtest/tests/v00038.vtc starting
[...]
*    top   0.0 TEST VCL compiler coverage test: vcc_backend.c
[...]
**** v1    0.2 CLI RX|
**** v1    0.2 CLI RX|Running VCC-compiler failed, exited with 2
**** v1    0.2 CLI RX|VCL compilation failed
**   v1    0.2 VCL compilation failed (as expected)
***  v1    0.2 Found expected string: ("Unknown field:")
**   top   0.2 === varnish v1 -errvcl "Mandatory field 'host' missing." {
**** v1    0.2 CLI TX|vcl.inline vcl12 << %XJEIFLH|)Xspa8P
**** v1    0.2 CLI TX|vcl 4.0;
**** v1    0.2 CLI TX|
**** v1    0.2 CLI TX|\tbackend b1 {
**** v1    0.2 CLI TX|\t\t.port = "NONE";
**** v1    0.2 CLI TX|\t}
**** v1    0.2 CLI TX|
**** v1    0.2 CLI TX|%XJEIFLH|)Xspa8P
***  v1    0.2 CLI RX  106
**** v1    0.2 CLI RX|Message from VCC-compiler:
**** v1    0.2 CLI RX|Security: Privilege proc_setid missing, will not change uid/gid
**** v1    0.2 CLI RX|Mandatory field 'host' missing.
**** v1    0.2 CLI RX|Running VCC-compiler failed, exited with 2
**** v1    0.2 CLI RX|VCL compilation failed
**   v1    0.2 VCL compilation failed (as expected)
***  v1    0.2 Found expected string: ("Mandatory field 'host' missing.")
*    top   0.2 RESETTING after ../../../bin/varnishtest/tests/v00038.vtc
**   v1    0.2 Wait
**** v1    0.2 CLI TX|backend.list
***  v1    0.2 CLI RX  101
**** v1    0.2 CLI RX|Unknown request in manager process (child not running).
**** v1    0.2 CLI RX|Type 'help' for more info.
**   v1    0.2 Stop
**** v1    0.2 CLI TX|stop
***  v1    0.2 CLI RX  300
**** v1    0.2 CLI RX|Child in state stopped
**** v1    0.2 CLI TX|status
***  v1    0.2 CLI RX  200
**** v1    0.2 CLI RX|Child in state stopped
**** v1    0.2 STDOUT poll 0x10
**   v1    0.2 R 21530 Status: 0000 (u 0.022000 s 0.059000)
*    diag  0.0 ............................................................
#    top  TEST ../../../bin/varnishtest/tests/v00038.vtc TIMED OUT (kill -9)
#    top  TEST ../../../bin/varnishtest/tests/v00038.vtc FAILED (60.003) signal=9

1 @ SunOS 5.11 i86pc 1.04 32_gcc4.7 uplex

*    top   0.0 TEST ../../../bin/varnishtest/tests/v00038.vtc starting
[...]
*    top   0.0 TEST VCL compiler coverage test: vcc_backend.c
[...]
**** v1    0.2 CLI RX|
**** v1    0.2 CLI RX|Running VCC-compiler failed, exited with 2
**** v1    0.2 CLI RX|VCL compilation failed
**   v1    0.2 VCL compilation failed (as expected)
***  v1    0.2 Found expected string: ("Unknown field:")
**   top   0.2 === varnish v1 -errvcl "Mandatory field 'host' missing." {
**** v1    0.2 CLI TX|vcl.inline vcl12 << %XJEIFLH|)Xspa8P
**** v1    0.2 CLI TX|vcl 4.0;
**** v1    0.2 CLI TX|
**** v1    0.2 CLI TX|\tbackend b1 {
**** v1    0.2 CLI TX|\t\t.port = "NONE";
**** v1    0.2 CLI TX|\t}
**** v1    0.2 CLI TX|
**** v1    0.2 CLI TX|%XJEIFLH|)Xspa8P
***  v1    0.2 CLI RX  106
**** v1    0.2 CLI RX|Message from VCC-compiler:
**** v1    0.2 CLI RX|Security: Privilege proc_setid missing, will not change uid/gid
**** v1    0.2 CLI RX|Mandatory field 'host' missing.
**** v1    0.2 CLI RX|Running VCC-compiler failed, exited with 2
**** v1    0.2 CLI RX|VCL compilation failed
**   v1    0.2 VCL compilation failed (as expected)
***  v1    0.2 Found expected string: ("Mandatory field 'host' missing.")
*    top   0.2 RESETTING after ../../../bin/varnishtest/tests/v00038.vtc
**   v1    0.2 Wait
**** v1    0.2 CLI TX|backend.list
***  v1    0.2 CLI RX  101
**** v1    0.2 CLI RX|Unknown request in manager process (child not running).
**** v1    0.2 CLI RX|Type 'help' for more info.
**   v1    0.2 Stop
**** v1    0.2 CLI TX|stop
***  v1    0.2 CLI RX  300
**** v1    0.2 CLI RX|Child in state stopped
**** v1    0.2 CLI TX|status
***  v1    0.2 CLI RX  200
**** v1    0.2 CLI RX|Child in state stopped
**** v1    0.2 STDOUT poll 0x10
**   v1    0.2 R 15081 Status: 0000 (u 0.005000 s 0.031000)
*    diag  0.0 ............................................................
#    top  TEST ../../../bin/varnishtest/tests/v00038.vtc TIMED OUT (kill -9)
#    top  TEST ../../../bin/varnishtest/tests/v00038.vtc FAILED (60.002) signal=9

1 @ SunOS 5.11 i86pc 1.04 64_gcc4.7 uplex

*    top   0.0 TEST ../../../bin/varnishtest/tests/v00038.vtc starting
[...]
*    top   0.0 TEST VCL compiler coverage test: vcc_backend.c
[...]
**** v1    0.2 CLI RX|
**** v1    0.2 CLI RX|Running VCC-compiler failed, exited with 2
**** v1    0.2 CLI RX|VCL compilation failed
**   v1    0.2 VCL compilation failed (as expected)
***  v1    0.2 Found expected string: ("Unknown field:")
**   top   0.2 === varnish v1 -errvcl "Mandatory field 'host' missing." {
**** v1    0.2 CLI TX|vcl.inline vcl12 << %XJEIFLH|)Xspa8P
**** v1    0.2 CLI TX|vcl 4.0;
**** v1    0.2 CLI TX|
**** v1    0.2 CLI TX|\tbackend b1 {
**** v1    0.2 CLI TX|\t\t.port = "NONE";
**** v1    0.2 CLI TX|\t}
**** v1    0.2 CLI TX|
**** v1    0.2 CLI TX|%XJEIFLH|)Xspa8P
***  v1    0.2 CLI RX  106
**** v1    0.2 CLI RX|Message from VCC-compiler:
**** v1    0.2 CLI RX|Security: Privilege proc_setid missing, will not change uid/gid
**** v1    0.2 CLI RX|Mandatory field 'host' missing.
**** v1    0.2 CLI RX|Running VCC-compiler failed, exited with 2
**** v1    0.2 CLI RX|VCL compilation failed
**   v1    0.2 VCL compilation failed (as expected)
***  v1    0.2 Found expected string: ("Mandatory field 'host' missing.")
*    top   0.2 RESETTING after ../../../bin/varnishtest/tests/v00038.vtc
**   v1    0.2 Wait
**** v1    0.2 CLI TX|backend.list
***  v1    0.2 CLI RX  101
**** v1    0.2 CLI RX|Unknown request in manager process (child not running).
**** v1    0.2 CLI RX|Type 'help' for more info.
**   v1    0.2 Stop
**** v1    0.2 CLI TX|stop
***  v1    0.2 CLI RX  300
**** v1    0.2 CLI RX|Child in state stopped
**** v1    0.2 CLI TX|status
***  v1    0.2 CLI RX  200
**** v1    0.2 CLI RX|Child in state stopped
**** v1    0.2 STDOUT poll 0x10
**   v1    0.2 R 31535 Status: 0000 (u 0.016000 s 0.057000)
*    diag  0.0 ............................................................
#    top  TEST ../../../bin/varnishtest/tests/v00038.vtc TIMED OUT (kill -9)
#    top  TEST ../../../bin/varnishtest/tests/v00038.vtc FAILED (60.004) signal=9

1 @ SunOS 5.11 i86pc 1.04 64_sun12.4 uplex

*    top   0.0 TEST ../../../bin/varnishtest/tests/v00038.vtc starting
[...]
*    top   0.0 TEST VCL compiler coverage test: vcc_backend.c
[...]
**** v1    0.2 CLI RX|
**** v1    0.2 CLI RX|Running VCC-compiler failed, exited with 2
**** v1    0.2 CLI RX|VCL compilation failed
**   v1    0.2 VCL compilation failed (as expected)
***  v1    0.2 Found expected string: ("Unknown field:")
**   top   0.2 === varnish v1 -errvcl "Mandatory field 'host' missing." {
**** v1    0.2 CLI TX|vcl.inline vcl12 << %XJEIFLH|)Xspa8P
**** v1    0.2 CLI TX|vcl 4.0;
**** v1    0.2 CLI TX|
**** v1    0.2 CLI TX|\tbackend b1 {
**** v1    0.2 CLI TX|\t\t.port = "NONE";
**** v1    0.2 CLI TX|\t}
**** v1    0.2 CLI TX|
**** v1    0.2 CLI TX|%XJEIFLH|)Xspa8P
***  v1    0.2 CLI RX  106
**** v1    0.2 CLI RX|Message from VCC-compiler:
**** v1    0.2 CLI RX|Security: Privilege proc_setid missing, will not change uid/gid
**** v1    0.2 CLI RX|Mandatory field 'host' missing.
**** v1    0.2 CLI RX|Running VCC-compiler failed, exited with 2
**** v1    0.2 CLI RX|VCL compilation failed
**   v1    0.2 VCL compilation failed (as expected)
***  v1    0.2 Found expected string: ("Mandatory field 'host' missing.")
*    top   0.2 RESETTING after ../../../bin/varnishtest/tests/v00038.vtc
**   v1    0.2 Wait
**** v1    0.2 CLI TX|backend.list
***  v1    0.2 CLI RX  101
**** v1    0.2 CLI RX|Unknown request in manager process (child not running).
**** v1    0.2 CLI RX|Type 'help' for more info.
**   v1    0.2 Stop
**** v1    0.2 CLI TX|stop
***  v1    0.2 CLI RX  300
**** v1    0.2 CLI RX|Child in state stopped
**** v1    0.2 CLI TX|status
***  v1    0.2 CLI RX  200
**** v1    0.2 CLI RX|Child in state stopped
**** v1    0.2 STDOUT poll 0x10
**   v1    0.2 R 14580 Status: 0000 (u 0.027000 s 0.088000)
*    diag  0.0 ............................................................
#    top  TEST ../../../bin/varnishtest/tests/v00038.vtc TIMED OUT (kill -9)
#    top  TEST ../../../bin/varnishtest/tests/v00038.vtc FAILED (60.004) signal=9

1 @ SunOS 5.11 i86pc 1.04 32_gcc4.7 uplex

*    top   0.0 TEST ../../../bin/varnishtest/tests/v00038.vtc starting
[...]
*    top   0.0 TEST VCL compiler coverage test: vcc_backend.c
[...]
**** v1    0.2 CLI RX|
**** v1    0.2 CLI RX|Running VCC-compiler failed, exited with 2
**** v1    0.2 CLI RX|VCL compilation failed
**   v1    0.2 VCL compilation failed (as expected)
***  v1    0.2 Found expected string: ("Unknown field:")
**   top   0.2 === varnish v1 -errvcl "Mandatory field 'host' missing." {
**** v1    0.2 CLI TX|vcl.inline vcl12 << %XJEIFLH|)Xspa8P
**** v1    0.2 CLI TX|vcl 4.0;
**** v1    0.2 CLI TX|
**** v1    0.2 CLI TX|\tbackend b1 {
**** v1    0.2 CLI TX|\t\t.port = "NONE";
**** v1    0.2 CLI TX|\t}
**** v1    0.2 CLI TX|
**** v1    0.2 CLI TX|%XJEIFLH|)Xspa8P
***  v1    0.2 CLI RX  106
**** v1    0.2 CLI RX|Message from VCC-compiler:
**** v1    0.2 CLI RX|Security: Privilege proc_setid missing, will not change uid/gid
**** v1    0.2 CLI RX|Mandatory field 'host' missing.
**** v1    0.2 CLI RX|Running VCC-compiler failed, exited with 2
**** v1    0.2 CLI RX|VCL compilation failed
**   v1    0.2 VCL compilation failed (as expected)
***  v1    0.2 Found expected string: ("Mandatory field 'host' missing.")
*    top   0.2 RESETTING after ../../../bin/varnishtest/tests/v00038.vtc
**   v1    0.2 Wait
**** v1    0.2 CLI TX|backend.list
***  v1    0.2 CLI RX  101
**** v1    0.2 CLI RX|Unknown request in manager process (child not running).
**** v1    0.2 CLI RX|Type 'help' for more info.
**   v1    0.2 Stop
**** v1    0.2 CLI TX|stop
***  v1    0.2 CLI RX  300
**** v1    0.2 CLI RX|Child in state stopped
**** v1    0.2 CLI TX|status
***  v1    0.2 CLI RX  200
**** v1    0.2 CLI RX|Child in state stopped
**** v1    0.2 STDOUT poll 0x10
**   v1    0.2 R 63049 Status: 0000 (u 0.005000 s 0.032000)
*    diag  0.0 ............................................................
#    top  TEST ../../../bin/varnishtest/tests/v00038.vtc TIMED OUT (kill -9)
#    top  TEST ../../../bin/varnishtest/tests/v00038.vtc FAILED (60.002) signal=9

1 @ SunOS 5.11 i86pc 1.04 32_gcc4.7 uplex

*    top   0.0 TEST ../../../bin/varnishtest/tests/v00038.vtc starting
[...]
*    top   0.0 TEST VCL compiler coverage test: vcc_backend.c
[...]
**** v1    0.2 CLI RX|
**** v1    0.2 CLI RX|Running VCC-compiler failed, exited with 2
**** v1    0.2 CLI RX|VCL compilation failed
**   v1    0.2 VCL compilation failed (as expected)
***  v1    0.2 Found expected string: ("Unknown field:")
**   top   0.2 === varnish v1 -errvcl "Mandatory field 'host' missing." {
**** v1    0.2 CLI TX|vcl.inline vcl12 << %XJEIFLH|)Xspa8P
**** v1    0.2 CLI TX|vcl 4.0;
**** v1    0.2 CLI TX|
**** v1    0.2 CLI TX|\tbackend b1 {
**** v1    0.2 CLI TX|\t\t.port = "NONE";
**** v1    0.2 CLI TX|\t}
**** v1    0.2 CLI TX|
**** v1    0.2 CLI TX|%XJEIFLH|)Xspa8P
***  v1    0.2 CLI RX  106
**** v1    0.2 CLI RX|Message from VCC-compiler:
**** v1    0.2 CLI RX|Security: Privilege proc_setid missing, will not change uid/gid
**** v1    0.2 CLI RX|Mandatory field 'host' missing.
**** v1    0.2 CLI RX|Running VCC-compiler failed, exited with 2
**** v1    0.2 CLI RX|VCL compilation failed
**   v1    0.2 VCL compilation failed (as expected)
***  v1    0.2 Found expected string: ("Mandatory field 'host' missing.")
*    top   0.2 RESETTING after ../../../bin/varnishtest/tests/v00038.vtc
**   v1    0.2 Wait
**** v1    0.2 CLI TX|backend.list
***  v1    0.2 CLI RX  101
**** v1    0.2 CLI RX|Unknown request in manager process (child not running).
**** v1    0.2 CLI RX|Type 'help' for more info.
**   v1    0.2 Stop
**** v1    0.2 CLI TX|stop
***  v1    0.2 CLI RX  300
**** v1    0.2 CLI RX|Child in state stopped
**** v1    0.2 CLI TX|status
***  v1    0.2 CLI RX  200
**** v1    0.2 CLI RX|Child in state stopped
**** v1    0.2 STDOUT poll 0x10
**   v1    0.2 R 42649 Status: 0000 (u 0.005000 s 0.034000)
*    diag  0.0 ............................................................
#    top  TEST ../../../bin/varnishtest/tests/v00038.vtc TIMED OUT (kill -9)
#    top  TEST ../../../bin/varnishtest/tests/v00038.vtc FAILED (60.002) signal=9

1 @ SunOS 5.11 i86pc 1.04 64_sun12.4 uplex

*    top   0.0 TEST ../../../bin/varnishtest/tests/v00038.vtc starting
[...]
*    top   0.0 TEST VCL compiler coverage test: vcc_backend.c
[...]
**** v1    0.2 CLI RX|
**** v1    0.2 CLI RX|Running VCC-compiler failed, exited with 2
**** v1    0.2 CLI RX|VCL compilation failed
**   v1    0.2 VCL compilation failed (as expected)
***  v1    0.2 Found expected string: ("Unknown field:")
**   top   0.2 === varnish v1 -errvcl "Mandatory field 'host' missing." {
**** v1    0.2 CLI TX|vcl.inline vcl12 << %XJEIFLH|)Xspa8P
**** v1    0.2 CLI TX|vcl 4.0;
**** v1    0.2 CLI TX|
**** v1    0.2 CLI TX|\tbackend b1 {
**** v1    0.2 CLI TX|\t\t.port = "NONE";
**** v1    0.2 CLI TX|\t}
**** v1    0.2 CLI TX|
**** v1    0.2 CLI TX|%XJEIFLH|)Xspa8P
***  v1    0.2 CLI RX  106
**** v1    0.2 CLI RX|Message from VCC-compiler:
**** v1    0.2 CLI RX|Security: Privilege proc_setid missing, will not change uid/gid
**** v1    0.2 CLI RX|Mandatory field 'host' missing.
**** v1    0.2 CLI RX|Running VCC-compiler failed, exited with 2
**** v1    0.2 CLI RX|VCL compilation failed
**   v1    0.2 VCL compilation failed (as expected)
***  v1    0.2 Found expected string: ("Mandatory field 'host' missing.")
*    top   0.2 RESETTING after ../../../bin/varnishtest/tests/v00038.vtc
**   v1    0.2 Wait
**** v1    0.2 CLI TX|backend.list
***  v1    0.2 CLI RX  101
**** v1    0.2 CLI RX|Unknown request in manager process (child not running).
**** v1    0.2 CLI RX|Type 'help' for more info.
**   v1    0.2 Stop
**** v1    0.2 CLI TX|stop
***  v1    0.2 CLI RX  300
**** v1    0.2 CLI RX|Child in state stopped
**** v1    0.2 CLI TX|status
***  v1    0.2 CLI RX  200
**** v1    0.2 CLI RX|Child in state stopped
**** v1    0.2 STDOUT poll 0x10
**   v1    0.2 R 32011 Status: 0000 (u 0.021000 s 0.061000)
*    diag  0.0 ............................................................
#    top  TEST ../../../bin/varnishtest/tests/v00038.vtc TIMED OUT (kill -9)
#    top  TEST ../../../bin/varnishtest/tests/v00038.vtc FAILED (60.004) signal=9

1 @ SunOS 5.11 i86pc 1.04 64_sun12.4 uplex

*    top   0.0 TEST ../../../bin/varnishtest/tests/v00038.vtc starting
[...]
*    top   0.0 TEST VCL compiler coverage test: vcc_backend.c
[...]
**** v1    0.2 CLI RX|
**** v1    0.2 CLI RX|Running VCC-compiler failed, exited with 2
**** v1    0.2 CLI RX|VCL compilation failed
**   v1    0.2 VCL compilation failed (as expected)
***  v1    0.2 Found expected string: ("Unknown field:")
**   top   0.2 === varnish v1 -errvcl "Mandatory field 'host' missing." {
**** v1    0.2 CLI TX|vcl.inline vcl12 << %XJEIFLH|)Xspa8P
**** v1    0.2 CLI TX|vcl 4.0;
**** v1    0.2 CLI TX|
**** v1    0.2 CLI TX|\tbackend b1 {
**** v1    0.2 CLI TX|\t\t.port = "NONE";
**** v1    0.2 CLI TX|\t}
**** v1    0.2 CLI TX|
**** v1    0.2 CLI TX|%XJEIFLH|)Xspa8P
***  v1    0.2 CLI RX  106
**** v1    0.2 CLI RX|Message from VCC-compiler:
**** v1    0.2 CLI RX|Security: Privilege proc_setid missing, will not change uid/gid
**** v1    0.2 CLI RX|Mandatory field 'host' missing.
**** v1    0.2 CLI RX|Running VCC-compiler failed, exited with 2
**** v1    0.2 CLI RX|VCL compilation failed
**   v1    0.2 VCL compilation failed (as expected)
***  v1    0.2 Found expected string: ("Mandatory field 'host' missing.")
*    top   0.2 RESETTING after ../../../bin/varnishtest/tests/v00038.vtc
**   v1    0.2 Wait
**** v1    0.2 CLI TX|backend.list
***  v1    0.2 CLI RX  101
**** v1    0.2 CLI RX|Unknown request in manager process (child not running).
**** v1    0.2 CLI RX|Type 'help' for more info.
**   v1    0.2 Stop
**** v1    0.2 CLI TX|stop
***  v1    0.2 CLI RX  300
**** v1    0.2 CLI RX|Child in state stopped
**** v1    0.2 CLI TX|status
***  v1    0.2 CLI RX  200
**** v1    0.2 CLI RX|Child in state stopped
**** v1    0.2 STDOUT poll 0x10
**   v1    0.2 R 2763 Status: 0000 (u 0.022000 s 0.057000)
*    diag  0.0 ............................................................
#    top  TEST ../../../bin/varnishtest/tests/v00038.vtc TIMED OUT (kill -9)
#    top  TEST ../../../bin/varnishtest/tests/v00038.vtc FAILED (60.004) signal=9

1 @ SunOS 5.11 i86pc 1.04 32_sun12.4 uplex

*    top   0.0 TEST ../../../bin/varnishtest/tests/v00038.vtc starting
[...]
*    top   0.0 TEST VCL compiler coverage test: vcc_backend.c
[...]
**** v1    0.2 CLI RX|
**** v1    0.2 CLI RX|Running VCC-compiler failed, exited with 2
**** v1    0.2 CLI RX|VCL compilation failed
**   v1    0.2 VCL compilation failed (as expected)
***  v1    0.2 Found expected string: ("Unknown field:")
**   top   0.2 === varnish v1 -errvcl "Mandatory field 'host' missing." {
**** v1    0.2 CLI TX|vcl.inline vcl12 << %XJEIFLH|)Xspa8P
**** v1    0.2 CLI TX|vcl 4.0;
**** v1    0.2 CLI TX|
**** v1    0.2 CLI TX|\tbackend b1 {
**** v1    0.2 CLI TX|\t\t.port = "NONE";
**** v1    0.2 CLI TX|\t}
**** v1    0.2 CLI TX|
**** v1    0.2 CLI TX|%XJEIFLH|)Xspa8P
***  v1    0.2 CLI RX  106
**** v1    0.2 CLI RX|Message from VCC-compiler:
**** v1    0.2 CLI RX|Security: Privilege proc_setid missing, will not change uid/gid
**** v1    0.2 CLI RX|Mandatory field 'host' missing.
**** v1    0.2 CLI RX|Running VCC-compiler failed, exited with 2
**** v1    0.2 CLI RX|VCL compilation failed
**   v1    0.2 VCL compilation failed (as expected)
***  v1    0.2 Found expected string: ("Mandatory field 'host' missing.")
*    top   0.2 RESETTING after ../../../bin/varnishtest/tests/v00038.vtc
**   v1    0.2 Wait
**** v1    0.2 CLI TX|backend.list
***  v1    0.2 CLI RX  101
**** v1    0.2 CLI RX|Unknown request in manager process (child not running).
**** v1    0.2 CLI RX|Type 'help' for more info.
**   v1    0.2 Stop
**** v1    0.2 CLI TX|stop
***  v1    0.2 CLI RX  300
**** v1    0.2 CLI RX|Child in state stopped
**** v1    0.2 CLI TX|status
***  v1    0.2 CLI RX  200
**** v1    0.2 CLI RX|Child in state stopped
**** v1    0.2 STDOUT poll 0x10
**   v1    0.2 R 80467 Status: 0000 (u 0.005000 s 0.032000)
*    diag  0.0 ............................................................
#    top  TEST ../../../bin/varnishtest/tests/v00038.vtc TIMED OUT (kill -9)
#    top  TEST ../../../bin/varnishtest/tests/v00038.vtc FAILED (60.002) signal=9

1 @ SunOS 5.11 i86pc 1.04 64_sun12.4 uplex

*    top   0.0 TEST ../../../bin/varnishtest/tests/v00038.vtc starting
[...]
*    top   0.0 TEST VCL compiler coverage test: vcc_backend.c
[...]
**** v1    0.2 CLI RX|
**** v1    0.2 CLI RX|Running VCC-compiler failed, exited with 2
**** v1    0.2 CLI RX|VCL compilation failed
**   v1    0.2 VCL compilation failed (as expected)
***  v1    0.2 Found expected string: ("Unknown field:")
**   top   0.2 === varnish v1 -errvcl "Mandatory field 'host' missing." {
**** v1    0.2 CLI TX|vcl.inline vcl12 << %XJEIFLH|)Xspa8P
**** v1    0.2 CLI TX|vcl 4.0;
**** v1    0.2 CLI TX|
**** v1    0.2 CLI TX|\tbackend b1 {
**** v1    0.2 CLI TX|\t\t.port = "NONE";
**** v1    0.2 CLI TX|\t}
**** v1    0.2 CLI TX|
**** v1    0.2 CLI TX|%XJEIFLH|)Xspa8P
***  v1    0.2 CLI RX  106
**** v1    0.2 CLI RX|Message from VCC-compiler:
**** v1    0.2 CLI RX|Security: Privilege proc_setid missing, will not change uid/gid
**** v1    0.2 CLI RX|Mandatory field 'host' missing.
**** v1    0.2 CLI RX|Running VCC-compiler failed, exited with 2
**** v1    0.2 CLI RX|VCL compilation failed
**   v1    0.2 VCL compilation failed (as expected)
***  v1    0.2 Found expected string: ("Mandatory field 'host' missing.")
*    top   0.2 RESETTING after ../../../bin/varnishtest/tests/v00038.vtc
**   v1    0.2 Wait
**** v1    0.2 CLI TX|backend.list
***  v1    0.2 CLI RX  101
**** v1    0.2 CLI RX|Unknown request in manager process (child not running).
**** v1    0.2 CLI RX|Type 'help' for more info.
**   v1    0.2 Stop
**** v1    0.2 CLI TX|stop
***  v1    0.2 CLI RX  300
**** v1    0.2 CLI RX|Child in state stopped
**** v1    0.2 CLI TX|status
***  v1    0.2 CLI RX  200
**** v1    0.2 CLI RX|Child in state stopped
**** v1    0.2 STDOUT poll 0x10
**   v1    0.2 R 93841 Status: 0000 (u 0.020000 s 0.058000)
*    diag  0.0 ............................................................
#    top  TEST ../../../bin/varnishtest/tests/v00038.vtc TIMED OUT (kill -9)
#    top  TEST ../../../bin/varnishtest/tests/v00038.vtc FAILED (60.003) signal=9

1 @ SunOS 5.11 i86pc 1.04 32_sun12.4 uplex

*    top   0.0 TEST ../../../bin/varnishtest/tests/v00038.vtc starting
[...]
*    top   0.0 TEST VCL compiler coverage test: vcc_backend.c
[...]
**** v1    0.2 CLI RX|
**** v1    0.2 CLI RX|Running VCC-compiler failed, exited with 2
**** v1    0.2 CLI RX|VCL compilation failed
**   v1    0.2 VCL compilation failed (as expected)
***  v1    0.2 Found expected string: ("Unknown field:")
**   top   0.2 === varnish v1 -errvcl "Mandatory field 'host' missing." {
**** v1    0.2 CLI TX|vcl.inline vcl12 << %XJEIFLH|)Xspa8P
**** v1    0.2 CLI TX|vcl 4.0;
**** v1    0.2 CLI TX|
**** v1    0.2 CLI TX|\tbackend b1 {
**** v1    0.2 CLI TX|\t\t.port = "NONE";
**** v1    0.2 CLI TX|\t}
**** v1    0.2 CLI TX|
**** v1    0.2 CLI TX|%XJEIFLH|)Xspa8P
***  v1    0.2 CLI RX  106
**** v1    0.2 CLI RX|Message from VCC-compiler:
**** v1    0.2 CLI RX|Security: Privilege proc_setid missing, will not change uid/gid
**** v1    0.2 CLI RX|Mandatory field 'host' missing.
**** v1    0.2 CLI RX|Running VCC-compiler failed, exited with 2
**** v1    0.2 CLI RX|VCL compilation failed
**   v1    0.2 VCL compilation failed (as expected)
***  v1    0.2 Found expected string: ("Mandatory field 'host' missing.")
*    top   0.2 RESETTING after ../../../bin/varnishtest/tests/v00038.vtc
**   v1    0.2 Wait
**** v1    0.2 CLI TX|backend.list
***  v1    0.2 CLI RX  101
**** v1    0.2 CLI RX|Unknown request in manager process (child not running).
**** v1    0.2 CLI RX|Type 'help' for more info.
**   v1    0.2 Stop
**** v1    0.2 CLI TX|stop
***  v1    0.2 CLI RX  300
**** v1    0.2 CLI RX|Child in state stopped
**** v1    0.2 CLI TX|status
***  v1    0.2 CLI RX  200
**** v1    0.2 CLI RX|Child in state stopped
**** v1    0.2 STDOUT poll 0x10
**   v1    0.2 R 66769 Status: 0000 (u 0.005000 s 0.032000)
*    diag  0.0 ............................................................
#    top  TEST ../../../bin/varnishtest/tests/v00038.vtc TIMED OUT (kill -9)
#    top  TEST ../../../bin/varnishtest/tests/v00038.vtc FAILED (60.002) signal=9

1 @ SunOS 5.11 i86pc 1.04 32_sun12.4 uplex

*    top   0.0 TEST ../../../bin/varnishtest/tests/v00038.vtc starting
[...]
*    top   0.0 TEST VCL compiler coverage test: vcc_backend.c
[...]
**** v1    0.2 CLI RX|
**** v1    0.2 CLI RX|Running VCC-compiler failed, exited with 2
**** v1    0.2 CLI RX|VCL compilation failed
**   v1    0.2 VCL compilation failed (as expected)
***  v1    0.2 Found expected string: ("Unknown field:")
**   top   0.2 === varnish v1 -errvcl "Mandatory field 'host' missing." {
**** v1    0.2 CLI TX|vcl.inline vcl12 << %XJEIFLH|)Xspa8P
**** v1    0.2 CLI TX|vcl 4.0;
**** v1    0.2 CLI TX|
**** v1    0.2 CLI TX|\tbackend b1 {
**** v1    0.2 CLI TX|\t\t.port = "NONE";
**** v1    0.2 CLI TX|\t}
**** v1    0.2 CLI TX|
**** v1    0.2 CLI TX|%XJEIFLH|)Xspa8P
***  v1    0.2 CLI RX  106
**** v1    0.2 CLI RX|Message from VCC-compiler:
**** v1    0.2 CLI RX|Security: Privilege proc_setid missing, will not change uid/gid
**** v1    0.2 CLI RX|Mandatory field 'host' missing.
**** v1    0.2 CLI RX|Running VCC-compiler failed, exited with 2
**** v1    0.2 CLI RX|VCL compilation failed
**   v1    0.2 VCL compilation failed (as expected)
***  v1    0.2 Found expected string: ("Mandatory field 'host' missing.")
*    top   0.2 RESETTING after ../../../bin/varnishtest/tests/v00038.vtc
**   v1    0.2 Wait
**** v1    0.2 CLI TX|backend.list
***  v1    0.2 CLI RX  101
**** v1    0.2 CLI RX|Unknown request in manager process (child not running).
**** v1    0.2 CLI RX|Type 'help' for more info.
**   v1    0.2 Stop
**** v1    0.2 CLI TX|stop
***  v1    0.2 CLI RX  300
**** v1    0.2 CLI RX|Child in state stopped
**** v1    0.2 CLI TX|status
***  v1    0.2 CLI RX  200
**** v1    0.2 CLI RX|Child in state stopped
**** v1    0.2 STDOUT poll 0x10
**   v1    0.2 R 74025 Status: 0000 (u 0.006000 s 0.038000)
*    diag  0.0 ............................................................
#    top  TEST ../../../bin/varnishtest/tests/v00038.vtc TIMED OUT (kill -9)
#    top  TEST ../../../bin/varnishtest/tests/v00038.vtc FAILED (60.002) signal=9

1 @ SunOS 5.11 i86pc 1.04 64_sun12.4 uplex

*    top   0.0 TEST ../../../bin/varnishtest/tests/v00038.vtc starting
[...]
*    top   0.0 TEST VCL compiler coverage test: vcc_backend.c
[...]
**** v1    0.2 CLI RX|
**** v1    0.2 CLI RX|Running VCC-compiler failed, exited with 2
**** v1    0.2 CLI RX|VCL compilation failed
**   v1    0.2 VCL compilation failed (as expected)
***  v1    0.2 Found expected string: ("Unknown field:")
**   top   0.2 === varnish v1 -errvcl "Mandatory field 'host' missing." {
**** v1    0.2 CLI TX|vcl.inline vcl12 << %XJEIFLH|)Xspa8P
**** v1    0.2 CLI TX|vcl 4.0;
**** v1    0.2 CLI TX|
**** v1    0.2 CLI TX|\tbackend b1 {
**** v1    0.2 CLI TX|\t\t.port = "NONE";
**** v1    0.2 CLI TX|\t}
**** v1    0.2 CLI TX|
**** v1    0.2 CLI TX|%XJEIFLH|)Xspa8P
***  v1    0.2 CLI RX  106
**** v1    0.2 CLI RX|Message from VCC-compiler:
**** v1    0.2 CLI RX|Security: Privilege proc_setid missing, will not change uid/gid
**** v1    0.2 CLI RX|Mandatory field 'host' missing.
**** v1    0.2 CLI RX|Running VCC-compiler failed, exited with 2
**** v1    0.2 CLI RX|VCL compilation failed
**   v1    0.2 VCL compilation failed (as expected)
***  v1    0.2 Found expected string: ("Mandatory field 'host' missing.")
*    top   0.2 RESETTING after ../../../bin/varnishtest/tests/v00038.vtc
**   v1    0.2 Wait
**** v1    0.2 CLI TX|backend.list
***  v1    0.2 CLI RX  101
**** v1    0.2 CLI RX|Unknown request in manager process (child not running).
**** v1    0.2 CLI RX|Type 'help' for more info.
**   v1    0.2 Stop
**** v1    0.2 CLI TX|stop
***  v1    0.2 CLI RX  300
**** v1    0.2 CLI RX|Child in state stopped
**** v1    0.2 CLI TX|status
***  v1    0.2 CLI RX  200
**** v1    0.2 CLI RX|Child in state stopped
**** v1    0.2 STDOUT poll 0x10
**   v1    0.2 R 37594 Status: 0000 (u 0.026000 s 0.086000)
*    diag  0.0 ............................................................
#    top  TEST ../../../bin/varnishtest/tests/v00038.vtc TIMED OUT (kill -9)
#    top  TEST ../../../bin/varnishtest/tests/v00038.vtc FAILED (60.005) signal=9

1 @ SunOS 5.11 i86pc 1.04 32_gcc4.7 uplex

*    top   0.0 TEST ../../../bin/varnishtest/tests/v00038.vtc starting
[...]
*    top   0.0 TEST VCL compiler coverage test: vcc_backend.c
[...]
**** v1    0.2 CLI RX|
**** v1    0.2 CLI RX|Running VCC-compiler failed, exited with 2
**** v1    0.2 CLI RX|VCL compilation failed
**   v1    0.2 VCL compilation failed (as expected)
***  v1    0.2 Found expected string: ("Unknown field:")
**   top   0.2 === varnish v1 -errvcl "Mandatory field 'host' missing." {
**** v1    0.2 CLI TX|vcl.inline vcl12 << %XJEIFLH|)Xspa8P
**** v1    0.2 CLI TX|vcl 4.0;
**** v1    0.2 CLI TX|
**** v1    0.2 CLI TX|\tbackend b1 {
**** v1    0.2 CLI TX|\t\t.port = "NONE";
**** v1    0.2 CLI TX|\t}
**** v1    0.2 CLI TX|
**** v1    0.2 CLI TX|%XJEIFLH|)Xspa8P
***  v1    0.2 CLI RX  106
**** v1    0.2 CLI RX|Message from VCC-compiler:
**** v1    0.2 CLI RX|Security: Privilege proc_setid missing, will not change uid/gid
**** v1    0.2 CLI RX|Mandatory field 'host' missing.
**** v1    0.2 CLI RX|Running VCC-compiler failed, exited with 2
**** v1    0.2 CLI RX|VCL compilation failed
**   v1    0.2 VCL compilation failed (as expected)
***  v1    0.2 Found expected string: ("Mandatory field 'host' missing.")
*    top   0.2 RESETTING after ../../../bin/varnishtest/tests/v00038.vtc
**   v1    0.2 Wait
**** v1    0.2 CLI TX|backend.list
***  v1    0.2 CLI RX  101
**** v1    0.2 CLI RX|Unknown request in manager process (child not running).
**** v1    0.2 CLI RX|Type 'help' for more info.
**   v1    0.2 Stop
**** v1    0.2 CLI TX|stop
***  v1    0.2 CLI RX  300
**** v1    0.2 CLI RX|Child in state stopped
**** v1    0.2 CLI TX|status
***  v1    0.2 CLI RX  200
**** v1    0.2 CLI RX|Child in state stopped
**** v1    0.2 STDOUT poll 0x10
**   v1    0.2 R 89215 Status: 0000 (u 0.005000 s 0.031000)
*    diag  0.0 ............................................................
#    top  TEST ../../../bin/varnishtest/tests/v00038.vtc TIMED OUT (kill -9)
#    top  TEST ../../../bin/varnishtest/tests/v00038.vtc FAILED (60.003) signal=9

1 @ SunOS 5.11 i86pc 1.04 32_gcc4.7 uplex

*    top   0.0 TEST ../../../bin/varnishtest/tests/v00038.vtc starting
[...]
*    top   0.0 TEST VCL compiler coverage test: vcc_backend.c
[...]
**** v1    0.2 CLI RX|
**** v1    0.2 CLI RX|Running VCC-compiler failed, exited with 2
**** v1    0.2 CLI RX|VCL compilation failed
**   v1    0.2 VCL compilation failed (as expected)
***  v1    0.2 Found expected string: ("Unknown field:")
**   top   0.2 === varnish v1 -errvcl "Mandatory field 'host' missing." {
**** v1    0.2 CLI TX|vcl.inline vcl12 << %XJEIFLH|)Xspa8P
**** v1    0.2 CLI TX|vcl 4.0;
**** v1    0.2 CLI TX|
**** v1    0.2 CLI TX|\tbackend b1 {
**** v1    0.2 CLI TX|\t\t.port = "NONE";
**** v1    0.2 CLI TX|\t}
**** v1    0.2 CLI TX|
**** v1    0.2 CLI TX|%XJEIFLH|)Xspa8P
***  v1    0.2 CLI RX  106
**** v1    0.2 CLI RX|Message from VCC-compiler:
**** v1    0.2 CLI RX|Security: Privilege proc_setid missing, will not change uid/gid
**** v1    0.2 CLI RX|Mandatory field 'host' missing.
**** v1    0.2 CLI RX|Running VCC-compiler failed, exited with 2
**** v1    0.2 CLI RX|VCL compilation failed
**   v1    0.2 VCL compilation failed (as expected)
***  v1    0.2 Found expected string: ("Mandatory field 'host' missing.")
*    top   0.2 RESETTING after ../../../bin/varnishtest/tests/v00038.vtc
**   v1    0.2 Wait
**** v1    0.2 CLI TX|backend.list
***  v1    0.2 CLI RX  101
**** v1    0.2 CLI RX|Unknown request in manager process (child not running).
**** v1    0.2 CLI RX|Type 'help' for more info.
**   v1    0.2 Stop
**** v1    0.2 CLI TX|stop
***  v1    0.2 CLI RX  300
**** v1    0.2 CLI RX|Child in state stopped
**** v1    0.2 CLI TX|status
***  v1    0.2 CLI RX  200
**** v1    0.2 CLI RX|Child in state stopped
**** v1    0.2 STDOUT poll 0x10
**   v1    0.2 R 87633 Status: 0000 (u 0.005000 s 0.031000)
*    diag  0.0 ............................................................
#    top  TEST ../../../bin/varnishtest/tests/v00038.vtc TIMED OUT (kill -9)
#    top  TEST ../../../bin/varnishtest/tests/v00038.vtc FAILED (60.002) signal=9

1 @ SunOS 5.11 i86pc 1.04 32_gcc4.7 uplex

*    top   0.0 TEST ../../../bin/varnishtest/tests/v00038.vtc starting
[...]
*    top   0.0 TEST VCL compiler coverage test: vcc_backend.c
[...]
**** v1    0.2 CLI RX|
**** v1    0.2 CLI RX|Running VCC-compiler failed, exited with 2
**** v1    0.2 CLI RX|VCL compilation failed
**   v1    0.2 VCL compilation failed (as expected)
***  v1    0.2 Found expected string: ("Unknown field:")
**   top   0.2 === varnish v1 -errvcl "Mandatory field 'host' missing." {
**** v1    0.2 CLI TX|vcl.inline vcl12 << %XJEIFLH|)Xspa8P
**** v1    0.2 CLI TX|vcl 4.0;
**** v1    0.2 CLI TX|
**** v1    0.2 CLI TX|\tbackend b1 {
**** v1    0.2 CLI TX|\t\t.port = "NONE";
**** v1    0.2 CLI TX|\t}
**** v1    0.2 CLI TX|
**** v1    0.2 CLI TX|%XJEIFLH|)Xspa8P
***  v1    0.2 CLI RX  106
**** v1    0.2 CLI RX|Message from VCC-compiler:
**** v1    0.2 CLI RX|Security: Privilege proc_setid missing, will not change uid/gid
**** v1    0.2 CLI RX|Mandatory field 'host' missing.
**** v1    0.2 CLI RX|Running VCC-compiler failed, exited with 2
**** v1    0.2 CLI RX|VCL compilation failed
**   v1    0.2 VCL compilation failed (as expected)
***  v1    0.2 Found expected string: ("Mandatory field 'host' missing.")
*    top   0.2 RESETTING after ../../../bin/varnishtest/tests/v00038.vtc
**   v1    0.2 Wait
**** v1    0.2 CLI TX|backend.list
***  v1    0.2 CLI RX  101
**** v1    0.2 CLI RX|Unknown request in manager process (child not running).
**** v1    0.2 CLI RX|Type 'help' for more info.
**   v1    0.2 Stop
**** v1    0.2 CLI TX|stop
***  v1    0.2 CLI RX  300
**** v1    0.2 CLI RX|Child in state stopped
**** v1    0.2 CLI TX|status
***  v1    0.2 CLI RX  200
**** v1    0.2 CLI RX|Child in state stopped
**** v1    0.2 STDOUT poll 0x10
**   v1    0.2 R 76037 Status: 0000 (u 0.005000 s 0.034000)
*    diag  0.0 ............................................................
#    top  TEST ../../../bin/varnishtest/tests/v00038.vtc TIMED OUT (kill -9)
#    top  TEST ../../../bin/varnishtest/tests/v00038.vtc FAILED (60.002) signal=9

1 @ SunOS 5.11 i86pc 1.04 64_gcc4.7 uplex

*    top   0.0 TEST ../../../bin/varnishtest/tests/v00038.vtc starting
[...]
*    top   0.0 TEST VCL compiler coverage test: vcc_backend.c
[...]
**** v1    0.2 CLI RX|
**** v1    0.2 CLI RX|Running VCC-compiler failed, exited with 2
**** v1    0.2 CLI RX|VCL compilation failed
**   v1    0.2 VCL compilation failed (as expected)
***  v1    0.2 Found expected string: ("Unknown field:")
**   top   0.2 === varnish v1 -errvcl "Mandatory field 'host' missing." {
**** v1    0.2 CLI TX|vcl.inline vcl12 << %XJEIFLH|)Xspa8P
**** v1    0.2 CLI TX|vcl 4.0;
**** v1    0.2 CLI TX|
**** v1    0.2 CLI TX|\tbackend b1 {
**** v1    0.2 CLI TX|\t\t.port = "NONE";
**** v1    0.2 CLI TX|\t}
**** v1    0.2 CLI TX|
**** v1    0.2 CLI TX|%XJEIFLH|)Xspa8P
***  v1    0.2 CLI RX  106
**** v1    0.2 CLI RX|Message from VCC-compiler:
**** v1    0.2 CLI RX|Security: Privilege proc_setid missing, will not change uid/gid
**** v1    0.2 CLI RX|Mandatory field 'host' missing.
**** v1    0.2 CLI RX|Running VCC-compiler failed, exited with 2
**** v1    0.2 CLI RX|VCL compilation failed
**   v1    0.2 VCL compilation failed (as expected)
***  v1    0.2 Found expected string: ("Mandatory field 'host' missing.")
*    top   0.2 RESETTING after ../../../bin/varnishtest/tests/v00038.vtc
**   v1    0.2 Wait
**** v1    0.2 CLI TX|backend.list
***  v1    0.2 CLI RX  101
**** v1    0.2 CLI RX|Unknown request in manager process (child not running).
**** v1    0.2 CLI RX|Type 'help' for more info.
**   v1    0.2 Stop
**** v1    0.2 CLI TX|stop
***  v1    0.2 CLI RX  300
**** v1    0.2 CLI RX|Child in state stopped
**** v1    0.2 CLI TX|status
***  v1    0.2 CLI RX  200
**** v1    0.2 CLI RX|Child in state stopped
**** v1    0.2 STDOUT poll 0x10
**   v1    0.2 R 16558 Status: 0000 (u 0.015000 s 0.058000)
*    diag  0.0 ............................................................
#    top  TEST ../../../bin/varnishtest/tests/v00038.vtc TIMED OUT (kill -9)
#    top  TEST ../../../bin/varnishtest/tests/v00038.vtc FAILED (60.004) signal=9

1 @ SunOS 5.11 i86pc 1.04 32_sun12.4 uplex

*    top   0.0 TEST ../../../bin/varnishtest/tests/v00038.vtc starting
[...]
*    top   0.0 TEST VCL compiler coverage test: vcc_backend.c
[...]
**** v1    0.2 CLI RX|
**** v1    0.2 CLI RX|Running VCC-compiler failed, exited with 2
**** v1    0.2 CLI RX|VCL compilation failed
**   v1    0.2 VCL compilation failed (as expected)
***  v1    0.2 Found expected string: ("Unknown field:")
**   top   0.2 === varnish v1 -errvcl "Mandatory field 'host' missing." {
**** v1    0.2 CLI TX|vcl.inline vcl12 << %XJEIFLH|)Xspa8P
**** v1    0.2 CLI TX|vcl 4.0;
**** v1    0.2 CLI TX|
**** v1    0.2 CLI TX|\tbackend b1 {
**** v1    0.2 CLI TX|\t\t.port = "NONE";
**** v1    0.2 CLI TX|\t}
**** v1    0.2 CLI TX|
**** v1    0.2 CLI TX|%XJEIFLH|)Xspa8P
***  v1    0.2 CLI RX  106
**** v1    0.2 CLI RX|Message from VCC-compiler:
**** v1    0.2 CLI RX|Security: Privilege proc_setid missing, will not change uid/gid
**** v1    0.2 CLI RX|Mandatory field 'host' missing.
**** v1    0.2 CLI RX|Running VCC-compiler failed, exited with 2
**** v1    0.2 CLI RX|VCL compilation failed
**   v1    0.2 VCL compilation failed (as expected)
***  v1    0.2 Found expected string: ("Mandatory field 'host' missing.")
*    top   0.2 RESETTING after ../../../bin/varnishtest/tests/v00038.vtc
**   v1    0.2 Wait
**** v1    0.2 CLI TX|backend.list
***  v1    0.2 CLI RX  101
**** v1    0.2 CLI RX|Unknown request in manager process (child not running).
**** v1    0.2 CLI RX|Type 'help' for more info.
**   v1    0.2 Stop
**** v1    0.2 CLI TX|stop
***  v1    0.2 CLI RX  300
**** v1    0.2 CLI RX|Child in state stopped
**** v1    0.2 CLI TX|status
***  v1    0.2 CLI RX  200
**** v1    0.2 CLI RX|Child in state stopped
**** v1    0.2 STDOUT poll 0x10
**   v1    0.2 R 69012 Status: 0000 (u 0.005000 s 0.032000)
*    diag  0.0 ............................................................
#    top  TEST ../../../bin/varnishtest/tests/v00038.vtc TIMED OUT (kill -9)
#    top  TEST ../../../bin/varnishtest/tests/v00038.vtc FAILED (60.002) signal=9

1 @ SunOS 5.11 i86pc 1.04 64_sun12.4 uplex

*    top   0.0 TEST ../../../bin/varnishtest/tests/v00038.vtc starting
[...]
*    top   0.0 TEST VCL compiler coverage test: vcc_backend.c
[...]
**** v1    0.2 CLI RX|
**** v1    0.2 CLI RX|Running VCC-compiler failed, exited with 2
**** v1    0.2 CLI RX|VCL compilation failed
**   v1    0.2 VCL compilation failed (as expected)
***  v1    0.2 Found expected string: ("Unknown field:")
**   top   0.2 === varnish v1 -errvcl "Mandatory field 'host' missing." {
**** v1    0.2 CLI TX|vcl.inline vcl12 << %XJEIFLH|)Xspa8P
**** v1    0.2 CLI TX|vcl 4.0;
**** v1    0.2 CLI TX|
**** v1    0.2 CLI TX|\tbackend b1 {
**** v1    0.2 CLI TX|\t\t.port = "NONE";
**** v1    0.2 CLI TX|\t}
**** v1    0.2 CLI TX|
**** v1    0.2 CLI TX|%XJEIFLH|)Xspa8P
***  v1    0.2 CLI RX  106
**** v1    0.2 CLI RX|Message from VCC-compiler:
**** v1    0.2 CLI RX|Security: Privilege proc_setid missing, will not change uid/gid
**** v1    0.2 CLI RX|Mandatory field 'host' missing.
**** v1    0.2 CLI RX|Running VCC-compiler failed, exited with 2
**** v1    0.2 CLI RX|VCL compilation failed
**   v1    0.2 VCL compilation failed (as expected)
***  v1    0.2 Found expected string: ("Mandatory field 'host' missing.")
*    top   0.2 RESETTING after ../../../bin/varnishtest/tests/v00038.vtc
**   v1    0.2 Wait
**** v1    0.2 CLI TX|backend.list
***  v1    0.2 CLI RX  101
**** v1    0.2 CLI RX|Unknown request in manager process (child not running).
**** v1    0.2 CLI RX|Type 'help' for more info.
**   v1    0.2 Stop
**** v1    0.2 CLI TX|stop
***  v1    0.2 CLI RX  300
**** v1    0.2 CLI RX|Child in state stopped
**** v1    0.2 CLI TX|status
***  v1    0.2 CLI RX  200
**** v1    0.2 CLI RX|Child in state stopped
**** v1    0.2 STDOUT poll 0x10
**   v1    0.2 R 9322 Status: 0000 (u 0.022000 s 0.061000)
*    diag  0.0 ............................................................
#    top  TEST ../../../bin/varnishtest/tests/v00038.vtc TIMED OUT (kill -9)
#    top  TEST ../../../bin/varnishtest/tests/v00038.vtc FAILED (60.004) signal=9

1 @ SunOS 5.11 i86pc 1.04 64_sun12.4 uplex

*    top   0.0 TEST ../../../bin/varnishtest/tests/v00038.vtc starting
[...]
*    top   0.0 TEST VCL compiler coverage test: vcc_backend.c
[...]
**** v1    0.2 CLI RX|
**** v1    0.2 CLI RX|Running VCC-compiler failed, exited with 2
**** v1    0.2 CLI RX|VCL compilation failed
**   v1    0.2 VCL compilation failed (as expected)
***  v1    0.2 Found expected string: ("Unknown field:")
**   top   0.2 === varnish v1 -errvcl "Mandatory field 'host' missing." {
**** v1    0.2 CLI TX|vcl.inline vcl12 << %XJEIFLH|)Xspa8P
**** v1    0.2 CLI TX|vcl 4.0;
**** v1    0.2 CLI TX|
**** v1    0.2 CLI TX|\tbackend b1 {
**** v1    0.2 CLI TX|\t\t.port = "NONE";
**** v1    0.2 CLI TX|\t}
**** v1    0.2 CLI TX|
**** v1    0.2 CLI TX|%XJEIFLH|)Xspa8P
***  v1    0.2 CLI RX  106
**** v1    0.2 CLI RX|Message from VCC-compiler:
**** v1    0.2 CLI RX|Security: Privilege proc_setid missing, will not change uid/gid
**** v1    0.2 CLI RX|Mandatory field 'host' missing.
**** v1    0.2 CLI RX|Running VCC-compiler failed, exited with 2
**** v1    0.2 CLI RX|VCL compilation failed
**   v1    0.2 VCL compilation failed (as expected)
***  v1    0.2 Found expected string: ("Mandatory field 'host' missing.")
*    top   0.2 RESETTING after ../../../bin/varnishtest/tests/v00038.vtc
**   v1    0.2 Wait
**** v1    0.2 CLI TX|backend.list
***  v1    0.2 CLI RX  101
**** v1    0.2 CLI RX|Unknown request in manager process (child not running).
**** v1    0.2 CLI RX|Type 'help' for more info.
**   v1    0.2 Stop
**** v1    0.2 CLI TX|stop
***  v1    0.2 CLI RX  300
**** v1    0.2 CLI RX|Child in state stopped
**** v1    0.2 CLI TX|status
***  v1    0.2 CLI RX  200
**** v1    0.2 CLI RX|Child in state stopped
**** v1    0.2 STDOUT poll 0x10
**   v1    0.2 R 41294 Status: 0000 (u 0.023000 s 0.064000)
*    diag  0.0 ............................................................
#    top  TEST ../../../bin/varnishtest/tests/v00038.vtc TIMED OUT (kill -9)
#    top  TEST ../../../bin/varnishtest/tests/v00038.vtc FAILED (60.004) signal=9

1 @ SunOS 5.11 i86pc 1.04 64_gcc4.7 uplex

*    top   0.0 TEST ../../../bin/varnishtest/tests/v00038.vtc starting
[...]
*    top   0.0 TEST VCL compiler coverage test: vcc_backend.c
[...]
**** v1    0.2 CLI RX|
**** v1    0.2 CLI RX|Running VCC-compiler failed, exited with 2
**** v1    0.2 CLI RX|VCL compilation failed
**   v1    0.2 VCL compilation failed (as expected)
***  v1    0.2 Found expected string: ("Unknown field:")
**   top   0.2 === varnish v1 -errvcl "Mandatory field 'host' missing." {
**** v1    0.2 CLI TX|vcl.inline vcl12 << %XJEIFLH|)Xspa8P
**** v1    0.2 CLI TX|vcl 4.0;
**** v1    0.2 CLI TX|
**** v1    0.2 CLI TX|\tbackend b1 {
**** v1    0.2 CLI TX|\t\t.port = "NONE";
**** v1    0.2 CLI TX|\t}
**** v1    0.2 CLI TX|
**** v1    0.2 CLI TX|%XJEIFLH|)Xspa8P
***  v1    0.2 CLI RX  106
**** v1    0.2 CLI RX|Message from VCC-compiler:
**** v1    0.2 CLI RX|Security: Privilege proc_setid missing, will not change uid/gid
**** v1    0.2 CLI RX|Mandatory field 'host' missing.
**** v1    0.2 CLI RX|Running VCC-compiler failed, exited with 2
**** v1    0.2 CLI RX|VCL compilation failed
**   v1    0.2 VCL compilation failed (as expected)
***  v1    0.2 Found expected string: ("Mandatory field 'host' missing.")
*    top   0.2 RESETTING after ../../../bin/varnishtest/tests/v00038.vtc
**   v1    0.2 Wait
**** v1    0.2 CLI TX|backend.list
***  v1    0.2 CLI RX  101
**** v1    0.2 CLI RX|Unknown request in manager process (child not running).
**** v1    0.2 CLI RX|Type 'help' for more info.
**   v1    0.2 Stop
**** v1    0.2 CLI TX|stop
***  v1    0.2 CLI RX  300
**** v1    0.2 CLI RX|Child in state stopped
**** v1    0.2 CLI TX|status
***  v1    0.2 CLI RX  200
**** v1    0.2 CLI RX|Child in state stopped
**** v1    0.2 STDOUT poll 0x10
**   v1    0.2 R 56282 Status: 0000 (u 0.017000 s 0.059000)
*    diag  0.0 ............................................................
#    top  TEST ../../../bin/varnishtest/tests/v00038.vtc TIMED OUT (kill -9)
#    top  TEST ../../../bin/varnishtest/tests/v00038.vtc FAILED (60.003) signal=9

1 @ SunOS 5.11 i86pc 1.04 64_gcc4.7 uplex

*    top   0.0 TEST ../../../bin/varnishtest/tests/v00038.vtc starting
[...]
*    top   0.0 TEST VCL compiler coverage test: vcc_backend.c
[...]
**** v1    0.2 CLI RX|
**** v1    0.2 CLI RX|Running VCC-compiler failed, exited with 2
**** v1    0.2 CLI RX|VCL compilation failed
**   v1    0.2 VCL compilation failed (as expected)
***  v1    0.2 Found expected string: ("Unknown field:")
**   top   0.2 === varnish v1 -errvcl "Mandatory field 'host' missing." {
**** v1    0.2 CLI TX|vcl.inline vcl12 << %XJEIFLH|)Xspa8P
**** v1    0.2 CLI TX|vcl 4.0;
**** v1    0.2 CLI TX|
**** v1    0.2 CLI TX|\tbackend b1 {
**** v1    0.2 CLI TX|\t\t.port = "NONE";
**** v1    0.2 CLI TX|\t}
**** v1    0.2 CLI TX|
**** v1    0.2 CLI TX|%XJEIFLH|)Xspa8P
***  v1    0.2 CLI RX  106
**** v1    0.2 CLI RX|Message from VCC-compiler:
**** v1    0.2 CLI RX|Security: Privilege proc_setid missing, will not change uid/gid
**** v1    0.2 CLI RX|Mandatory field 'host' missing.
**** v1    0.2 CLI RX|Running VCC-compiler failed, exited with 2
**** v1    0.2 CLI RX|VCL compilation failed
**   v1    0.2 VCL compilation failed (as expected)
***  v1    0.2 Found expected string: ("Mandatory field 'host' missing.")
*    top   0.2 RESETTING after ../../../bin/varnishtest/tests/v00038.vtc
**   v1    0.2 Wait
**** v1    0.2 CLI TX|backend.list
***  v1    0.2 CLI RX  101
**** v1    0.2 CLI RX|Unknown request in manager process (child not running).
**** v1    0.2 CLI RX|Type 'help' for more info.
**   v1    0.2 Stop
**** v1    0.2 CLI TX|stop
***  v1    0.2 CLI RX  300
**** v1    0.2 CLI RX|Child in state stopped
**** v1    0.2 CLI TX|status
***  v1    0.2 CLI RX  200
**** v1    0.2 CLI RX|Child in state stopped
**** v1    0.2 STDOUT poll 0x10
**   v1    0.2 R 55536 Status: 0000 (u 0.021000 s 0.061000)
*    diag  0.0 ............................................................
#    top  TEST ../../../bin/varnishtest/tests/v00038.vtc TIMED OUT (kill -9)
#    top  TEST ../../../bin/varnishtest/tests/v00038.vtc FAILED (60.003) signal=9

1 @ SunOS 5.11 i86pc 1.04 32_sun12.4 uplex

*    top   0.0 TEST ../../../bin/varnishtest/tests/v00038.vtc starting
[...]
*    top   0.0 TEST VCL compiler coverage test: vcc_backend.c
[...]
**** v1    0.2 CLI RX|
**** v1    0.2 CLI RX|Running VCC-compiler failed, exited with 2
**** v1    0.2 CLI RX|VCL compilation failed
**   v1    0.2 VCL compilation failed (as expected)
***  v1    0.2 Found expected string: ("Unknown field:")
**   top   0.2 === varnish v1 -errvcl "Mandatory field 'host' missing." {
**** v1    0.2 CLI TX|vcl.inline vcl12 << %XJEIFLH|)Xspa8P
**** v1    0.2 CLI TX|vcl 4.0;
**** v1    0.2 CLI TX|
**** v1    0.2 CLI TX|\tbackend b1 {
**** v1    0.2 CLI TX|\t\t.port = "NONE";
**** v1    0.2 CLI TX|\t}
**** v1    0.2 CLI TX|
**** v1    0.2 CLI TX|%XJEIFLH|)Xspa8P
***  v1    0.2 CLI RX  106
**** v1    0.2 CLI RX|Message from VCC-compiler:
**** v1    0.2 CLI RX|Security: Privilege proc_setid missing, will not change uid/gid
**** v1    0.2 CLI RX|Mandatory field 'host' missing.
**** v1    0.2 CLI RX|Running VCC-compiler failed, exited with 2
**** v1    0.2 CLI RX|VCL compilation failed
**   v1    0.2 VCL compilation failed (as expected)
***  v1    0.2 Found expected string: ("Mandatory field 'host' missing.")
*    top   0.2 RESETTING after ../../../bin/varnishtest/tests/v00038.vtc
**   v1    0.2 Wait
**** v1    0.2 CLI TX|backend.list
***  v1    0.2 CLI RX  101
**** v1    0.2 CLI RX|Unknown request in manager process (child not running).
**** v1    0.2 CLI RX|Type 'help' for more info.
**   v1    0.2 Stop
**** v1    0.2 CLI TX|stop
***  v1    0.2 CLI RX  300
**** v1    0.2 CLI RX|Child in state stopped
**** v1    0.2 CLI TX|status
***  v1    0.2 CLI RX  200
**** v1    0.2 CLI RX|Child in state stopped
**** v1    0.2 STDOUT poll 0x10
**   v1    0.2 R 2286 Status: 0000 (u 0.008000 s 0.044000)
*    diag  0.0 ............................................................
#    top  TEST ../../../bin/varnishtest/tests/v00038.vtc TIMED OUT (kill -9)
#    top  TEST ../../../bin/varnishtest/tests/v00038.vtc FAILED (60.003) signal=9

1 @ SunOS 5.11 i86pc 1.04 32_gcc4.7 uplex

*    top   0.0 TEST ../../../bin/varnishtest/tests/v00038.vtc starting
[...]
*    top   0.0 TEST VCL compiler coverage test: vcc_backend.c
[...]
**** v1    0.2 CLI RX|
**** v1    0.2 CLI RX|Running VCC-compiler failed, exited with 2
**** v1    0.2 CLI RX|VCL compilation failed
**   v1    0.2 VCL compilation failed (as expected)
***  v1    0.2 Found expected string: ("Unknown field:")
**   top   0.2 === varnish v1 -errvcl "Mandatory field 'host' missing." {
**** v1    0.2 CLI TX|vcl.inline vcl12 << %XJEIFLH|)Xspa8P
**** v1    0.2 CLI TX|vcl 4.0;
**** v1    0.2 CLI TX|
**** v1    0.2 CLI TX|\tbackend b1 {
**** v1    0.2 CLI TX|\t\t.port = "NONE";
**** v1    0.2 CLI TX|\t}
**** v1    0.2 CLI TX|
**** v1    0.2 CLI TX|%XJEIFLH|)Xspa8P
***  v1    0.2 CLI RX  106
**** v1    0.2 CLI RX|Message from VCC-compiler:
**** v1    0.2 CLI RX|Security: Privilege proc_setid missing, will not change uid/gid
**** v1    0.2 CLI RX|Mandatory field 'host' missing.
**** v1    0.2 CLI RX|Running VCC-compiler failed, exited with 2
**** v1    0.2 CLI RX|VCL compilation failed
**   v1    0.2 VCL compilation failed (as expected)
***  v1    0.2 Found expected string: ("Mandatory field 'host' missing.")
*    top   0.2 RESETTING after ../../../bin/varnishtest/tests/v00038.vtc
**   v1    0.2 Wait
**** v1    0.2 CLI TX|backend.list
***  v1    0.2 CLI RX  101
**** v1    0.2 CLI RX|Unknown request in manager process (child not running).
**** v1    0.2 CLI RX|Type 'help' for more info.
**   v1    0.2 Stop
**** v1    0.2 CLI TX|stop
***  v1    0.2 CLI RX  300
**** v1    0.2 CLI RX|Child in state stopped
**** v1    0.2 CLI TX|status
***  v1    0.2 CLI RX  200
**** v1    0.2 CLI RX|Child in state stopped
**** v1    0.2 STDOUT poll 0x10
**   v1    0.2 R 31217 Status: 0000 (u 0.005000 s 0.031000)
*    diag  0.0 ............................................................
#    top  TEST ../../../bin/varnishtest/tests/v00038.vtc TIMED OUT (kill -9)
#    top  TEST ../../../bin/varnishtest/tests/v00038.vtc FAILED (60.002) signal=9

1 @ SunOS 5.11 i86pc 1.04 64_sun12.4 uplex

*    top   0.0 TEST ../../../bin/varnishtest/tests/v00038.vtc starting
[...]
*    top   0.0 TEST VCL compiler coverage test: vcc_backend.c
[...]
**** v1    0.2 CLI RX|
**** v1    0.2 CLI RX|Running VCC-compiler failed, exited with 2
**** v1    0.2 CLI RX|VCL compilation failed
**   v1    0.2 VCL compilation failed (as expected)
***  v1    0.2 Found expected string: ("Unknown field:")
**   top   0.2 === varnish v1 -errvcl "Mandatory field 'host' missing." {
**** v1    0.2 CLI TX|vcl.inline vcl12 << %XJEIFLH|)Xspa8P
**** v1    0.2 CLI TX|vcl 4.0;
**** v1    0.2 CLI TX|
**** v1    0.2 CLI TX|\tbackend b1 {
**** v1    0.2 CLI TX|\t\t.port = "NONE";
**** v1    0.2 CLI TX|\t}
**** v1    0.2 CLI TX|
**** v1    0.2 CLI TX|%XJEIFLH|)Xspa8P
***  v1    0.2 CLI RX  106
**** v1    0.2 CLI RX|Message from VCC-compiler:
**** v1    0.2 CLI RX|Security: Privilege proc_setid missing, will not change uid/gid
**** v1    0.2 CLI RX|Mandatory field 'host' missing.
**** v1    0.2 CLI RX|Running VCC-compiler failed, exited with 2
**** v1    0.2 CLI RX|VCL compilation failed
**   v1    0.2 VCL compilation failed (as expected)
***  v1    0.2 Found expected string: ("Mandatory field 'host' missing.")
*    top   0.2 RESETTING after ../../../bin/varnishtest/tests/v00038.vtc
**   v1    0.2 Wait
**** v1    0.2 CLI TX|backend.list
***  v1    0.2 CLI RX  101
**** v1    0.2 CLI RX|Unknown request in manager process (child not running).
**** v1    0.2 CLI RX|Type 'help' for more info.
**   v1    0.2 Stop
**** v1    0.2 CLI TX|stop
***  v1    0.2 CLI RX  300
**** v1    0.2 CLI RX|Child in state stopped
**** v1    0.2 CLI TX|status
***  v1    0.2 CLI RX  200
**** v1    0.2 CLI RX|Child in state stopped
**** v1    0.2 STDOUT poll 0x10
**   v1    0.2 R 14157 Status: 0000 (u 0.027000 s 0.087000)
*    diag  0.0 ............................................................
#    top  TEST ../../../bin/varnishtest/tests/v00038.vtc TIMED OUT (kill -9)
#    top  TEST ../../../bin/varnishtest/tests/v00038.vtc FAILED (60.004) signal=9

1 @ SunOS 5.11 i86pc 1.04 64_sun12.4 uplex

*    top   0.0 TEST ../../../bin/varnishtest/tests/v00038.vtc starting
[...]
*    top   0.0 TEST VCL compiler coverage test: vcc_backend.c
[...]
**** v1    0.2 CLI RX|
**** v1    0.2 CLI RX|Running VCC-compiler failed, exited with 2
**** v1    0.2 CLI RX|VCL compilation failed
**   v1    0.2 VCL compilation failed (as expected)
***  v1    0.2 Found expected string: ("Unknown field:")
**   top   0.2 === varnish v1 -errvcl "Mandatory field 'host' missing." {
**** v1    0.2 CLI TX|vcl.inline vcl12 << %XJEIFLH|)Xspa8P
**** v1    0.2 CLI TX|vcl 4.0;
**** v1    0.2 CLI TX|
**** v1    0.2 CLI TX|\tbackend b1 {
**** v1    0.2 CLI TX|\t\t.port = "NONE";
**** v1    0.2 CLI TX|\t}
**** v1    0.2 CLI TX|
**** v1    0.2 CLI TX|%XJEIFLH|)Xspa8P
***  v1    0.2 CLI RX  106
**** v1    0.2 CLI RX|Message from VCC-compiler:
**** v1    0.2 CLI RX|Security: Privilege proc_setid missing, will not change uid/gid
**** v1    0.2 CLI RX|Mandatory field 'host' missing.
**** v1    0.2 CLI RX|Running VCC-compiler failed, exited with 2
**** v1    0.2 CLI RX|VCL compilation failed
**   v1    0.2 VCL compilation failed (as expected)
***  v1    0.2 Found expected string: ("Mandatory field 'host' missing.")
*    top   0.2 RESETTING after ../../../bin/varnishtest/tests/v00038.vtc
**   v1    0.2 Wait
**** v1    0.2 CLI TX|backend.list
***  v1    0.2 CLI RX  101
**** v1    0.2 CLI RX|Unknown request in manager process (child not running).
**** v1    0.2 CLI RX|Type 'help' for more info.
**   v1    0.2 Stop
**** v1    0.2 CLI TX|stop
***  v1    0.2 CLI RX  300
**** v1    0.2 CLI RX|Child in state stopped
**** v1    0.2 CLI TX|status
***  v1    0.2 CLI RX  200
**** v1    0.2 CLI RX|Child in state stopped
**** v1    0.2 STDOUT poll 0x10
**   v1    0.2 R 21147 Status: 0000 (u 0.017000 s 0.059000)
*    diag  0.0 ............................................................
#    top  TEST ../../../bin/varnishtest/tests/v00038.vtc TIMED OUT (kill -9)
#    top  TEST ../../../bin/varnishtest/tests/v00038.vtc FAILED (60.004) signal=9

1 @ SunOS 5.11 i86pc 1.04 64_gcc4.7 uplex

*    top   0.0 TEST ../../../bin/varnishtest/tests/v00038.vtc starting
[...]
*    top   0.0 TEST VCL compiler coverage test: vcc_backend.c
[...]
**** v1    0.2 CLI RX|
**** v1    0.2 CLI RX|Running VCC-compiler failed, exited with 2
**** v1    0.2 CLI RX|VCL compilation failed
**   v1    0.2 VCL compilation failed (as expected)
***  v1    0.2 Found expected string: ("Unknown field:")
**   top   0.2 === varnish v1 -errvcl "Mandatory field 'host' missing." {
**** v1    0.2 CLI TX|vcl.inline vcl12 << %XJEIFLH|)Xspa8P
**** v1    0.2 CLI TX|vcl 4.0;
**** v1    0.2 CLI TX|
**** v1    0.2 CLI TX|\tbackend b1 {
**** v1    0.2 CLI TX|\t\t.port = "NONE";
**** v1    0.2 CLI TX|\t}
**** v1    0.2 CLI TX|
**** v1    0.2 CLI TX|%XJEIFLH|)Xspa8P
***  v1    0.2 CLI RX  106
**** v1    0.2 CLI RX|Message from VCC-compiler:
**** v1    0.2 CLI RX|Security: Privilege proc_setid missing, will not change uid/gid
**** v1    0.2 CLI RX|Mandatory field 'host' missing.
**** v1    0.2 CLI RX|Running VCC-compiler failed, exited with 2
**** v1    0.2 CLI RX|VCL compilation failed
**   v1    0.2 VCL compilation failed (as expected)
***  v1    0.2 Found expected string: ("Mandatory field 'host' missing.")
*    top   0.2 RESETTING after ../../../bin/varnishtest/tests/v00038.vtc
**   v1    0.2 Wait
**** v1    0.2 CLI TX|backend.list
***  v1    0.2 CLI RX  101
**** v1    0.2 CLI RX|Unknown request in manager process (child not running).
**** v1    0.2 CLI RX|Type 'help' for more info.
**   v1    0.2 Stop
**** v1    0.2 CLI TX|stop
***  v1    0.2 CLI RX  300
**** v1    0.2 CLI RX|Child in state stopped
**** v1    0.2 CLI TX|status
***  v1    0.2 CLI RX  200
**** v1    0.2 CLI RX|Child in state stopped
**** v1    0.2 STDOUT poll 0x10
**   v1    0.2 R 43129 Status: 0000 (u 0.022000 s 0.063000)
*    diag  0.0 ............................................................
#    top  TEST ../../../bin/varnishtest/tests/v00038.vtc TIMED OUT (kill -9)
#    top  TEST ../../../bin/varnishtest/tests/v00038.vtc FAILED (60.004) signal=9

1 @ SunOS 5.11 i86pc 1.04 64_gcc4.7 uplex

*    top   0.0 TEST ../../../bin/varnishtest/tests/v00038.vtc starting
[...]
*    top   0.0 TEST VCL compiler coverage test: vcc_backend.c
[...]
**** v1    0.2 CLI RX|
**** v1    0.2 CLI RX|Running VCC-compiler failed, exited with 2
**** v1    0.2 CLI RX|VCL compilation failed
**   v1    0.2 VCL compilation failed (as expected)
***  v1    0.2 Found expected string: ("Unknown field:")
**   top   0.2 === varnish v1 -errvcl "Mandatory field 'host' missing." {
**** v1    0.2 CLI TX|vcl.inline vcl12 << %XJEIFLH|)Xspa8P
**** v1    0.2 CLI TX|vcl 4.0;
**** v1    0.2 CLI TX|
**** v1    0.2 CLI TX|\tbackend b1 {
**** v1    0.2 CLI TX|\t\t.port = "NONE";
**** v1    0.2 CLI TX|\t}
**** v1    0.2 CLI TX|
**** v1    0.2 CLI TX|%XJEIFLH|)Xspa8P
***  v1    0.2 CLI RX  106
**** v1    0.2 CLI RX|Message from VCC-compiler:
**** v1    0.2 CLI RX|Security: Privilege proc_setid missing, will not change uid/gid
**** v1    0.2 CLI RX|Mandatory field 'host' missing.
**** v1    0.2 CLI RX|Running VCC-compiler failed, exited with 2
**** v1    0.2 CLI RX|VCL compilation failed
**   v1    0.2 VCL compilation failed (as expected)
***  v1    0.2 Found expected string: ("Mandatory field 'host' missing.")
*    top   0.2 RESETTING after ../../../bin/varnishtest/tests/v00038.vtc
**   v1    0.2 Wait
**** v1    0.2 CLI TX|backend.list
***  v1    0.2 CLI RX  101
**** v1    0.2 CLI RX|Unknown request in manager process (child not running).
**** v1    0.2 CLI RX|Type 'help' for more info.
**   v1    0.2 Stop
**** v1    0.2 CLI TX|stop
***  v1    0.2 CLI RX  300
**** v1    0.2 CLI RX|Child in state stopped
**** v1    0.2 CLI TX|status
***  v1    0.2 CLI RX  200
**** v1    0.2 CLI RX|Child in state stopped
**** v1    0.2 STDOUT poll 0x10
**   v1    0.2 R 72087 Status: 0000 (u 0.019000 s 0.060000)
*    diag  0.0 ............................................................
#    top  TEST ../../../bin/varnishtest/tests/v00038.vtc TIMED OUT (kill -9)
#    top  TEST ../../../bin/varnishtest/tests/v00038.vtc FAILED (60.003) signal=9

1 @ SunOS 5.11 i86pc 1.04 32_sun12.4 uplex

*    top   0.0 TEST ../../../bin/varnishtest/tests/v00038.vtc starting
[...]
*    top   0.0 TEST VCL compiler coverage test: vcc_backend.c
[...]
**** v1    0.2 CLI RX|
**** v1    0.2 CLI RX|Running VCC-compiler failed, exited with 2
**** v1    0.2 CLI RX|VCL compilation failed
**   v1    0.2 VCL compilation failed (as expected)
***  v1    0.2 Found expected string: ("Unknown field:")
**   top   0.2 === varnish v1 -errvcl "Mandatory field 'host' missing." {
**** v1    0.2 CLI TX|vcl.inline vcl12 << %XJEIFLH|)Xspa8P
**** v1    0.2 CLI TX|vcl 4.0;
**** v1    0.2 CLI TX|
**** v1    0.2 CLI TX|\tbackend b1 {
**** v1    0.2 CLI TX|\t\t.port = "NONE";
**** v1    0.2 CLI TX|\t}
**** v1    0.2 CLI TX|
**** v1    0.2 CLI TX|%XJEIFLH|)Xspa8P
***  v1    0.2 CLI RX  106
**** v1    0.2 CLI RX|Message from VCC-compiler:
**** v1    0.2 CLI RX|Security: Privilege proc_setid missing, will not change uid/gid
**** v1    0.2 CLI RX|Mandatory field 'host' missing.
**** v1    0.2 CLI RX|Running VCC-compiler failed, exited with 2
**** v1    0.2 CLI RX|VCL compilation failed
**   v1    0.2 VCL compilation failed (as expected)
***  v1    0.2 Found expected string: ("Mandatory field 'host' missing.")
*    top   0.2 RESETTING after ../../../bin/varnishtest/tests/v00038.vtc
**   v1    0.2 Wait
**** v1    0.2 CLI TX|backend.list
***  v1    0.2 CLI RX  101
**** v1    0.2 CLI RX|Unknown request in manager process (child not running).
**** v1    0.2 CLI RX|Type 'help' for more info.
**   v1    0.2 Stop
**** v1    0.2 CLI TX|stop
***  v1    0.2 CLI RX  300
**** v1    0.2 CLI RX|Child in state stopped
**** v1    0.2 CLI TX|status
***  v1    0.2 CLI RX  200
**** v1    0.2 CLI RX|Child in state stopped
**** v1    0.2 STDOUT poll 0x10
**   v1    0.2 R 5012 Status: 0000 (u 0.005000 s 0.031000)
*    diag  0.0 ............................................................
#    top  TEST ../../../bin/varnishtest/tests/v00038.vtc TIMED OUT (kill -9)
#    top  TEST ../../../bin/varnishtest/tests/v00038.vtc FAILED (60.002) signal=9

1 @ SunOS 5.11 i86pc 1.04 32_sun12.4 uplex

*    top   0.0 TEST ../../../bin/varnishtest/tests/v00038.vtc starting
[...]
*    top   0.0 TEST VCL compiler coverage test: vcc_backend.c
[...]
**** v1    0.2 CLI RX|
**** v1    0.2 CLI RX|Running VCC-compiler failed, exited with 2
**** v1    0.2 CLI RX|VCL compilation failed
**   v1    0.2 VCL compilation failed (as expected)
***  v1    0.2 Found expected string: ("Unknown field:")
**   top   0.2 === varnish v1 -errvcl "Mandatory field 'host' missing." {
**** v1    0.2 CLI TX|vcl.inline vcl12 << %XJEIFLH|)Xspa8P
**** v1    0.2 CLI TX|vcl 4.0;
**** v1    0.2 CLI TX|
**** v1    0.2 CLI TX|\tbackend b1 {
**** v1    0.2 CLI TX|\t\t.port = "NONE";
**** v1    0.2 CLI TX|\t}
**** v1    0.2 CLI TX|
**** v1    0.2 CLI TX|%XJEIFLH|)Xspa8P
***  v1    0.2 CLI RX  106
**** v1    0.2 CLI RX|Message from VCC-compiler:
**** v1    0.2 CLI RX|Security: Privilege proc_setid missing, will not change uid/gid
**** v1    0.2 CLI RX|Mandatory field 'host' missing.
**** v1    0.2 CLI RX|Running VCC-compiler failed, exited with 2
**** v1    0.2 CLI RX|VCL compilation failed
**   v1    0.2 VCL compilation failed (as expected)
***  v1    0.2 Found expected string: ("Mandatory field 'host' missing.")
*    top   0.2 RESETTING after ../../../bin/varnishtest/tests/v00038.vtc
**   v1    0.2 Wait
**** v1    0.2 CLI TX|backend.list
***  v1    0.2 CLI RX  101
**** v1    0.2 CLI RX|Unknown request in manager process (child not running).
**** v1    0.2 CLI RX|Type 'help' for more info.
**   v1    0.2 Stop
**** v1    0.2 CLI TX|stop
***  v1    0.2 CLI RX  300
**** v1    0.2 CLI RX|Child in state stopped
**** v1    0.2 CLI TX|status
***  v1    0.2 CLI RX  200
**** v1    0.2 CLI RX|Child in state stopped
**** v1    0.2 STDOUT poll 0x10
**   v1    0.2 R 37538 Status: 0000 (u 0.005000 s 0.030000)
*    diag  0.0 ............................................................
#    top  TEST ../../../bin/varnishtest/tests/v00038.vtc TIMED OUT (kill -9)
#    top  TEST ../../../bin/varnishtest/tests/v00038.vtc FAILED (60.002) signal=9

1 @ SunOS 5.11 i86pc 1.04 32_gcc4.7 uplex

*    top   0.0 TEST ../../../bin/varnishtest/tests/v00038.vtc starting
[...]
*    top   0.0 TEST VCL compiler coverage test: vcc_backend.c
[...]
**** v1    0.2 CLI RX|
**** v1    0.2 CLI RX|Running VCC-compiler failed, exited with 2
**** v1    0.2 CLI RX|VCL compilation failed
**   v1    0.2 VCL compilation failed (as expected)
***  v1    0.2 Found expected string: ("Unknown field:")
**   top   0.2 === varnish v1 -errvcl "Mandatory field 'host' missing." {
**** v1    0.2 CLI TX|vcl.inline vcl12 << %XJEIFLH|)Xspa8P
**** v1    0.2 CLI TX|vcl 4.0;
**** v1    0.2 CLI TX|
**** v1    0.2 CLI TX|\tbackend b1 {
**** v1    0.2 CLI TX|\t\t.port = "NONE";
**** v1    0.2 CLI TX|\t}
**** v1    0.2 CLI TX|
**** v1    0.2 CLI TX|%XJEIFLH|)Xspa8P
***  v1    0.2 CLI RX  106
**** v1    0.2 CLI RX|Message from VCC-compiler:
**** v1    0.2 CLI RX|Security: Privilege proc_setid missing, will not change uid/gid
**** v1    0.2 CLI RX|Mandatory field 'host' missing.
**** v1    0.2 CLI RX|Running VCC-compiler failed, exited with 2
**** v1    0.2 CLI RX|VCL compilation failed
**   v1    0.2 VCL compilation failed (as expected)
***  v1    0.2 Found expected string: ("Mandatory field 'host' missing.")
*    top   0.2 RESETTING after ../../../bin/varnishtest/tests/v00038.vtc
**   v1    0.2 Wait
**** v1    0.2 CLI TX|backend.list
***  v1    0.2 CLI RX  101
**** v1    0.2 CLI RX|Unknown request in manager process (child not running).
**** v1    0.2 CLI RX|Type 'help' for more info.
**   v1    0.2 Stop
**** v1    0.2 CLI TX|stop
***  v1    0.2 CLI RX  300
**** v1    0.2 CLI RX|Child in state stopped
**** v1    0.2 CLI TX|status
***  v1    0.2 CLI RX  200
**** v1    0.2 CLI RX|Child in state stopped
**** v1    0.2 STDOUT poll 0x10
**   v1    0.2 R 57270 Status: 0000 (u 0.005000 s 0.033000)
*    diag  0.0 ............................................................
#    top  TEST ../../../bin/varnishtest/tests/v00038.vtc TIMED OUT (kill -9)
#    top  TEST ../../../bin/varnishtest/tests/v00038.vtc FAILED (60.002) signal=9

1 @ SunOS 5.11 i86pc 1.04 64_gcc4.7 uplex

*    top   0.0 TEST ../../../bin/varnishtest/tests/v00038.vtc starting
[...]
*    top   0.0 TEST VCL compiler coverage test: vcc_backend.c
[...]
**** v1    0.2 CLI RX|
**** v1    0.2 CLI RX|Running VCC-compiler failed, exited with 2
**** v1    0.2 CLI RX|VCL compilation failed
**   v1    0.2 VCL compilation failed (as expected)
***  v1    0.2 Found expected string: ("Unknown field:")
**   top   0.2 === varnish v1 -errvcl "Mandatory field 'host' missing." {
**** v1    0.2 CLI TX|vcl.inline vcl12 << %XJEIFLH|)Xspa8P
**** v1    0.2 CLI TX|vcl 4.0;
**** v1    0.2 CLI TX|
**** v1    0.2 CLI TX|\tbackend b1 {
**** v1    0.2 CLI TX|\t\t.port = "NONE";
**** v1    0.2 CLI TX|\t}
**** v1    0.2 CLI TX|
**** v1    0.2 CLI TX|%XJEIFLH|)Xspa8P
***  v1    0.2 CLI RX  106
**** v1    0.2 CLI RX|Message from VCC-compiler:
**** v1    0.2 CLI RX|Security: Privilege proc_setid missing, will not change uid/gid
**** v1    0.2 CLI RX|Mandatory field 'host' missing.
**** v1    0.2 CLI RX|Running VCC-compiler failed, exited with 2
**** v1    0.2 CLI RX|VCL compilation failed
**   v1    0.2 VCL compilation failed (as expected)
***  v1    0.2 Found expected string: ("Mandatory field 'host' missing.")
*    top   0.2 RESETTING after ../../../bin/varnishtest/tests/v00038.vtc
**   v1    0.2 Wait
**** v1    0.2 CLI TX|backend.list
***  v1    0.2 CLI RX  101
**** v1    0.2 CLI RX|Unknown request in manager process (child not running).
**** v1    0.2 CLI RX|Type 'help' for more info.
**   v1    0.2 Stop
**** v1    0.2 CLI TX|stop
***  v1    0.2 CLI RX  300
**** v1    0.2 CLI RX|Child in state stopped
**** v1    0.2 CLI TX|status
***  v1    0.2 CLI RX  200
**** v1    0.2 CLI RX|Child in state stopped
**** v1    0.2 STDOUT poll 0x10
**   v1    0.2 R 32634 Status: 0000 (u 0.014000 s 0.056000)
*    diag  0.0 ............................................................
#    top  TEST ../../../bin/varnishtest/tests/v00038.vtc TIMED OUT (kill -9)
#    top  TEST ../../../bin/varnishtest/tests/v00038.vtc FAILED (60.005) signal=9

1 @ SunOS 5.11 i86pc 1.04 64_sun12.4 uplex

*    top   0.0 TEST ../../../bin/varnishtest/tests/v00038.vtc starting
[...]
*    top   0.0 TEST VCL compiler coverage test: vcc_backend.c
[...]
**** v1    0.2 CLI RX|
**** v1    0.2 CLI RX|Running VCC-compiler failed, exited with 2
**** v1    0.2 CLI RX|VCL compilation failed
**   v1    0.2 VCL compilation failed (as expected)
***  v1    0.2 Found expected string: ("Unknown field:")
**   top   0.2 === varnish v1 -errvcl "Mandatory field 'host' missing." {
**** v1    0.2 CLI TX|vcl.inline vcl12 << %XJEIFLH|)Xspa8P
**** v1    0.2 CLI TX|vcl 4.0;
**** v1    0.2 CLI TX|
**** v1    0.2 CLI TX|\tbackend b1 {
**** v1    0.2 CLI TX|\t\t.port = "NONE";
**** v1    0.2 CLI TX|\t}
**** v1    0.2 CLI TX|
**** v1    0.2 CLI TX|%XJEIFLH|)Xspa8P
***  v1    0.2 CLI RX  106
**** v1    0.2 CLI RX|Message from VCC-compiler:
**** v1    0.2 CLI RX|Security: Privilege proc_setid missing, will not change uid/gid
**** v1    0.2 CLI RX|Mandatory field 'host' missing.
**** v1    0.2 CLI RX|Running VCC-compiler failed, exited with 2
**** v1    0.2 CLI RX|VCL compilation failed
**   v1    0.2 VCL compilation failed (as expected)
***  v1    0.2 Found expected string: ("Mandatory field 'host' missing.")
*    top   0.2 RESETTING after ../../../bin/varnishtest/tests/v00038.vtc
**   v1    0.2 Wait
**** v1    0.2 CLI TX|backend.list
***  v1    0.2 CLI RX  101
**** v1    0.2 CLI RX|Unknown request in manager process (child not running).
**** v1    0.2 CLI RX|Type 'help' for more info.
**   v1    0.2 Stop
**** v1    0.2 CLI TX|stop
***  v1    0.2 CLI RX  300
**** v1    0.2 CLI RX|Child in state stopped
**** v1    0.2 CLI TX|status
***  v1    0.2 CLI RX  200
**** v1    0.2 CLI RX|Child in state stopped
**** v1    0.2 STDOUT poll 0x10
**   v1    0.2 R 34496 Status: 0000 (u 0.022000 s 0.058000)
*    diag  0.0 ............................................................
#    top  TEST ../../../bin/varnishtest/tests/v00038.vtc TIMED OUT (kill -9)
#    top  TEST ../../../bin/varnishtest/tests/v00038.vtc FAILED (60.004) signal=9

1 @ SunOS 5.11 i86pc 1.04 64_gcc4.7 uplex

*    top   0.0 TEST ../../../bin/varnishtest/tests/v00038.vtc starting
[...]
*    top   0.0 TEST VCL compiler coverage test: vcc_backend.c
[...]
**** v1    0.2 CLI RX|
**** v1    0.2 CLI RX|Running VCC-compiler failed, exited with 2
**** v1    0.2 CLI RX|VCL compilation failed
**   v1    0.2 VCL compilation failed (as expected)
***  v1    0.2 Found expected string: ("Unknown field:")
**   top   0.2 === varnish v1 -errvcl "Mandatory field 'host' missing." {
**** v1    0.2 CLI TX|vcl.inline vcl12 << %XJEIFLH|)Xspa8P
**** v1    0.2 CLI TX|vcl 4.0;
**** v1    0.2 CLI TX|
**** v1    0.2 CLI TX|\tbackend b1 {
**** v1    0.2 CLI TX|\t\t.port = "NONE";
**** v1    0.2 CLI TX|\t}
**** v1    0.2 CLI TX|
**** v1    0.2 CLI TX|%XJEIFLH|)Xspa8P
***  v1    0.2 CLI RX  106
**** v1    0.2 CLI RX|Message from VCC-compiler:
**** v1    0.2 CLI RX|Security: Privilege proc_setid missing, will not change uid/gid
**** v1    0.2 CLI RX|Mandatory field 'host' missing.
**** v1    0.2 CLI RX|Running VCC-compiler failed, exited with 2
**** v1    0.2 CLI RX|VCL compilation failed
**   v1    0.2 VCL compilation failed (as expected)
***  v1    0.2 Found expected string: ("Mandatory field 'host' missing.")
*    top   0.2 RESETTING after ../../../bin/varnishtest/tests/v00038.vtc
**   v1    0.2 Wait
**** v1    0.2 CLI TX|backend.list
***  v1    0.2 CLI RX  101
**** v1    0.2 CLI RX|Unknown request in manager process (child not running).
**** v1    0.2 CLI RX|Type 'help' for more info.
**   v1    0.2 Stop
**** v1    0.2 CLI TX|stop
***  v1    0.2 CLI RX  300
**** v1    0.2 CLI RX|Child in state stopped
**** v1    0.2 CLI TX|status
***  v1    0.2 CLI RX  200
**** v1    0.2 CLI RX|Child in state stopped
**** v1    0.2 STDOUT poll 0x10
**   v1    0.2 R 31700 Status: 0000 (u 0.015000 s 0.056000)
*    diag  0.0 ............................................................
#    top  TEST ../../../bin/varnishtest/tests/v00038.vtc TIMED OUT (kill -9)
#    top  TEST ../../../bin/varnishtest/tests/v00038.vtc FAILED (60.003) signal=9

1 @ SunOS 5.11 i86pc 1.04 32_sun12.4 uplex

*    top   0.0 TEST ../../../bin/varnishtest/tests/v00038.vtc starting
[...]
*    top   0.0 TEST VCL compiler coverage test: vcc_backend.c
[...]
**** v1    0.2 CLI RX|
**** v1    0.2 CLI RX|Running VCC-compiler failed, exited with 2
**** v1    0.2 CLI RX|VCL compilation failed
**   v1    0.2 VCL compilation failed (as expected)
***  v1    0.2 Found expected string: ("Unknown field:")
**   top   0.2 === varnish v1 -errvcl "Mandatory field 'host' missing." {
**** v1    0.2 CLI TX|vcl.inline vcl12 << %XJEIFLH|)Xspa8P
**** v1    0.2 CLI TX|vcl 4.0;
**** v1    0.2 CLI TX|
**** v1    0.2 CLI TX|\tbackend b1 {
**** v1    0.2 CLI TX|\t\t.port = "NONE";
**** v1    0.2 CLI TX|\t}
**** v1    0.2 CLI TX|
**** v1    0.2 CLI TX|%XJEIFLH|)Xspa8P
***  v1    0.2 CLI RX  106
**** v1    0.2 CLI RX|Message from VCC-compiler:
**** v1    0.2 CLI RX|Security: Privilege proc_setid missing, will not change uid/gid
**** v1    0.2 CLI RX|Mandatory field 'host' missing.
**** v1    0.2 CLI RX|Running VCC-compiler failed, exited with 2
**** v1    0.2 CLI RX|VCL compilation failed
**   v1    0.2 VCL compilation failed (as expected)
***  v1    0.2 Found expected string: ("Mandatory field 'host' missing.")
*    top   0.2 RESETTING after ../../../bin/varnishtest/tests/v00038.vtc
**   v1    0.2 Wait
**** v1    0.2 CLI TX|backend.list
***  v1    0.2 CLI RX  101
**** v1    0.2 CLI RX|Unknown request in manager process (child not running).
**** v1    0.2 CLI RX|Type 'help' for more info.
**   v1    0.2 Stop
**** v1    0.2 CLI TX|stop
***  v1    0.2 CLI RX  300
**** v1    0.2 CLI RX|Child in state stopped
**** v1    0.2 CLI TX|status
***  v1    0.2 CLI RX  200
**** v1    0.2 CLI RX|Child in state stopped
**** v1    0.2 STDOUT poll 0x10
**   v1    0.2 R 74343 Status: 0000 (u 0.008000 s 0.044000)
*    diag  0.0 ............................................................
#    top  TEST ../../../bin/varnishtest/tests/v00038.vtc TIMED OUT (kill -9)
#    top  TEST ../../../bin/varnishtest/tests/v00038.vtc FAILED (60.003) signal=9

1 @ SunOS 5.11 i86pc 1.04 64_gcc4.7 uplex

*    top   0.0 TEST ../../../bin/varnishtest/tests/v00038.vtc starting
[...]
*    top   0.0 TEST VCL compiler coverage test: vcc_backend.c
[...]
**** v1    0.2 CLI RX|
**** v1    0.2 CLI RX|Running VCC-compiler failed, exited with 2
**** v1    0.2 CLI RX|VCL compilation failed
**   v1    0.2 VCL compilation failed (as expected)
***  v1    0.2 Found expected string: ("Unknown field:")
**   top   0.2 === varnish v1 -errvcl "Mandatory field 'host' missing." {
**** v1    0.2 CLI TX|vcl.inline vcl12 << %XJEIFLH|)Xspa8P
**** v1    0.2 CLI TX|vcl 4.0;
**** v1    0.2 CLI TX|
**** v1    0.2 CLI TX|\tbackend b1 {
**** v1    0.2 CLI TX|\t\t.port = "NONE";
**** v1    0.2 CLI TX|\t}
**** v1    0.2 CLI TX|
**** v1    0.2 CLI TX|%XJEIFLH|)Xspa8P
***  v1    0.2 CLI RX  106
**** v1    0.2 CLI RX|Message from VCC-compiler:
**** v1    0.2 CLI RX|Security: Privilege proc_setid missing, will not change uid/gid
**** v1    0.2 CLI RX|Mandatory field 'host' missing.
**** v1    0.2 CLI RX|Running VCC-compiler failed, exited with 2
**** v1    0.2 CLI RX|VCL compilation failed
**   v1    0.2 VCL compilation failed (as expected)
***  v1    0.2 Found expected string: ("Mandatory field 'host' missing.")
*    top   0.2 RESETTING after ../../../bin/varnishtest/tests/v00038.vtc
**   v1    0.2 Wait
**** v1    0.2 CLI TX|backend.list
***  v1    0.2 CLI RX  101
**** v1    0.2 CLI RX|Unknown request in manager process (child not running).
**** v1    0.2 CLI RX|Type 'help' for more info.
**   v1    0.2 Stop
**** v1    0.2 CLI TX|stop
***  v1    0.2 CLI RX  300
**** v1    0.2 CLI RX|Child in state stopped
**** v1    0.2 CLI TX|status
***  v1    0.2 CLI RX  200
**** v1    0.2 CLI RX|Child in state stopped
**** v1    0.2 STDOUT poll 0x10
**   v1    0.2 R 29183 Status: 0000 (u 0.014000 s 0.060000)
*    diag  0.0 ............................................................
#    top  TEST ../../../bin/varnishtest/tests/v00038.vtc TIMED OUT (kill -9)
#    top  TEST ../../../bin/varnishtest/tests/v00038.vtc FAILED (60.004) signal=9

1 @ SunOS 5.11 i86pc 1.04 64_gcc4.7 uplex

*    top   0.0 TEST ../../../bin/varnishtest/tests/v00038.vtc starting
[...]
*    top   0.0 TEST VCL compiler coverage test: vcc_backend.c
[...]
**** v1    0.2 CLI RX|
**** v1    0.2 CLI RX|Running VCC-compiler failed, exited with 2
**** v1    0.2 CLI RX|VCL compilation failed
**   v1    0.2 VCL compilation failed (as expected)
***  v1    0.2 Found expected string: ("Unknown field:")
**   top   0.2 === varnish v1 -errvcl "Mandatory field 'host' missing." {
**** v1    0.2 CLI TX|vcl.inline vcl12 << %XJEIFLH|)Xspa8P
**** v1    0.2 CLI TX|vcl 4.0;
**** v1    0.2 CLI TX|
**** v1    0.2 CLI TX|\tbackend b1 {
**** v1    0.2 CLI TX|\t\t.port = "NONE";
**** v1    0.2 CLI TX|\t}
**** v1    0.2 CLI TX|
**** v1    0.2 CLI TX|%XJEIFLH|)Xspa8P
***  v1    0.2 CLI RX  106
**** v1    0.2 CLI RX|Message from VCC-compiler:
**** v1    0.2 CLI RX|Security: Privilege proc_setid missing, will not change uid/gid
**** v1    0.2 CLI RX|Mandatory field 'host' missing.
**** v1    0.2 CLI RX|Running VCC-compiler failed, exited with 2
**** v1    0.2 CLI RX|VCL compilation failed
**   v1    0.2 VCL compilation failed (as expected)
***  v1    0.2 Found expected string: ("Mandatory field 'host' missing.")
*    top   0.2 RESETTING after ../../../bin/varnishtest/tests/v00038.vtc
**   v1    0.2 Wait
**** v1    0.2 CLI TX|backend.list
***  v1    0.2 CLI RX  101
**** v1    0.2 CLI RX|Unknown request in manager process (child not running).
**** v1    0.2 CLI RX|Type 'help' for more info.
**   v1    0.2 Stop
**** v1    0.2 CLI TX|stop
***  v1    0.2 CLI RX  300
**** v1    0.2 CLI RX|Child in state stopped
**** v1    0.2 CLI TX|status
***  v1    0.2 CLI RX  200
**** v1    0.2 CLI RX|Child in state stopped
**** v1    0.2 STDOUT poll 0x10
**   v1    0.2 R 5428 Status: 0000 (u 0.026000 s 0.088000)
*    diag  0.0 ............................................................
#    top  TEST ../../../bin/varnishtest/tests/v00038.vtc TIMED OUT (kill -9)
#    top  TEST ../../../bin/varnishtest/tests/v00038.vtc FAILED (60.005) signal=9

1 @ SunOS 5.11 i86pc 1.04 64_sun12.4 uplex

*    top   0.0 TEST ../../../bin/varnishtest/tests/v00038.vtc starting
[...]
*    top   0.0 TEST VCL compiler coverage test: vcc_backend.c
[...]
**** v1    0.2 CLI RX|
**** v1    0.2 CLI RX|Running VCC-compiler failed, exited with 2
**** v1    0.2 CLI RX|VCL compilation failed
**   v1    0.2 VCL compilation failed (as expected)
***  v1    0.2 Found expected string: ("Unknown field:")
**   top   0.2 === varnish v1 -errvcl "Mandatory field 'host' missing." {
**** v1    0.2 CLI TX|vcl.inline vcl12 << %XJEIFLH|)Xspa8P
**** v1    0.2 CLI TX|vcl 4.0;
**** v1    0.2 CLI TX|
**** v1    0.2 CLI TX|\tbackend b1 {
**** v1    0.2 CLI TX|\t\t.port = "NONE";
**** v1    0.2 CLI TX|\t}
**** v1    0.2 CLI TX|
**** v1    0.2 CLI TX|%XJEIFLH|)Xspa8P
***  v1    0.2 CLI RX  106
**** v1    0.2 CLI RX|Message from VCC-compiler:
**** v1    0.2 CLI RX|Security: Privilege proc_setid missing, will not change uid/gid
**** v1    0.2 CLI RX|Mandatory field 'host' missing.
**** v1    0.2 CLI RX|Running VCC-compiler failed, exited with 2
**** v1    0.2 CLI RX|VCL compilation failed
**   v1    0.2 VCL compilation failed (as expected)
***  v1    0.2 Found expected string: ("Mandatory field 'host' missing.")
*    top   0.2 RESETTING after ../../../bin/varnishtest/tests/v00038.vtc
**   v1    0.2 Wait
**** v1    0.2 CLI TX|backend.list
***  v1    0.2 CLI RX  101
**** v1    0.2 CLI RX|Unknown request in manager process (child not running).
**** v1    0.2 CLI RX|Type 'help' for more info.
**   v1    0.2 Stop
**** v1    0.2 CLI TX|stop
***  v1    0.2 CLI RX  300
**** v1    0.2 CLI RX|Child in state stopped
**** v1    0.2 CLI TX|status
***  v1    0.2 CLI RX  200
**** v1    0.2 CLI RX|Child in state stopped
**** v1    0.2 STDOUT poll 0x10
**   v1    0.2 R 66098 Status: 0000 (u 0.021000 s 0.060000)
*    diag  0.0 ............................................................
#    top  TEST ../../../bin/varnishtest/tests/v00038.vtc TIMED OUT (kill -9)
#    top  TEST ../../../bin/varnishtest/tests/v00038.vtc FAILED (60.005) signal=9