v00041

5939523

1 @ SunOS 5.11 i86pc 1.04 64_gcc4.7 uplex

*    top   0.0 TEST ../../../bin/varnishtest/tests/v00041.vtc starting
[...]
*    top   0.0 TEST Test priv_task
[...]
**** v1    0.1 CLI TX|\t\tset beresp.http.bx1 = debug.test_priv_task("");
**** v1    0.1 CLI TX|\t\tset beresp.http.bo1 = obj.test_priv_task("");
**** v1    0.1 CLI TX|\t}
**** v1    0.1 CLI TX|
**** v1    0.1 CLI TX|\tsub vcl_fini {
**** v1    0.1 CLI TX|\t\tdebug.test_priv_task("cleaning");
**** v1    0.1 CLI TX|\t\tdebug.test_priv_task("up");
**** v1    0.1 CLI TX|\t\tstd.log("func " + debug.test_priv_task());
**** v1    0.1 CLI TX|\t\tstd.log("obj "  + obj.test_priv_task());
**** v1    0.1 CLI TX|\t}
**** v1    0.1 CLI TX|
**** v1    0.1 CLI TX|
**** v1    0.1 CLI TX|%XJEIFLH|)Xspa8P
***  v1    0.2 CLI RX  106
**** v1    0.2 CLI RX|Message from VCC-compiler:
**** v1    0.2 CLI RX|Security: Privilege proc_setid missing, will not change uid/gid
**** v1    0.2 CLI RX|Could not load VMOD debug
**** v1    0.2 CLI RX|\tFile name: libvmod_debug.so
**** v1    0.2 CLI RX|\tdlerror: ld.so.1: varnishd: fatal: /tmp/vtest.64_gcc4.7/varnish-cache/varnish-trunk/_build/lib/libvmod_blob/.libs/libvmod_debug.so: open failed: No such file or directory
**** v1    0.2 CLI RX|('<vcl.inline>' Line 5 Pos 16)
**** v1    0.2 CLI RX|        import debug;
**** v1    0.2 CLI RX|---------------#####-
**** v1    0.2 CLI RX|
**** v1    0.2 CLI RX|Running VCC-compiler failed, exited with 2
**** v1    0.2 CLI RX|VCL compilation failed
---- v1    0.2 FAIL VCL does not compile
*    top   0.2 RESETTING after ../../../bin/varnishtest/tests/v00041.vtc
**   s1    0.2 Waiting for server (3/-1)
**** s1    0.2 macro undef s1_addr
**** s1    0.2 macro undef s1_port
**** s1    0.2 macro undef s1_sock
**   v1    0.2 Wait
**** v1    0.2 CLI TX|panic.clear
***  v1    0.2 CLI RX  300
**** v1    0.2 CLI RX|No panic to clear
**** v1    0.2 STDOUT poll 0x10
**   v1    0.2 R 10686 Status: 0000 (u 0.009000 s 0.028000)
***  v1    0.2 vsl|No VSL chunk found (child not started ?)
*    top   0.2 TEST ../../../bin/varnishtest/tests/v00041.vtc FAILED
#    top  TEST ../../../bin/varnishtest/tests/v00041.vtc FAILED (0.248) exit=2

1 @ SunOS 5.11 i86pc 1.04 64_sun12.4 uplex

*    top   0.0 TEST ../../../bin/varnishtest/tests/v00041.vtc starting
[...]
*    top   0.0 TEST Test priv_task
[...]
**** v1    0.1 CLI TX|\t\tset beresp.http.bx1 = debug.test_priv_task("");
**** v1    0.1 CLI TX|\t\tset beresp.http.bo1 = obj.test_priv_task("");
**** v1    0.1 CLI TX|\t}
**** v1    0.1 CLI TX|
**** v1    0.1 CLI TX|\tsub vcl_fini {
**** v1    0.1 CLI TX|\t\tdebug.test_priv_task("cleaning");
**** v1    0.1 CLI TX|\t\tdebug.test_priv_task("up");
**** v1    0.1 CLI TX|\t\tstd.log("func " + debug.test_priv_task());
**** v1    0.1 CLI TX|\t\tstd.log("obj "  + obj.test_priv_task());
**** v1    0.1 CLI TX|\t}
**** v1    0.1 CLI TX|
**** v1    0.1 CLI TX|
**** v1    0.1 CLI TX|%XJEIFLH|)Xspa8P
***  v1    0.2 CLI RX  106
**** v1    0.2 CLI RX|Message from VCC-compiler:
**** v1    0.2 CLI RX|Security: Privilege proc_setid missing, will not change uid/gid
**** v1    0.2 CLI RX|Could not load VMOD debug
**** v1    0.2 CLI RX|\tFile name: libvmod_debug.so
**** v1    0.2 CLI RX|\tdlerror: ld.so.1: varnishd: fatal: /tmp/vtest.64_sun12.4/varnish-cache/varnish-trunk/_build/lib/libvmod_blob/.libs/libvmod_debug.so: open failed: No such file or directory
**** v1    0.2 CLI RX|('<vcl.inline>' Line 5 Pos 16)
**** v1    0.2 CLI RX|        import debug;
**** v1    0.2 CLI RX|---------------#####-
**** v1    0.2 CLI RX|
**** v1    0.2 CLI RX|Running VCC-compiler failed, exited with 2
**** v1    0.2 CLI RX|VCL compilation failed
---- v1    0.2 FAIL VCL does not compile
*    top   0.2 RESETTING after ../../../bin/varnishtest/tests/v00041.vtc
**   s1    0.2 Waiting for server (3/-1)
**** s1    0.2 macro undef s1_addr
**** s1    0.2 macro undef s1_port
**** s1    0.2 macro undef s1_sock
**   v1    0.2 Wait
**** v1    0.2 CLI TX|panic.clear
***  v1    0.2 CLI RX  300
**** v1    0.2 CLI RX|No panic to clear
**** v1    0.2 STDOUT poll 0x10
**   v1    0.2 R 95183 Status: 0000 (u 0.008000 s 0.027000)
***  v1    0.2 vsl|No VSL chunk found (child not started ?)
*    top   0.2 TEST ../../../bin/varnishtest/tests/v00041.vtc FAILED
#    top  TEST ../../../bin/varnishtest/tests/v00041.vtc FAILED (0.249) exit=2

1 @ SunOS 5.11 i86pc 1.04 64_sun12.4 uplex

*    top   0.0 TEST ../../../bin/varnishtest/tests/v00041.vtc starting
[...]
*    top   0.0 TEST Test priv_task
[...]
**** v1    0.2 CLI TX|\t\tset beresp.http.bx1 = debug.test_priv_task("");
**** v1    0.2 CLI TX|\t\tset beresp.http.bo1 = obj.test_priv_task("");
**** v1    0.2 CLI TX|\t}
**** v1    0.2 CLI TX|
**** v1    0.2 CLI TX|\tsub vcl_fini {
**** v1    0.2 CLI TX|\t\tdebug.test_priv_task("cleaning");
**** v1    0.2 CLI TX|\t\tdebug.test_priv_task("up");
**** v1    0.2 CLI TX|\t\tstd.log("func " + debug.test_priv_task());
**** v1    0.2 CLI TX|\t\tstd.log("obj "  + obj.test_priv_task());
**** v1    0.2 CLI TX|\t}
**** v1    0.2 CLI TX|
**** v1    0.2 CLI TX|
**** v1    0.2 CLI TX|%XJEIFLH|)Xspa8P
***  v1    0.2 CLI RX  106
**** v1    0.2 CLI RX|Message from VCC-compiler:
**** v1    0.2 CLI RX|Security: Privilege proc_setid missing, will not change uid/gid
**** v1    0.2 CLI RX|Could not load VMOD debug
**** v1    0.2 CLI RX|\tFile name: libvmod_debug.so
**** v1    0.2 CLI RX|\tdlerror: ld.so.1: varnishd: fatal: /tmp/vtest.64_sun12.4/varnish-cache/varnish-trunk/_build/lib/libvmod_blob/.libs/libvmod_debug.so: open failed: No such file or directory
**** v1    0.2 CLI RX|('<vcl.inline>' Line 5 Pos 16)
**** v1    0.2 CLI RX|        import debug;
**** v1    0.2 CLI RX|---------------#####-
**** v1    0.2 CLI RX|
**** v1    0.2 CLI RX|Running VCC-compiler failed, exited with 2
**** v1    0.2 CLI RX|VCL compilation failed
---- v1    0.2 FAIL VCL does not compile
*    top   0.2 RESETTING after ../../../bin/varnishtest/tests/v00041.vtc
**   s1    0.2 Waiting for server (3/-1)
**** s1    0.2 macro undef s1_addr
**** s1    0.2 macro undef s1_port
**** s1    0.2 macro undef s1_sock
**   v1    0.2 Wait
**** v1    0.2 CLI TX|panic.clear
***  v1    0.2 CLI RX  300
**** v1    0.2 CLI RX|No panic to clear
**** v1    0.2 STDOUT poll 0x10
**   v1    0.2 R 79041 Status: 0000 (u 0.015000 s 0.046000)
***  v1    0.3 vsl|No VSL chunk found (child not started ?)
*    top   0.3 TEST ../../../bin/varnishtest/tests/v00041.vtc FAILED
#    top  TEST ../../../bin/varnishtest/tests/v00041.vtc FAILED (0.280) exit=2

1 @ FreeBSD 11.0-REL-p12 i386 1.04 phk

*    top   0.0 TEST ../../../../bin/varnishtest/tests/v00041.vtc starting
[...]
*    top   0.0 TEST Test priv_task
[...]
**** v1    0.1 CLI TX|\t\tset beresp.http.bo1 = obj.test_priv_task("");
**** v1    0.1 CLI TX|\t}
**** v1    0.1 CLI TX|
**** v1    0.1 CLI TX|\tsub vcl_fini {
**** v1    0.1 CLI TX|\t\tdebug.test_priv_task("cleaning");
**** v1    0.1 CLI TX|\t\tdebug.test_priv_task("up");
**** v1    0.1 CLI TX|\t\tstd.log("func " + debug.test_priv_task());
**** v1    0.1 CLI TX|\t\tstd.log("obj "  + obj.test_priv_task());
**** v1    0.1 CLI TX|\t}
**** v1    0.1 CLI TX|
**** v1    0.1 CLI TX|
**** v1    0.1 CLI TX|%XJEIFLH|)Xspa8P
***  v1    0.2 vsl|No VSL chunk found (child not started ?)
***  v1    0.2 CLI RX  106
**** v1    0.2 CLI RX|Message from VCC-compiler:
**** v1    0.2 CLI RX|Could not load VMOD debug
**** v1    0.2 CLI RX|\tFile name: libvmod_debug.so
**** v1    0.2 CLI RX|\tdlerror: Cannot open "/root/VT/varnish-cache/varnish-trunk/_build/sub/lib/libvmod_blob/.libs/libvmod_debug.so"
**** v1    0.2 CLI RX|('<vcl.inline>' Line 5 Pos 16)
**** v1    0.2 CLI RX|        import debug;
**** v1    0.2 CLI RX|---------------#####-
**** v1    0.2 CLI RX|
**** v1    0.2 CLI RX|Running VCC-compiler failed, exited with 2
**** v1    0.2 CLI RX|VCL compilation failed
---- v1    0.2 FAIL VCL does not compile
*    top   0.2 RESETTING after ../../../../bin/varnishtest/tests/v00041.vtc
**   s1    0.2 Waiting for server (3/-1)
**** s1    0.2 macro undef s1_addr
**** s1    0.2 macro undef s1_port
**** s1    0.2 macro undef s1_sock
**   v1    0.2 Wait
**** v1    0.2 CLI TX|panic.clear
***  v1    0.3 CLI RX  300
**** v1    0.3 CLI RX|No panic to clear
***  v1    0.3 vsl|No VSL chunk found (child not started ?)
**** v1    0.3 STDOUT poll 0x11
**   v1    0.3 R 76150 Status: 0000 (u 0.005419 s 0.005419)
*    top   0.3 TEST ../../../../bin/varnishtest/tests/v00041.vtc FAILED
#    top  TEST ../../../../bin/varnishtest/tests/v00041.vtc FAILED (0.336) exit=2
FAIL tests/v00041.vtc (exit status: 2)

1 @ SunOS 5.11 i86pc 1.04 64_gcc4.7 uplex

*    top   0.0 TEST ../../../bin/varnishtest/tests/v00041.vtc starting
[...]
*    top   0.0 TEST Test priv_task
[...]
**** v1    0.1 CLI TX|\t\tset beresp.http.bx1 = debug.test_priv_task("");
**** v1    0.1 CLI TX|\t\tset beresp.http.bo1 = obj.test_priv_task("");
**** v1    0.1 CLI TX|\t}
**** v1    0.1 CLI TX|
**** v1    0.1 CLI TX|\tsub vcl_fini {
**** v1    0.1 CLI TX|\t\tdebug.test_priv_task("cleaning");
**** v1    0.1 CLI TX|\t\tdebug.test_priv_task("up");
**** v1    0.1 CLI TX|\t\tstd.log("func " + debug.test_priv_task());
**** v1    0.1 CLI TX|\t\tstd.log("obj "  + obj.test_priv_task());
**** v1    0.1 CLI TX|\t}
**** v1    0.1 CLI TX|
**** v1    0.1 CLI TX|
**** v1    0.1 CLI TX|%XJEIFLH|)Xspa8P
***  v1    0.2 CLI RX  106
**** v1    0.2 CLI RX|Message from VCC-compiler:
**** v1    0.2 CLI RX|Security: Privilege proc_setid missing, will not change uid/gid
**** v1    0.2 CLI RX|Could not load VMOD debug
**** v1    0.2 CLI RX|\tFile name: libvmod_debug.so
**** v1    0.2 CLI RX|\tdlerror: ld.so.1: varnishd: fatal: /tmp/vtest.64_gcc4.7/varnish-cache/varnish-trunk/_build/lib/libvmod_blob/.libs/libvmod_debug.so: open failed: No such file or directory
**** v1    0.2 CLI RX|('<vcl.inline>' Line 5 Pos 16)
**** v1    0.2 CLI RX|        import debug;
**** v1    0.2 CLI RX|---------------#####-
**** v1    0.2 CLI RX|
**** v1    0.2 CLI RX|Running VCC-compiler failed, exited with 2
**** v1    0.2 CLI RX|VCL compilation failed
---- v1    0.2 FAIL VCL does not compile
*    top   0.2 RESETTING after ../../../bin/varnishtest/tests/v00041.vtc
**   s1    0.2 Waiting for server (3/-1)
**** s1    0.2 macro undef s1_addr
**** s1    0.2 macro undef s1_port
**** s1    0.2 macro undef s1_sock
**   v1    0.2 Wait
**** v1    0.2 CLI TX|panic.clear
***  v1    0.2 CLI RX  300
**** v1    0.2 CLI RX|No panic to clear
**** v1    0.2 STDOUT poll 0x10
**   v1    0.2 R 95654 Status: 0000 (u 0.008000 s 0.029000)
***  v1    0.2 vsl|No VSL chunk found (child not started ?)
*    top   0.2 TEST ../../../bin/varnishtest/tests/v00041.vtc FAILED
#    top  TEST ../../../bin/varnishtest/tests/v00041.vtc FAILED (0.252) exit=2

1 @ SunOS 5.11 i86pc 1.04 32_gcc4.7 uplex

*    top   0.0 TEST ../../../bin/varnishtest/tests/v00041.vtc starting
[...]
*    top   0.0 TEST Test priv_task
[...]
**** v1    0.1 CLI TX|\t\tset beresp.http.bx1 = debug.test_priv_task("");
**** v1    0.1 CLI TX|\t\tset beresp.http.bo1 = obj.test_priv_task("");
**** v1    0.1 CLI TX|\t}
**** v1    0.1 CLI TX|
**** v1    0.1 CLI TX|\tsub vcl_fini {
**** v1    0.1 CLI TX|\t\tdebug.test_priv_task("cleaning");
**** v1    0.1 CLI TX|\t\tdebug.test_priv_task("up");
**** v1    0.1 CLI TX|\t\tstd.log("func " + debug.test_priv_task());
**** v1    0.1 CLI TX|\t\tstd.log("obj "  + obj.test_priv_task());
**** v1    0.1 CLI TX|\t}
**** v1    0.1 CLI TX|
**** v1    0.1 CLI TX|
**** v1    0.1 CLI TX|%XJEIFLH|)Xspa8P
***  v1    0.2 CLI RX  106
**** v1    0.2 CLI RX|Message from VCC-compiler:
**** v1    0.2 CLI RX|Security: Privilege proc_setid missing, will not change uid/gid
**** v1    0.2 CLI RX|Could not load VMOD debug
**** v1    0.2 CLI RX|\tFile name: libvmod_debug.so
**** v1    0.2 CLI RX|\tdlerror: ld.so.1: varnishd: fatal: /tmp/vtest.32_gcc4.7/varnish-cache/varnish-trunk/_build/lib/libvmod_blob/.libs/libvmod_debug.so: open failed: No such file or directory
**** v1    0.2 CLI RX|('<vcl.inline>' Line 5 Pos 16)
**** v1    0.2 CLI RX|        import debug;
**** v1    0.2 CLI RX|---------------#####-
**** v1    0.2 CLI RX|
**** v1    0.2 CLI RX|Running VCC-compiler failed, exited with 2
**** v1    0.2 CLI RX|VCL compilation failed
---- v1    0.2 FAIL VCL does not compile
*    top   0.2 RESETTING after ../../../bin/varnishtest/tests/v00041.vtc
**   s1    0.2 Waiting for server (3/-1)
**** s1    0.2 macro undef s1_addr
**** s1    0.2 macro undef s1_port
**** s1    0.2 macro undef s1_sock
**   v1    0.2 Wait
**** v1    0.2 CLI TX|panic.clear
***  v1    0.2 CLI RX  300
**** v1    0.2 CLI RX|No panic to clear
**** v1    0.2 STDOUT poll 0x10
**   v1    0.2 R 16197 Status: 0000 (u 0.007000 s 0.027000)
***  v1    0.2 vsl|No VSL chunk found (child not started ?)
*    top   0.2 TEST ../../../bin/varnishtest/tests/v00041.vtc FAILED
#    top  TEST ../../../bin/varnishtest/tests/v00041.vtc FAILED (0.251) exit=2

1 @ Ubuntu LTS i686 1.04 fgs

*    top   0.0 TEST ../../../bin/varnishtest/tests/v00041.vtc starting
[...]
*    top   0.0 TEST Test priv_task
[...]
**** v1    0.1 CLI TX|\tsub vcl_backend_response {
**** v1    0.1 CLI TX|\t\tset beresp.http.bx0 = bereq.http.bx0;
**** v1    0.1 CLI TX|\t\tset beresp.http.bx1 = debug.test_priv_task("");
**** v1    0.1 CLI TX|\t\tset beresp.http.bo1 = obj.test_priv_task("");
**** v1    0.1 CLI TX|\t}
**** v1    0.1 CLI TX|
**** v1    0.1 CLI TX|\tsub vcl_fini {
**** v1    0.1 CLI TX|\t\tdebug.test_priv_task("cleaning");
**** v1    0.1 CLI TX|\t\tdebug.test_priv_task("up");
**** v1    0.1 CLI TX|\t\tstd.log("func " + debug.test_priv_task());
**** v1    0.1 CLI TX|\t\tstd.log("obj "  + obj.test_priv_task());
**** v1    0.1 CLI TX|\t}
**** v1    0.1 CLI TX|
**** v1    0.1 CLI TX|
**** v1    0.1 CLI TX|%XJEIFLH|)Xspa8P
***  v1    0.1 CLI RX  106
**** v1    0.1 CLI RX|Message from VCC-compiler:
**** v1    0.1 CLI RX|Could not load VMOD debug
**** v1    0.1 CLI RX|\tFile name: libvmod_debug.so
**** v1    0.1 CLI RX|\tdlerror: /home/vtest/varnish-cache/tools/varnish-cache/varnish-trunk/_build/lib/libvmod_blob/.libs/libvmod_debug.so: cannot open shared object file: No such file or directory
**** v1    0.1 CLI RX|('<vcl.inline>' Line 5 Pos 16)
**** v1    0.1 CLI RX|        import debug;
**** v1    0.1 CLI RX|---------------#####-
**** v1    0.1 CLI RX|
**** v1    0.1 CLI RX|Running VCC-compiler failed, exited with 2
**** v1    0.1 CLI RX|VCL compilation failed
---- v1    0.1 FAIL VCL does not compile
*    top   0.1 RESETTING after ../../../bin/varnishtest/tests/v00041.vtc
**   s1    0.1 Waiting for server (4/-1)
**** s1    0.1 macro undef s1_addr
**** s1    0.1 macro undef s1_port
**** s1    0.1 macro undef s1_sock
**   v1    0.1 Wait
**** v1    0.1 CLI TX|panic.clear
***  v1    0.1 CLI RX  300
**** v1    0.1 CLI RX|No panic to clear
**** v1    0.1 STDOUT poll 0x10
**   v1    0.1 R 8817 Status: 0000 (u 0.000000 s 0.004000)
*    top   0.1 TEST ../../../bin/varnishtest/tests/v00041.vtc FAILED
#    top  TEST ../../../bin/varnishtest/tests/v00041.vtc FAILED (0.146) exit=2

1 @ SunOS 5.11 i86pc 1.04 32_sun12.4 uplex

*    top   0.0 TEST ../../../bin/varnishtest/tests/v00041.vtc starting
[...]
*    top   0.0 TEST Test priv_task
[...]
**** v1    0.2 CLI TX|\t\tset beresp.http.bx1 = debug.test_priv_task("");
**** v1    0.2 CLI TX|\t\tset beresp.http.bo1 = obj.test_priv_task("");
**** v1    0.2 CLI TX|\t}
**** v1    0.2 CLI TX|
**** v1    0.2 CLI TX|\tsub vcl_fini {
**** v1    0.2 CLI TX|\t\tdebug.test_priv_task("cleaning");
**** v1    0.2 CLI TX|\t\tdebug.test_priv_task("up");
**** v1    0.2 CLI TX|\t\tstd.log("func " + debug.test_priv_task());
**** v1    0.2 CLI TX|\t\tstd.log("obj "  + obj.test_priv_task());
**** v1    0.2 CLI TX|\t}
**** v1    0.2 CLI TX|
**** v1    0.2 CLI TX|
**** v1    0.2 CLI TX|%XJEIFLH|)Xspa8P
***  v1    0.2 CLI RX  106
**** v1    0.2 CLI RX|Message from VCC-compiler:
**** v1    0.2 CLI RX|Security: Privilege proc_setid missing, will not change uid/gid
**** v1    0.2 CLI RX|Could not load VMOD debug
**** v1    0.2 CLI RX|\tFile name: libvmod_debug.so
**** v1    0.2 CLI RX|\tdlerror: ld.so.1: varnishd: fatal: /tmp/vtest.32_sun12.4/varnish-cache/varnish-trunk/_build/lib/libvmod_blob/.libs/libvmod_debug.so: open failed: No such file or directory
**** v1    0.2 CLI RX|('<vcl.inline>' Line 5 Pos 16)
**** v1    0.2 CLI RX|        import debug;
**** v1    0.2 CLI RX|---------------#####-
**** v1    0.2 CLI RX|
**** v1    0.2 CLI RX|Running VCC-compiler failed, exited with 2
**** v1    0.2 CLI RX|VCL compilation failed
---- v1    0.2 FAIL VCL does not compile
*    top   0.2 RESETTING after ../../../bin/varnishtest/tests/v00041.vtc
**   s1    0.2 Waiting for server (3/-1)
**** s1    0.2 macro undef s1_addr
**** s1    0.2 macro undef s1_port
**** s1    0.2 macro undef s1_sock
**   v1    0.2 Wait
**** v1    0.2 CLI TX|panic.clear
***  v1    0.2 CLI RX  300
**** v1    0.2 CLI RX|No panic to clear
**** v1    0.2 STDOUT poll 0x10
**   v1    0.2 R 94651 Status: 0000 (u 0.010000 s 0.036000)
***  v1    0.3 vsl|No VSL chunk found (child not started ?)
*    top   0.3 TEST ../../../bin/varnishtest/tests/v00041.vtc FAILED
#    top  TEST ../../../bin/varnishtest/tests/v00041.vtc FAILED (0.266) exit=2

1 @ Ubuntu LTS i686 1.04 fgs

*    top   0.0 TEST ../../../bin/varnishtest/tests/v00041.vtc starting
[...]
*    top   0.0 TEST Test priv_task
[...]
**** v1    0.1 CLI TX|\tsub vcl_backend_response {
**** v1    0.1 CLI TX|\t\tset beresp.http.bx0 = bereq.http.bx0;
**** v1    0.1 CLI TX|\t\tset beresp.http.bx1 = debug.test_priv_task("");
**** v1    0.1 CLI TX|\t\tset beresp.http.bo1 = obj.test_priv_task("");
**** v1    0.1 CLI TX|\t}
**** v1    0.1 CLI TX|
**** v1    0.1 CLI TX|\tsub vcl_fini {
**** v1    0.1 CLI TX|\t\tdebug.test_priv_task("cleaning");
**** v1    0.1 CLI TX|\t\tdebug.test_priv_task("up");
**** v1    0.1 CLI TX|\t\tstd.log("func " + debug.test_priv_task());
**** v1    0.1 CLI TX|\t\tstd.log("obj "  + obj.test_priv_task());
**** v1    0.1 CLI TX|\t}
**** v1    0.1 CLI TX|
**** v1    0.1 CLI TX|
**** v1    0.1 CLI TX|%XJEIFLH|)Xspa8P
***  v1    0.1 CLI RX  106
**** v1    0.1 CLI RX|Message from VCC-compiler:
**** v1    0.1 CLI RX|Could not load VMOD debug
**** v1    0.1 CLI RX|\tFile name: libvmod_debug.so
**** v1    0.1 CLI RX|\tdlerror: /home/vtest/varnish-cache/tools/varnish-cache/varnish-trunk/_build/lib/libvmod_blob/.libs/libvmod_debug.so: cannot open shared object file: No such file or directory
**** v1    0.1 CLI RX|('<vcl.inline>' Line 5 Pos 16)
**** v1    0.1 CLI RX|        import debug;
**** v1    0.1 CLI RX|---------------#####-
**** v1    0.1 CLI RX|
**** v1    0.1 CLI RX|Running VCC-compiler failed, exited with 2
**** v1    0.1 CLI RX|VCL compilation failed
---- v1    0.1 FAIL VCL does not compile
*    top   0.1 RESETTING after ../../../bin/varnishtest/tests/v00041.vtc
**   s1    0.1 Waiting for server (4/-1)
**** s1    0.1 macro undef s1_addr
**** s1    0.1 macro undef s1_port
**** s1    0.1 macro undef s1_sock
**   v1    0.1 Wait
**** v1    0.1 CLI TX|panic.clear
***  v1    0.1 CLI RX  300
**** v1    0.1 CLI RX|No panic to clear
**** v1    0.1 STDOUT poll 0x10
**   v1    0.1 R 26219 Status: 0000 (u 0.004000 s 0.000000)
*    top   0.1 TEST ../../../bin/varnishtest/tests/v00041.vtc FAILED
#    top  TEST ../../../bin/varnishtest/tests/v00041.vtc FAILED (0.150) exit=2

1 @ SunOS 5.11 i86pc 1.04 32_sun12.4 uplex

*    top   0.0 TEST ../../../bin/varnishtest/tests/v00041.vtc starting
[...]
*    top   0.0 TEST Test priv_task
[...]
**** v1    0.1 CLI TX|\t\tset beresp.http.bx1 = debug.test_priv_task("");
**** v1    0.1 CLI TX|\t\tset beresp.http.bo1 = obj.test_priv_task("");
**** v1    0.1 CLI TX|\t}
**** v1    0.1 CLI TX|
**** v1    0.1 CLI TX|\tsub vcl_fini {
**** v1    0.1 CLI TX|\t\tdebug.test_priv_task("cleaning");
**** v1    0.1 CLI TX|\t\tdebug.test_priv_task("up");
**** v1    0.1 CLI TX|\t\tstd.log("func " + debug.test_priv_task());
**** v1    0.1 CLI TX|\t\tstd.log("obj "  + obj.test_priv_task());
**** v1    0.1 CLI TX|\t}
**** v1    0.1 CLI TX|
**** v1    0.1 CLI TX|
**** v1    0.1 CLI TX|%XJEIFLH|)Xspa8P
***  v1    0.1 CLI RX  106
**** v1    0.1 CLI RX|Message from VCC-compiler:
**** v1    0.1 CLI RX|Security: Privilege proc_setid missing, will not change uid/gid
**** v1    0.1 CLI RX|Could not load VMOD debug
**** v1    0.1 CLI RX|\tFile name: libvmod_debug.so
**** v1    0.1 CLI RX|\tdlerror: ld.so.1: varnishd: fatal: /tmp/vtest.32_sun12.4/varnish-cache/varnish-trunk/_build/lib/libvmod_blob/.libs/libvmod_debug.so: open failed: No such file or directory
**** v1    0.1 CLI RX|('<vcl.inline>' Line 5 Pos 16)
**** v1    0.1 CLI RX|        import debug;
**** v1    0.1 CLI RX|---------------#####-
**** v1    0.1 CLI RX|
**** v1    0.1 CLI RX|Running VCC-compiler failed, exited with 2
**** v1    0.1 CLI RX|VCL compilation failed
---- v1    0.1 FAIL VCL does not compile
*    top   0.1 RESETTING after ../../../bin/varnishtest/tests/v00041.vtc
**   s1    0.1 Waiting for server (3/-1)
**** s1    0.1 macro undef s1_addr
**** s1    0.1 macro undef s1_port
**** s1    0.1 macro undef s1_sock
**   v1    0.1 Wait
**** v1    0.1 CLI TX|panic.clear
***  v1    0.1 CLI RX  300
**** v1    0.1 CLI RX|No panic to clear
**** v1    0.1 STDOUT poll 0x10
**   v1    0.1 R 97906 Status: 0000 (u 0.006000 s 0.021000)
***  v1    0.2 vsl|No VSL chunk found (child not started ?)
*    top   0.2 TEST ../../../bin/varnishtest/tests/v00041.vtc FAILED
#    top  TEST ../../../bin/varnishtest/tests/v00041.vtc FAILED (0.241) exit=2

1 @ SunOS 5.11 i86pc 1.04 32_gcc4.7 uplex

*    top   0.0 TEST ../../../bin/varnishtest/tests/v00041.vtc starting
[...]
*    top   0.0 TEST Test priv_task
[...]
**** v1    0.1 CLI TX|\t\tset beresp.http.bx1 = debug.test_priv_task("");
**** v1    0.1 CLI TX|\t\tset beresp.http.bo1 = obj.test_priv_task("");
**** v1    0.1 CLI TX|\t}
**** v1    0.1 CLI TX|
**** v1    0.1 CLI TX|\tsub vcl_fini {
**** v1    0.1 CLI TX|\t\tdebug.test_priv_task("cleaning");
**** v1    0.1 CLI TX|\t\tdebug.test_priv_task("up");
**** v1    0.1 CLI TX|\t\tstd.log("func " + debug.test_priv_task());
**** v1    0.1 CLI TX|\t\tstd.log("obj "  + obj.test_priv_task());
**** v1    0.1 CLI TX|\t}
**** v1    0.1 CLI TX|
**** v1    0.1 CLI TX|
**** v1    0.1 CLI TX|%XJEIFLH|)Xspa8P
***  v1    0.1 CLI RX  106
**** v1    0.1 CLI RX|Message from VCC-compiler:
**** v1    0.1 CLI RX|Security: Privilege proc_setid missing, will not change uid/gid
**** v1    0.1 CLI RX|Could not load VMOD debug
**** v1    0.1 CLI RX|\tFile name: libvmod_debug.so
**** v1    0.1 CLI RX|\tdlerror: ld.so.1: varnishd: fatal: /tmp/vtest.32_gcc4.7/varnish-cache/varnish-trunk/_build/lib/libvmod_blob/.libs/libvmod_debug.so: open failed: No such file or directory
**** v1    0.1 CLI RX|('<vcl.inline>' Line 5 Pos 16)
**** v1    0.1 CLI RX|        import debug;
**** v1    0.1 CLI RX|---------------#####-
**** v1    0.1 CLI RX|
**** v1    0.1 CLI RX|Running VCC-compiler failed, exited with 2
**** v1    0.1 CLI RX|VCL compilation failed
---- v1    0.1 FAIL VCL does not compile
*    top   0.1 RESETTING after ../../../bin/varnishtest/tests/v00041.vtc
**   s1    0.1 Waiting for server (3/-1)
**** s1    0.1 macro undef s1_addr
**** s1    0.1 macro undef s1_port
**** s1    0.1 macro undef s1_sock
**   v1    0.1 Wait
**** v1    0.1 CLI TX|panic.clear
***  v1    0.1 CLI RX  300
**** v1    0.1 CLI RX|No panic to clear
**** v1    0.1 STDOUT poll 0x10
**   v1    0.1 R 28752 Status: 0000 (u 0.006000 s 0.021000)
***  v1    0.2 vsl|No VSL chunk found (child not started ?)
*    top   0.2 TEST ../../../bin/varnishtest/tests/v00041.vtc FAILED
#    top  TEST ../../../bin/varnishtest/tests/v00041.vtc FAILED (0.241) exit=2

1 @ SunOS 5.11 i86pc 1.04 64_gcc4.7 uplex

*    top   0.0 TEST ../../../bin/varnishtest/tests/v00041.vtc starting
[...]
*    top   0.0 TEST Test priv_task
[...]
**** v1    0.1 CLI TX|\t\tset beresp.http.bx1 = debug.test_priv_task("");
**** v1    0.1 CLI TX|\t\tset beresp.http.bo1 = obj.test_priv_task("");
**** v1    0.1 CLI TX|\t}
**** v1    0.1 CLI TX|
**** v1    0.1 CLI TX|\tsub vcl_fini {
**** v1    0.1 CLI TX|\t\tdebug.test_priv_task("cleaning");
**** v1    0.1 CLI TX|\t\tdebug.test_priv_task("up");
**** v1    0.1 CLI TX|\t\tstd.log("func " + debug.test_priv_task());
**** v1    0.1 CLI TX|\t\tstd.log("obj "  + obj.test_priv_task());
**** v1    0.1 CLI TX|\t}
**** v1    0.1 CLI TX|
**** v1    0.1 CLI TX|
**** v1    0.1 CLI TX|%XJEIFLH|)Xspa8P
***  v1    0.1 CLI RX  106
**** v1    0.1 CLI RX|Message from VCC-compiler:
**** v1    0.1 CLI RX|Security: Privilege proc_setid missing, will not change uid/gid
**** v1    0.1 CLI RX|Could not load VMOD debug
**** v1    0.1 CLI RX|\tFile name: libvmod_debug.so
**** v1    0.1 CLI RX|\tdlerror: ld.so.1: varnishd: fatal: /tmp/vtest.64_gcc4.7/varnish-cache/varnish-trunk/_build/lib/libvmod_blob/.libs/libvmod_debug.so: open failed: No such file or directory
**** v1    0.1 CLI RX|('<vcl.inline>' Line 5 Pos 16)
**** v1    0.1 CLI RX|        import debug;
**** v1    0.1 CLI RX|---------------#####-
**** v1    0.1 CLI RX|
**** v1    0.1 CLI RX|Running VCC-compiler failed, exited with 2
**** v1    0.1 CLI RX|VCL compilation failed
---- v1    0.1 FAIL VCL does not compile
*    top   0.1 RESETTING after ../../../bin/varnishtest/tests/v00041.vtc
**   s1    0.1 Waiting for server (3/-1)
**** s1    0.1 macro undef s1_addr
**** s1    0.1 macro undef s1_port
**** s1    0.1 macro undef s1_sock
**   v1    0.1 Wait
**** v1    0.1 CLI TX|panic.clear
***  v1    0.1 CLI RX  300
**** v1    0.1 CLI RX|No panic to clear
**** v1    0.2 STDOUT poll 0x10
**   v1    0.2 R 3770 Status: 0000 (u 0.008000 s 0.027000)
***  v1    0.2 vsl|No VSL chunk found (child not started ?)
*    top   0.2 TEST ../../../bin/varnishtest/tests/v00041.vtc FAILED
#    top  TEST ../../../bin/varnishtest/tests/v00041.vtc FAILED (0.248) exit=2

1 @ SunOS 5.11 i86pc 1.04 32_gcc4.7 uplex

*    top   0.0 TEST ../../../bin/varnishtest/tests/v00041.vtc starting
[...]
*    top   0.0 TEST Test priv_task
[...]
**** v1    0.1 CLI TX|\t\tset beresp.http.bx1 = debug.test_priv_task("");
**** v1    0.1 CLI TX|\t\tset beresp.http.bo1 = obj.test_priv_task("");
**** v1    0.1 CLI TX|\t}
**** v1    0.1 CLI TX|
**** v1    0.1 CLI TX|\tsub vcl_fini {
**** v1    0.1 CLI TX|\t\tdebug.test_priv_task("cleaning");
**** v1    0.1 CLI TX|\t\tdebug.test_priv_task("up");
**** v1    0.1 CLI TX|\t\tstd.log("func " + debug.test_priv_task());
**** v1    0.1 CLI TX|\t\tstd.log("obj "  + obj.test_priv_task());
**** v1    0.1 CLI TX|\t}
**** v1    0.1 CLI TX|
**** v1    0.1 CLI TX|
**** v1    0.1 CLI TX|%XJEIFLH|)Xspa8P
***  v1    0.1 CLI RX  106
**** v1    0.1 CLI RX|Message from VCC-compiler:
**** v1    0.1 CLI RX|Security: Privilege proc_setid missing, will not change uid/gid
**** v1    0.1 CLI RX|Could not load VMOD debug
**** v1    0.1 CLI RX|\tFile name: libvmod_debug.so
**** v1    0.1 CLI RX|\tdlerror: ld.so.1: varnishd: fatal: /tmp/vtest.32_gcc4.7/varnish-cache/varnish-trunk/_build/lib/libvmod_blob/.libs/libvmod_debug.so: open failed: No such file or directory
**** v1    0.1 CLI RX|('<vcl.inline>' Line 5 Pos 16)
**** v1    0.1 CLI RX|        import debug;
**** v1    0.1 CLI RX|---------------#####-
**** v1    0.1 CLI RX|
**** v1    0.1 CLI RX|Running VCC-compiler failed, exited with 2
**** v1    0.1 CLI RX|VCL compilation failed
---- v1    0.1 FAIL VCL does not compile
*    top   0.1 RESETTING after ../../../bin/varnishtest/tests/v00041.vtc
**   s1    0.1 Waiting for server (3/-1)
**** s1    0.1 macro undef s1_addr
**** s1    0.1 macro undef s1_port
**** s1    0.1 macro undef s1_sock
**   v1    0.1 Wait
**** v1    0.1 CLI TX|panic.clear
***  v1    0.1 CLI RX  300
**** v1    0.1 CLI RX|No panic to clear
**** v1    0.1 STDOUT poll 0x10
**   v1    0.1 R 16180 Status: 0000 (u 0.006000 s 0.023000)
***  v1    0.2 vsl|No VSL chunk found (child not started ?)
*    top   0.2 TEST ../../../bin/varnishtest/tests/v00041.vtc FAILED
#    top  TEST ../../../bin/varnishtest/tests/v00041.vtc FAILED (0.245) exit=2

1 @ FreeBSD 12.0-CUR arm64 1.04 phk

*    top   0.0 TEST ../../../../bin/varnishtest/tests/v00041.vtc starting
[...]
*    top   0.0 TEST Test priv_task
[...]
**** v1    0.2 CLI TX|\t\tset beresp.http.bo1 = obj.test_priv_task("");
**** v1    0.2 CLI TX|\t}
**** v1    0.2 CLI TX|
**** v1    0.2 CLI TX|\tsub vcl_fini {
**** v1    0.2 CLI TX|\t\tdebug.test_priv_task("cleaning");
**** v1    0.2 CLI TX|\t\tdebug.test_priv_task("up");
**** v1    0.2 CLI TX|\t\tstd.log("func " + debug.test_priv_task());
**** v1    0.2 CLI TX|\t\tstd.log("obj "  + obj.test_priv_task());
**** v1    0.2 CLI TX|\t}
**** v1    0.2 CLI TX|
**** v1    0.2 CLI TX|
**** v1    0.2 CLI TX|%XJEIFLH|)Xspa8P
***  v1    0.3 vsl|No VSL chunk found (child not started ?)
***  v1    0.3 CLI RX  106
**** v1    0.3 CLI RX|Message from VCC-compiler:
**** v1    0.3 CLI RX|Could not load VMOD debug
**** v1    0.3 CLI RX|\tFile name: libvmod_debug.so
**** v1    0.3 CLI RX|\tdlerror: Cannot open "/freebsd/VT/varnish-cache/varnish-trunk/_build/sub/lib/libvmod_blob/.libs/libvmod_debug.so"
**** v1    0.3 CLI RX|('<vcl.inline>' Line 5 Pos 16)
**** v1    0.3 CLI RX|        import debug;
**** v1    0.3 CLI RX|---------------#####-
**** v1    0.3 CLI RX|
**** v1    0.3 CLI RX|Running VCC-compiler failed, exited with 2
**** v1    0.3 CLI RX|VCL compilation failed
---- v1    0.3 FAIL VCL does not compile
*    top   0.3 RESETTING after ../../../../bin/varnishtest/tests/v00041.vtc
**   s1    0.3 Waiting for server (3/-1)
**** s1    0.3 macro undef s1_addr
**** s1    0.3 macro undef s1_port
**** s1    0.3 macro undef s1_sock
**   v1    0.3 Wait
**** v1    0.3 CLI TX|panic.clear
***  v1    0.4 vsl|No VSL chunk found (child not started ?)
***  v1    0.4 CLI RX  300
**** v1    0.4 CLI RX|No panic to clear
**** v1    0.4 STDOUT poll 0x11
**   v1    0.4 R 54162 Status: 0000 (u 0.029021 s 0.077607)
*    top   0.4 TEST ../../../../bin/varnishtest/tests/v00041.vtc FAILED
#    top  TEST ../../../../bin/varnishtest/tests/v00041.vtc FAILED (0.450) exit=2
FAIL tests/v00041.vtc (exit status: 2)

1 @ SunOS 5.11 i86pc 1.04 64_sun12.4 uplex

*    top   0.0 TEST ../../../bin/varnishtest/tests/v00041.vtc starting
[...]
*    top   0.0 TEST Test priv_task
[...]
**** v1    0.1 CLI TX|\t\tset beresp.http.bx1 = debug.test_priv_task("");
**** v1    0.1 CLI TX|\t\tset beresp.http.bo1 = obj.test_priv_task("");
**** v1    0.1 CLI TX|\t}
**** v1    0.1 CLI TX|
**** v1    0.1 CLI TX|\tsub vcl_fini {
**** v1    0.1 CLI TX|\t\tdebug.test_priv_task("cleaning");
**** v1    0.1 CLI TX|\t\tdebug.test_priv_task("up");
**** v1    0.1 CLI TX|\t\tstd.log("func " + debug.test_priv_task());
**** v1    0.1 CLI TX|\t\tstd.log("obj "  + obj.test_priv_task());
**** v1    0.1 CLI TX|\t}
**** v1    0.1 CLI TX|
**** v1    0.1 CLI TX|
**** v1    0.1 CLI TX|%XJEIFLH|)Xspa8P
***  v1    0.2 CLI RX  106
**** v1    0.2 CLI RX|Message from VCC-compiler:
**** v1    0.2 CLI RX|Security: Privilege proc_setid missing, will not change uid/gid
**** v1    0.2 CLI RX|Could not load VMOD debug
**** v1    0.2 CLI RX|\tFile name: libvmod_debug.so
**** v1    0.2 CLI RX|\tdlerror: ld.so.1: varnishd: fatal: /tmp/vtest.64_sun12.4/varnish-cache/varnish-trunk/_build/lib/libvmod_blob/.libs/libvmod_debug.so: open failed: No such file or directory
**** v1    0.2 CLI RX|('<vcl.inline>' Line 5 Pos 16)
**** v1    0.2 CLI RX|        import debug;
**** v1    0.2 CLI RX|---------------#####-
**** v1    0.2 CLI RX|
**** v1    0.2 CLI RX|Running VCC-compiler failed, exited with 2
**** v1    0.2 CLI RX|VCL compilation failed
---- v1    0.2 FAIL VCL does not compile
*    top   0.2 RESETTING after ../../../bin/varnishtest/tests/v00041.vtc
**   s1    0.2 Waiting for server (3/-1)
**** s1    0.2 macro undef s1_addr
**** s1    0.2 macro undef s1_port
**** s1    0.2 macro undef s1_sock
**   v1    0.2 Wait
**** v1    0.2 CLI TX|panic.clear
***  v1    0.2 CLI RX  300
**** v1    0.2 CLI RX|No panic to clear
**** v1    0.2 STDOUT poll 0x10
**   v1    0.2 R 82231 Status: 0000 (u 0.008000 s 0.028000)
***  v1    0.2 vsl|No VSL chunk found (child not started ?)
*    top   0.2 TEST ../../../bin/varnishtest/tests/v00041.vtc FAILED
#    top  TEST ../../../bin/varnishtest/tests/v00041.vtc FAILED (0.250) exit=2

1 @ SunOS 5.11 i86pc 1.04 32_sun12.4 uplex

*    top   0.0 TEST ../../../bin/varnishtest/tests/v00041.vtc starting
[...]
*    top   0.0 TEST Test priv_task
[...]
**** v1    0.1 CLI TX|\t\tset beresp.http.bx1 = debug.test_priv_task("");
**** v1    0.1 CLI TX|\t\tset beresp.http.bo1 = obj.test_priv_task("");
**** v1    0.1 CLI TX|\t}
**** v1    0.1 CLI TX|
**** v1    0.1 CLI TX|\tsub vcl_fini {
**** v1    0.1 CLI TX|\t\tdebug.test_priv_task("cleaning");
**** v1    0.1 CLI TX|\t\tdebug.test_priv_task("up");
**** v1    0.1 CLI TX|\t\tstd.log("func " + debug.test_priv_task());
**** v1    0.1 CLI TX|\t\tstd.log("obj "  + obj.test_priv_task());
**** v1    0.1 CLI TX|\t}
**** v1    0.1 CLI TX|
**** v1    0.1 CLI TX|
**** v1    0.1 CLI TX|%XJEIFLH|)Xspa8P
***  v1    0.1 CLI RX  106
**** v1    0.1 CLI RX|Message from VCC-compiler:
**** v1    0.1 CLI RX|Security: Privilege proc_setid missing, will not change uid/gid
**** v1    0.1 CLI RX|Could not load VMOD debug
**** v1    0.1 CLI RX|\tFile name: libvmod_debug.so
**** v1    0.1 CLI RX|\tdlerror: ld.so.1: varnishd: fatal: /tmp/vtest.32_sun12.4/varnish-cache/varnish-trunk/_build/lib/libvmod_blob/.libs/libvmod_debug.so: open failed: No such file or directory
**** v1    0.1 CLI RX|('<vcl.inline>' Line 5 Pos 16)
**** v1    0.1 CLI RX|        import debug;
**** v1    0.1 CLI RX|---------------#####-
**** v1    0.1 CLI RX|
**** v1    0.1 CLI RX|Running VCC-compiler failed, exited with 2
**** v1    0.1 CLI RX|VCL compilation failed
---- v1    0.1 FAIL VCL does not compile
*    top   0.1 RESETTING after ../../../bin/varnishtest/tests/v00041.vtc
**   s1    0.1 Waiting for server (3/-1)
**** s1    0.1 macro undef s1_addr
**** s1    0.1 macro undef s1_port
**** s1    0.1 macro undef s1_sock
**   v1    0.1 Wait
**** v1    0.1 CLI TX|panic.clear
***  v1    0.1 CLI RX  300
**** v1    0.1 CLI RX|No panic to clear
**** v1    0.1 STDOUT poll 0x10
**   v1    0.1 R 8233 Status: 0000 (u 0.006000 s 0.023000)
***  v1    0.2 vsl|No VSL chunk found (child not started ?)
*    top   0.2 TEST ../../../bin/varnishtest/tests/v00041.vtc FAILED
#    top  TEST ../../../bin/varnishtest/tests/v00041.vtc FAILED (0.244) exit=2

1 @ SunOS 5.11 i86pc 1.04 64_sun12.4 uplex

*    top   0.0 TEST ../../../bin/varnishtest/tests/v00041.vtc starting
[...]
*    top   0.0 TEST Test priv_task
[...]
**** v1    0.1 CLI TX|\t\tset beresp.http.bx1 = debug.test_priv_task("");
**** v1    0.1 CLI TX|\t\tset beresp.http.bo1 = obj.test_priv_task("");
**** v1    0.1 CLI TX|\t}
**** v1    0.1 CLI TX|
**** v1    0.1 CLI TX|\tsub vcl_fini {
**** v1    0.1 CLI TX|\t\tdebug.test_priv_task("cleaning");
**** v1    0.1 CLI TX|\t\tdebug.test_priv_task("up");
**** v1    0.1 CLI TX|\t\tstd.log("func " + debug.test_priv_task());
**** v1    0.1 CLI TX|\t\tstd.log("obj "  + obj.test_priv_task());
**** v1    0.1 CLI TX|\t}
**** v1    0.1 CLI TX|
**** v1    0.1 CLI TX|
**** v1    0.1 CLI TX|%XJEIFLH|)Xspa8P
***  v1    0.2 CLI RX  106
**** v1    0.2 CLI RX|Message from VCC-compiler:
**** v1    0.2 CLI RX|Security: Privilege proc_setid missing, will not change uid/gid
**** v1    0.2 CLI RX|Could not load VMOD debug
**** v1    0.2 CLI RX|\tFile name: libvmod_debug.so
**** v1    0.2 CLI RX|\tdlerror: ld.so.1: varnishd: fatal: /tmp/vtest.64_sun12.4/varnish-cache/varnish-trunk/_build/lib/libvmod_blob/.libs/libvmod_debug.so: open failed: No such file or directory
**** v1    0.2 CLI RX|('<vcl.inline>' Line 5 Pos 16)
**** v1    0.2 CLI RX|        import debug;
**** v1    0.2 CLI RX|---------------#####-
**** v1    0.2 CLI RX|
**** v1    0.2 CLI RX|Running VCC-compiler failed, exited with 2
**** v1    0.2 CLI RX|VCL compilation failed
---- v1    0.2 FAIL VCL does not compile
*    top   0.2 RESETTING after ../../../bin/varnishtest/tests/v00041.vtc
**   s1    0.2 Waiting for server (3/-1)
**** s1    0.2 macro undef s1_addr
**** s1    0.2 macro undef s1_port
**** s1    0.2 macro undef s1_sock
**   v1    0.2 Wait
**** v1    0.2 CLI TX|panic.clear
***  v1    0.2 CLI RX  300
**** v1    0.2 CLI RX|No panic to clear
**** v1    0.2 STDOUT poll 0x10
**   v1    0.2 R 85267 Status: 0000 (u 0.010000 s 0.033000)
***  v1    0.2 vsl|No VSL chunk found (child not started ?)
*    top   0.2 TEST ../../../bin/varnishtest/tests/v00041.vtc FAILED
#    top  TEST ../../../bin/varnishtest/tests/v00041.vtc FAILED (0.254) exit=2

1 @ Ubuntu LTS i686 1.04 fgs

*    top   0.0 TEST ../../../bin/varnishtest/tests/v00041.vtc starting
[...]
*    top   0.0 TEST Test priv_task
[...]
**** v1    0.1 CLI TX|\tsub vcl_backend_response {
**** v1    0.1 CLI TX|\t\tset beresp.http.bx0 = bereq.http.bx0;
**** v1    0.1 CLI TX|\t\tset beresp.http.bx1 = debug.test_priv_task("");
**** v1    0.1 CLI TX|\t\tset beresp.http.bo1 = obj.test_priv_task("");
**** v1    0.1 CLI TX|\t}
**** v1    0.1 CLI TX|
**** v1    0.1 CLI TX|\tsub vcl_fini {
**** v1    0.1 CLI TX|\t\tdebug.test_priv_task("cleaning");
**** v1    0.1 CLI TX|\t\tdebug.test_priv_task("up");
**** v1    0.1 CLI TX|\t\tstd.log("func " + debug.test_priv_task());
**** v1    0.1 CLI TX|\t\tstd.log("obj "  + obj.test_priv_task());
**** v1    0.1 CLI TX|\t}
**** v1    0.1 CLI TX|
**** v1    0.1 CLI TX|
**** v1    0.1 CLI TX|%XJEIFLH|)Xspa8P
***  v1    0.1 CLI RX  106
**** v1    0.1 CLI RX|Message from VCC-compiler:
**** v1    0.1 CLI RX|Could not load VMOD debug
**** v1    0.1 CLI RX|\tFile name: libvmod_debug.so
**** v1    0.1 CLI RX|\tdlerror: /home/vtest/varnish-cache/tools/varnish-cache/varnish-trunk/_build/lib/libvmod_blob/.libs/libvmod_debug.so: cannot open shared object file: No such file or directory
**** v1    0.1 CLI RX|('<vcl.inline>' Line 5 Pos 16)
**** v1    0.1 CLI RX|        import debug;
**** v1    0.1 CLI RX|---------------#####-
**** v1    0.1 CLI RX|
**** v1    0.1 CLI RX|Running VCC-compiler failed, exited with 2
**** v1    0.1 CLI RX|VCL compilation failed
---- v1    0.1 FAIL VCL does not compile
*    top   0.1 RESETTING after ../../../bin/varnishtest/tests/v00041.vtc
**   s1    0.1 Waiting for server (4/-1)
**** s1    0.1 macro undef s1_addr
**** s1    0.1 macro undef s1_port
**** s1    0.1 macro undef s1_sock
**   v1    0.1 Wait
**** v1    0.1 CLI TX|panic.clear
***  v1    0.1 CLI RX  300
**** v1    0.1 CLI RX|No panic to clear
**** v1    0.1 STDOUT poll 0x10
**   v1    0.1 R 1250 Status: 0000 (u 0.004000 s 0.000000)
*    top   0.1 TEST ../../../bin/varnishtest/tests/v00041.vtc FAILED
#    top  TEST ../../../bin/varnishtest/tests/v00041.vtc FAILED (0.150) exit=2

1 @ FreeBSD 11.0-REL-p12 i386 1.04 phk

*    top   0.0 TEST ../../../../bin/varnishtest/tests/v00041.vtc starting
[...]
*    top   0.0 TEST Test priv_task
[...]
**** v1    0.1 CLI TX|\t\tset beresp.http.bo1 = obj.test_priv_task("");
**** v1    0.1 CLI TX|\t}
**** v1    0.1 CLI TX|
**** v1    0.1 CLI TX|\tsub vcl_fini {
**** v1    0.1 CLI TX|\t\tdebug.test_priv_task("cleaning");
**** v1    0.1 CLI TX|\t\tdebug.test_priv_task("up");
**** v1    0.1 CLI TX|\t\tstd.log("func " + debug.test_priv_task());
**** v1    0.1 CLI TX|\t\tstd.log("obj "  + obj.test_priv_task());
**** v1    0.1 CLI TX|\t}
**** v1    0.1 CLI TX|
**** v1    0.1 CLI TX|
**** v1    0.1 CLI TX|%XJEIFLH|)Xspa8P
***  v1    0.2 vsl|No VSL chunk found (child not started ?)
***  v1    0.2 CLI RX  106
**** v1    0.2 CLI RX|Message from VCC-compiler:
**** v1    0.2 CLI RX|Could not load VMOD debug
**** v1    0.2 CLI RX|\tFile name: libvmod_debug.so
**** v1    0.2 CLI RX|\tdlerror: Cannot open "/root/VT/varnish-cache/varnish-trunk/_build/sub/lib/libvmod_blob/.libs/libvmod_debug.so"
**** v1    0.2 CLI RX|('<vcl.inline>' Line 5 Pos 16)
**** v1    0.2 CLI RX|        import debug;
**** v1    0.2 CLI RX|---------------#####-
**** v1    0.2 CLI RX|
**** v1    0.2 CLI RX|Running VCC-compiler failed, exited with 2
**** v1    0.2 CLI RX|VCL compilation failed
---- v1    0.2 FAIL VCL does not compile
*    top   0.2 RESETTING after ../../../../bin/varnishtest/tests/v00041.vtc
**   s1    0.2 Waiting for server (3/-1)
**** s1    0.2 macro undef s1_addr
**** s1    0.2 macro undef s1_port
**** s1    0.2 macro undef s1_sock
**   v1    0.2 Wait
**** v1    0.2 CLI TX|panic.clear
***  v1    0.3 CLI RX  300
**** v1    0.3 CLI RX|No panic to clear
***  v1    0.3 vsl|No VSL chunk found (child not started ?)
**** v1    0.3 STDOUT poll 0x11
**   v1    0.3 R 26224 Status: 0000 (u 0.002639 s 0.007917)
*    top   0.3 TEST ../../../../bin/varnishtest/tests/v00041.vtc FAILED
#    top  TEST ../../../../bin/varnishtest/tests/v00041.vtc FAILED (0.328) exit=2
FAIL tests/v00041.vtc (exit status: 2)

1 @ SunOS 5.11 i86pc 1.04 32_sun12.4 uplex

*    top   0.0 TEST ../../../bin/varnishtest/tests/v00041.vtc starting
[...]
*    top   0.0 TEST Test priv_task
[...]
**** v1    0.2 CLI TX|\t\tset beresp.http.bx1 = debug.test_priv_task("");
**** v1    0.2 CLI TX|\t\tset beresp.http.bo1 = obj.test_priv_task("");
**** v1    0.2 CLI TX|\t}
**** v1    0.2 CLI TX|
**** v1    0.2 CLI TX|\tsub vcl_fini {
**** v1    0.2 CLI TX|\t\tdebug.test_priv_task("cleaning");
**** v1    0.2 CLI TX|\t\tdebug.test_priv_task("up");
**** v1    0.2 CLI TX|\t\tstd.log("func " + debug.test_priv_task());
**** v1    0.2 CLI TX|\t\tstd.log("obj "  + obj.test_priv_task());
**** v1    0.2 CLI TX|\t}
**** v1    0.2 CLI TX|
**** v1    0.2 CLI TX|
**** v1    0.2 CLI TX|%XJEIFLH|)Xspa8P
***  v1    0.2 CLI RX  106
**** v1    0.2 CLI RX|Message from VCC-compiler:
**** v1    0.2 CLI RX|Security: Privilege proc_setid missing, will not change uid/gid
**** v1    0.2 CLI RX|Could not load VMOD debug
**** v1    0.2 CLI RX|\tFile name: libvmod_debug.so
**** v1    0.2 CLI RX|\tdlerror: ld.so.1: varnishd: fatal: /tmp/vtest.32_sun12.4/varnish-cache/varnish-trunk/_build/lib/libvmod_blob/.libs/libvmod_debug.so: open failed: No such file or directory
**** v1    0.2 CLI RX|('<vcl.inline>' Line 5 Pos 16)
**** v1    0.2 CLI RX|        import debug;
**** v1    0.2 CLI RX|---------------#####-
**** v1    0.2 CLI RX|
**** v1    0.2 CLI RX|Running VCC-compiler failed, exited with 2
**** v1    0.2 CLI RX|VCL compilation failed
---- v1    0.2 FAIL VCL does not compile
*    top   0.2 RESETTING after ../../../bin/varnishtest/tests/v00041.vtc
**   s1    0.2 Waiting for server (3/-1)
**** s1    0.2 macro undef s1_addr
**** s1    0.2 macro undef s1_port
**** s1    0.2 macro undef s1_sock
**   v1    0.2 Wait
**** v1    0.2 CLI TX|panic.clear
***  v1    0.2 CLI RX  300
**** v1    0.2 CLI RX|No panic to clear
**** v1    0.2 STDOUT poll 0x10
**   v1    0.2 R 89792 Status: 0000 (u 0.007000 s 0.028000)
***  v1    0.3 vsl|No VSL chunk found (child not started ?)
*    top   0.3 TEST ../../../bin/varnishtest/tests/v00041.vtc FAILED
#    top  TEST ../../../bin/varnishtest/tests/v00041.vtc FAILED (0.254) exit=2

1 @ SunOS 5.11 i86pc 1.04 64_sun12.4 uplex

*    top   0.0 TEST ../../../bin/varnishtest/tests/v00041.vtc starting
[...]
*    top   0.0 TEST Test priv_task
[...]
**** v1    0.1 CLI TX|\t\tset beresp.http.bx1 = debug.test_priv_task("");
**** v1    0.1 CLI TX|\t\tset beresp.http.bo1 = obj.test_priv_task("");
**** v1    0.1 CLI TX|\t}
**** v1    0.1 CLI TX|
**** v1    0.1 CLI TX|\tsub vcl_fini {
**** v1    0.1 CLI TX|\t\tdebug.test_priv_task("cleaning");
**** v1    0.1 CLI TX|\t\tdebug.test_priv_task("up");
**** v1    0.1 CLI TX|\t\tstd.log("func " + debug.test_priv_task());
**** v1    0.1 CLI TX|\t\tstd.log("obj "  + obj.test_priv_task());
**** v1    0.1 CLI TX|\t}
**** v1    0.1 CLI TX|
**** v1    0.1 CLI TX|
**** v1    0.1 CLI TX|%XJEIFLH|)Xspa8P
***  v1    0.2 CLI RX  106
**** v1    0.2 CLI RX|Message from VCC-compiler:
**** v1    0.2 CLI RX|Security: Privilege proc_setid missing, will not change uid/gid
**** v1    0.2 CLI RX|Could not load VMOD debug
**** v1    0.2 CLI RX|\tFile name: libvmod_debug.so
**** v1    0.2 CLI RX|\tdlerror: ld.so.1: varnishd: fatal: /tmp/vtest.64_sun12.4/varnish-cache/varnish-trunk/_build/lib/libvmod_blob/.libs/libvmod_debug.so: open failed: No such file or directory
**** v1    0.2 CLI RX|('<vcl.inline>' Line 5 Pos 16)
**** v1    0.2 CLI RX|        import debug;
**** v1    0.2 CLI RX|---------------#####-
**** v1    0.2 CLI RX|
**** v1    0.2 CLI RX|Running VCC-compiler failed, exited with 2
**** v1    0.2 CLI RX|VCL compilation failed
---- v1    0.2 FAIL VCL does not compile
*    top   0.2 RESETTING after ../../../bin/varnishtest/tests/v00041.vtc
**   s1    0.2 Waiting for server (3/-1)
**** s1    0.2 macro undef s1_addr
**** s1    0.2 macro undef s1_port
**** s1    0.2 macro undef s1_sock
**   v1    0.2 Wait
**** v1    0.2 CLI TX|panic.clear
***  v1    0.2 CLI RX  300
**** v1    0.2 CLI RX|No panic to clear
**** v1    0.2 STDOUT poll 0x10
**   v1    0.2 R 81397 Status: 0000 (u 0.008000 s 0.027000)
***  v1    0.2 vsl|No VSL chunk found (child not started ?)
*    top   0.2 TEST ../../../bin/varnishtest/tests/v00041.vtc FAILED
#    top  TEST ../../../bin/varnishtest/tests/v00041.vtc FAILED (0.250) exit=2

1 @ FreeBSD 11.0-REL-p9 amd64 1.04 phk

*    top   0.0 TEST ../../../../bin/varnishtest/tests/v00041.vtc starting
[...]
*    top   0.0 TEST Test priv_task
[...]
**** v1    0.1 CLI TX|\t\tset beresp.http.bx1 = debug.test_priv_task("");
**** v1    0.1 CLI TX|\t\tset beresp.http.bo1 = obj.test_priv_task("");
**** v1    0.1 CLI TX|\t}
**** v1    0.1 CLI TX|
**** v1    0.1 CLI TX|\tsub vcl_fini {
**** v1    0.1 CLI TX|\t\tdebug.test_priv_task("cleaning");
**** v1    0.1 CLI TX|\t\tdebug.test_priv_task("up");
**** v1    0.1 CLI TX|\t\tstd.log("func " + debug.test_priv_task());
**** v1    0.1 CLI TX|\t\tstd.log("obj "  + obj.test_priv_task());
**** v1    0.1 CLI TX|\t}
**** v1    0.1 CLI TX|
**** v1    0.1 CLI TX|
**** v1    0.1 CLI TX|%XJEIFLH|)Xspa8P
***  v1    0.2 CLI RX  106
**** v1    0.2 CLI RX|Message from VCC-compiler:
**** v1    0.2 CLI RX|Could not load VMOD debug
**** v1    0.2 CLI RX|\tFile name: libvmod_debug.so
**** v1    0.2 CLI RX|\tdlerror: Cannot open "/root/VT/varnish-cache/varnish-trunk/_build/sub/lib/libvmod_blob/.libs/libvmod_debug.so"
**** v1    0.2 CLI RX|('<vcl.inline>' Line 5 Pos 16)
**** v1    0.2 CLI RX|        import debug;
**** v1    0.2 CLI RX|---------------#####-
**** v1    0.2 CLI RX|
**** v1    0.2 CLI RX|Running VCC-compiler failed, exited with 2
**** v1    0.2 CLI RX|VCL compilation failed
---- v1    0.2 FAIL VCL does not compile
*    top   0.2 RESETTING after ../../../../bin/varnishtest/tests/v00041.vtc
**   s1    0.2 Waiting for server (3/-1)
**** s1    0.2 macro undef s1_addr
**** s1    0.2 macro undef s1_port
**** s1    0.2 macro undef s1_sock
**   v1    0.2 Wait
**** v1    0.2 CLI TX|panic.clear
***  v1    0.2 vsl|No VSL chunk found (child not started ?)
***  v1    0.3 CLI RX  300
**** v1    0.3 CLI RX|No panic to clear
**** v1    0.3 STDOUT poll 0x11
**   v1    0.3 R 95601 Status: 0000 (u 0.000000 s 0.020373)
*    top   0.3 TEST ../../../../bin/varnishtest/tests/v00041.vtc FAILED
#    top  TEST ../../../../bin/varnishtest/tests/v00041.vtc FAILED (0.319) exit=2
FAIL tests/v00041.vtc (exit status: 2)

1 @ SunOS 5.11 i86pc 1.04 32_sun12.4 uplex

*    top   0.0 TEST ../../../bin/varnishtest/tests/v00041.vtc starting
[...]
*    top   0.0 TEST Test priv_task
[...]
**** v1    0.1 CLI TX|\t\tset beresp.http.bx1 = debug.test_priv_task("");
**** v1    0.1 CLI TX|\t\tset beresp.http.bo1 = obj.test_priv_task("");
**** v1    0.1 CLI TX|\t}
**** v1    0.1 CLI TX|
**** v1    0.1 CLI TX|\tsub vcl_fini {
**** v1    0.1 CLI TX|\t\tdebug.test_priv_task("cleaning");
**** v1    0.1 CLI TX|\t\tdebug.test_priv_task("up");
**** v1    0.1 CLI TX|\t\tstd.log("func " + debug.test_priv_task());
**** v1    0.1 CLI TX|\t\tstd.log("obj "  + obj.test_priv_task());
**** v1    0.1 CLI TX|\t}
**** v1    0.1 CLI TX|
**** v1    0.1 CLI TX|
**** v1    0.1 CLI TX|%XJEIFLH|)Xspa8P
***  v1    0.1 CLI RX  106
**** v1    0.1 CLI RX|Message from VCC-compiler:
**** v1    0.1 CLI RX|Security: Privilege proc_setid missing, will not change uid/gid
**** v1    0.1 CLI RX|Could not load VMOD debug
**** v1    0.1 CLI RX|\tFile name: libvmod_debug.so
**** v1    0.1 CLI RX|\tdlerror: ld.so.1: varnishd: fatal: /tmp/vtest.32_sun12.4/varnish-cache/varnish-trunk/_build/lib/libvmod_blob/.libs/libvmod_debug.so: open failed: No such file or directory
**** v1    0.1 CLI RX|('<vcl.inline>' Line 5 Pos 16)
**** v1    0.1 CLI RX|        import debug;
**** v1    0.1 CLI RX|---------------#####-
**** v1    0.1 CLI RX|
**** v1    0.1 CLI RX|Running VCC-compiler failed, exited with 2
**** v1    0.1 CLI RX|VCL compilation failed
---- v1    0.1 FAIL VCL does not compile
*    top   0.1 RESETTING after ../../../bin/varnishtest/tests/v00041.vtc
**   s1    0.1 Waiting for server (3/-1)
**** s1    0.1 macro undef s1_addr
**** s1    0.1 macro undef s1_port
**** s1    0.1 macro undef s1_sock
**   v1    0.1 Wait
**** v1    0.1 CLI TX|panic.clear
***  v1    0.1 CLI RX  300
**** v1    0.1 CLI RX|No panic to clear
**** v1    0.1 STDOUT poll 0x10
**   v1    0.1 R 98613 Status: 0000 (u 0.006000 s 0.023000)
***  v1    0.2 vsl|No VSL chunk found (child not started ?)
*    top   0.2 TEST ../../../bin/varnishtest/tests/v00041.vtc FAILED
#    top  TEST ../../../bin/varnishtest/tests/v00041.vtc FAILED (0.243) exit=2

1 @ SunOS 5.11 i86pc 1.04 32_gcc4.7 uplex

*    top   0.0 TEST ../../../bin/varnishtest/tests/v00041.vtc starting
[...]
*    top   0.0 TEST Test priv_task
[...]
**** v1    0.2 CLI TX|\t\tset beresp.http.bx1 = debug.test_priv_task("");
**** v1    0.2 CLI TX|\t\tset beresp.http.bo1 = obj.test_priv_task("");
**** v1    0.2 CLI TX|\t}
**** v1    0.2 CLI TX|
**** v1    0.2 CLI TX|\tsub vcl_fini {
**** v1    0.2 CLI TX|\t\tdebug.test_priv_task("cleaning");
**** v1    0.2 CLI TX|\t\tdebug.test_priv_task("up");
**** v1    0.2 CLI TX|\t\tstd.log("func " + debug.test_priv_task());
**** v1    0.2 CLI TX|\t\tstd.log("obj "  + obj.test_priv_task());
**** v1    0.2 CLI TX|\t}
**** v1    0.2 CLI TX|
**** v1    0.2 CLI TX|
**** v1    0.2 CLI TX|%XJEIFLH|)Xspa8P
***  v1    0.2 CLI RX  106
**** v1    0.2 CLI RX|Message from VCC-compiler:
**** v1    0.2 CLI RX|Security: Privilege proc_setid missing, will not change uid/gid
**** v1    0.2 CLI RX|Could not load VMOD debug
**** v1    0.2 CLI RX|\tFile name: libvmod_debug.so
**** v1    0.2 CLI RX|\tdlerror: ld.so.1: varnishd: fatal: /tmp/vtest.32_gcc4.7/varnish-cache/varnish-trunk/_build/lib/libvmod_blob/.libs/libvmod_debug.so: open failed: No such file or directory
**** v1    0.2 CLI RX|('<vcl.inline>' Line 5 Pos 16)
**** v1    0.2 CLI RX|        import debug;
**** v1    0.2 CLI RX|---------------#####-
**** v1    0.2 CLI RX|
**** v1    0.2 CLI RX|Running VCC-compiler failed, exited with 2
**** v1    0.2 CLI RX|VCL compilation failed
---- v1    0.2 FAIL VCL does not compile
*    top   0.2 RESETTING after ../../../bin/varnishtest/tests/v00041.vtc
**   s1    0.2 Waiting for server (3/-1)
**** s1    0.2 macro undef s1_addr
**** s1    0.2 macro undef s1_port
**** s1    0.2 macro undef s1_sock
**   v1    0.2 Wait
**** v1    0.2 CLI TX|panic.clear
***  v1    0.2 CLI RX  300
**** v1    0.2 CLI RX|No panic to clear
**** v1    0.2 STDOUT poll 0x10
**   v1    0.2 R 13754 Status: 0000 (u 0.009000 s 0.036000)
***  v1    0.3 vsl|No VSL chunk found (child not started ?)
*    top   0.3 TEST ../../../bin/varnishtest/tests/v00041.vtc FAILED
#    top  TEST ../../../bin/varnishtest/tests/v00041.vtc FAILED (0.266) exit=2

1 @ FreeBSD 11.0-REL-p9 amd64 1.04 phk

*    top   0.0 TEST ../../../../bin/varnishtest/tests/v00041.vtc starting
[...]
*    top   0.0 TEST Test priv_task
[...]
**** v1    0.1 CLI TX|\t\tset beresp.http.bo1 = obj.test_priv_task("");
**** v1    0.1 CLI TX|\t}
**** v1    0.1 CLI TX|
**** v1    0.1 CLI TX|\tsub vcl_fini {
**** v1    0.1 CLI TX|\t\tdebug.test_priv_task("cleaning");
**** v1    0.1 CLI TX|\t\tdebug.test_priv_task("up");
**** v1    0.1 CLI TX|\t\tstd.log("func " + debug.test_priv_task());
**** v1    0.1 CLI TX|\t\tstd.log("obj "  + obj.test_priv_task());
**** v1    0.1 CLI TX|\t}
**** v1    0.1 CLI TX|
**** v1    0.1 CLI TX|
**** v1    0.1 CLI TX|%XJEIFLH|)Xspa8P
***  v1    0.2 vsl|No VSL chunk found (child not started ?)
***  v1    0.2 CLI RX  106
**** v1    0.2 CLI RX|Message from VCC-compiler:
**** v1    0.2 CLI RX|Could not load VMOD debug
**** v1    0.2 CLI RX|\tFile name: libvmod_debug.so
**** v1    0.2 CLI RX|\tdlerror: Cannot open "/root/VT/varnish-cache/varnish-trunk/_build/sub/lib/libvmod_blob/.libs/libvmod_debug.so"
**** v1    0.2 CLI RX|('<vcl.inline>' Line 5 Pos 16)
**** v1    0.2 CLI RX|        import debug;
**** v1    0.2 CLI RX|---------------#####-
**** v1    0.2 CLI RX|
**** v1    0.2 CLI RX|Running VCC-compiler failed, exited with 2
**** v1    0.2 CLI RX|VCL compilation failed
---- v1    0.2 FAIL VCL does not compile
*    top   0.2 RESETTING after ../../../../bin/varnishtest/tests/v00041.vtc
**   s1    0.2 Waiting for server (3/-1)
**** s1    0.2 macro undef s1_addr
**** s1    0.2 macro undef s1_port
**** s1    0.2 macro undef s1_sock
**   v1    0.2 Wait
**** v1    0.2 CLI TX|panic.clear
***  v1    0.3 vsl|No VSL chunk found (child not started ?)
***  v1    0.3 CLI RX  300
**** v1    0.3 CLI RX|No panic to clear
**** v1    0.3 STDOUT poll 0x11
**   v1    0.3 R 78579 Status: 0000 (u 0.005816 s 0.016868)
*    top   0.3 TEST ../../../../bin/varnishtest/tests/v00041.vtc FAILED
#    top  TEST ../../../../bin/varnishtest/tests/v00041.vtc FAILED (0.335) exit=2
FAIL tests/v00041.vtc (exit status: 2)

1 @ SunOS 5.11 i86pc 1.04 32_sun12.4 uplex

*    top   0.0 TEST ../../../bin/varnishtest/tests/v00041.vtc starting
[...]
*    top   0.0 TEST Test priv_task
[...]
**** v1    0.1 CLI TX|\t\tset beresp.http.bx1 = debug.test_priv_task("");
**** v1    0.1 CLI TX|\t\tset beresp.http.bo1 = obj.test_priv_task("");
**** v1    0.1 CLI TX|\t}
**** v1    0.1 CLI TX|
**** v1    0.1 CLI TX|\tsub vcl_fini {
**** v1    0.1 CLI TX|\t\tdebug.test_priv_task("cleaning");
**** v1    0.1 CLI TX|\t\tdebug.test_priv_task("up");
**** v1    0.1 CLI TX|\t\tstd.log("func " + debug.test_priv_task());
**** v1    0.1 CLI TX|\t\tstd.log("obj "  + obj.test_priv_task());
**** v1    0.1 CLI TX|\t}
**** v1    0.1 CLI TX|
**** v1    0.1 CLI TX|
**** v1    0.1 CLI TX|%XJEIFLH|)Xspa8P
***  v1    0.2 CLI RX  106
**** v1    0.2 CLI RX|Message from VCC-compiler:
**** v1    0.2 CLI RX|Security: Privilege proc_setid missing, will not change uid/gid
**** v1    0.2 CLI RX|Could not load VMOD debug
**** v1    0.2 CLI RX|\tFile name: libvmod_debug.so
**** v1    0.2 CLI RX|\tdlerror: ld.so.1: varnishd: fatal: /tmp/vtest.32_sun12.4/varnish-cache/varnish-trunk/_build/lib/libvmod_blob/.libs/libvmod_debug.so: open failed: No such file or directory
**** v1    0.2 CLI RX|('<vcl.inline>' Line 5 Pos 16)
**** v1    0.2 CLI RX|        import debug;
**** v1    0.2 CLI RX|---------------#####-
**** v1    0.2 CLI RX|
**** v1    0.2 CLI RX|Running VCC-compiler failed, exited with 2
**** v1    0.2 CLI RX|VCL compilation failed
---- v1    0.2 FAIL VCL does not compile
*    top   0.2 RESETTING after ../../../bin/varnishtest/tests/v00041.vtc
**   s1    0.2 Waiting for server (3/-1)
**** s1    0.2 macro undef s1_addr
**** s1    0.2 macro undef s1_port
**** s1    0.2 macro undef s1_sock
**   v1    0.2 Wait
**** v1    0.2 CLI TX|panic.clear
***  v1    0.2 CLI RX  300
**** v1    0.2 CLI RX|No panic to clear
**** v1    0.2 STDOUT poll 0x10
**   v1    0.2 R 91307 Status: 0000 (u 0.008000 s 0.028000)
***  v1    0.2 vsl|No VSL chunk found (child not started ?)
*    top   0.2 TEST ../../../bin/varnishtest/tests/v00041.vtc FAILED
#    top  TEST ../../../bin/varnishtest/tests/v00041.vtc FAILED (0.251) exit=2

1 @ SunOS 5.11 i86pc 1.04 64_gcc4.7 uplex

*    top   0.0 TEST ../../../bin/varnishtest/tests/v00041.vtc starting
[...]
*    top   0.0 TEST Test priv_task
[...]
**** v1    0.1 CLI TX|\t\tset beresp.http.bx1 = debug.test_priv_task("");
**** v1    0.1 CLI TX|\t\tset beresp.http.bo1 = obj.test_priv_task("");
**** v1    0.1 CLI TX|\t}
**** v1    0.1 CLI TX|
**** v1    0.1 CLI TX|\tsub vcl_fini {
**** v1    0.1 CLI TX|\t\tdebug.test_priv_task("cleaning");
**** v1    0.1 CLI TX|\t\tdebug.test_priv_task("up");
**** v1    0.1 CLI TX|\t\tstd.log("func " + debug.test_priv_task());
**** v1    0.1 CLI TX|\t\tstd.log("obj "  + obj.test_priv_task());
**** v1    0.1 CLI TX|\t}
**** v1    0.1 CLI TX|
**** v1    0.1 CLI TX|
**** v1    0.1 CLI TX|%XJEIFLH|)Xspa8P
***  v1    0.2 CLI RX  106
**** v1    0.2 CLI RX|Message from VCC-compiler:
**** v1    0.2 CLI RX|Security: Privilege proc_setid missing, will not change uid/gid
**** v1    0.2 CLI RX|Could not load VMOD debug
**** v1    0.2 CLI RX|\tFile name: libvmod_debug.so
**** v1    0.2 CLI RX|\tdlerror: ld.so.1: varnishd: fatal: /tmp/vtest.64_gcc4.7/varnish-cache/varnish-trunk/_build/lib/libvmod_blob/.libs/libvmod_debug.so: open failed: No such file or directory
**** v1    0.2 CLI RX|('<vcl.inline>' Line 5 Pos 16)
**** v1    0.2 CLI RX|        import debug;
**** v1    0.2 CLI RX|---------------#####-
**** v1    0.2 CLI RX|
**** v1    0.2 CLI RX|Running VCC-compiler failed, exited with 2
**** v1    0.2 CLI RX|VCL compilation failed
---- v1    0.2 FAIL VCL does not compile
*    top   0.2 RESETTING after ../../../bin/varnishtest/tests/v00041.vtc
**   s1    0.2 Waiting for server (3/-1)
**** s1    0.2 macro undef s1_addr
**** s1    0.2 macro undef s1_port
**** s1    0.2 macro undef s1_sock
**   v1    0.2 Wait
**** v1    0.2 CLI TX|panic.clear
***  v1    0.2 CLI RX  300
**** v1    0.2 CLI RX|No panic to clear
**** v1    0.2 STDOUT poll 0x10
**   v1    0.2 R 98106 Status: 0000 (u 0.009000 s 0.029000)
***  v1    0.2 vsl|No VSL chunk found (child not started ?)
*    top   0.2 TEST ../../../bin/varnishtest/tests/v00041.vtc FAILED
#    top  TEST ../../../bin/varnishtest/tests/v00041.vtc FAILED (0.251) exit=2

1 @ SunOS 5.11 i86pc 1.04 32_gcc4.7 uplex

*    top   0.0 TEST ../../../bin/varnishtest/tests/v00041.vtc starting
[...]
*    top   0.0 TEST Test priv_task
[...]
**** v1    0.1 CLI TX|\t\tset beresp.http.bx1 = debug.test_priv_task("");
**** v1    0.1 CLI TX|\t\tset beresp.http.bo1 = obj.test_priv_task("");
**** v1    0.1 CLI TX|\t}
**** v1    0.1 CLI TX|
**** v1    0.1 CLI TX|\tsub vcl_fini {
**** v1    0.1 CLI TX|\t\tdebug.test_priv_task("cleaning");
**** v1    0.1 CLI TX|\t\tdebug.test_priv_task("up");
**** v1    0.1 CLI TX|\t\tstd.log("func " + debug.test_priv_task());
**** v1    0.1 CLI TX|\t\tstd.log("obj "  + obj.test_priv_task());
**** v1    0.1 CLI TX|\t}
**** v1    0.1 CLI TX|
**** v1    0.1 CLI TX|
**** v1    0.1 CLI TX|%XJEIFLH|)Xspa8P
***  v1    0.1 CLI RX  106
**** v1    0.1 CLI RX|Message from VCC-compiler:
**** v1    0.1 CLI RX|Security: Privilege proc_setid missing, will not change uid/gid
**** v1    0.1 CLI RX|Could not load VMOD debug
**** v1    0.1 CLI RX|\tFile name: libvmod_debug.so
**** v1    0.1 CLI RX|\tdlerror: ld.so.1: varnishd: fatal: /tmp/vtest.32_gcc4.7/varnish-cache/varnish-trunk/_build/lib/libvmod_blob/.libs/libvmod_debug.so: open failed: No such file or directory
**** v1    0.1 CLI RX|('<vcl.inline>' Line 5 Pos 16)
**** v1    0.1 CLI RX|        import debug;
**** v1    0.1 CLI RX|---------------#####-
**** v1    0.1 CLI RX|
**** v1    0.1 CLI RX|Running VCC-compiler failed, exited with 2
**** v1    0.1 CLI RX|VCL compilation failed
---- v1    0.1 FAIL VCL does not compile
*    top   0.1 RESETTING after ../../../bin/varnishtest/tests/v00041.vtc
**   s1    0.1 Waiting for server (3/-1)
**** s1    0.1 macro undef s1_addr
**** s1    0.1 macro undef s1_port
**** s1    0.1 macro undef s1_sock
**   v1    0.1 Wait
**** v1    0.1 CLI TX|panic.clear
***  v1    0.1 CLI RX  300
**** v1    0.1 CLI RX|No panic to clear
**** v1    0.1 STDOUT poll 0x10
**   v1    0.1 R 20758 Status: 0000 (u 0.006000 s 0.023000)
***  v1    0.2 vsl|No VSL chunk found (child not started ?)
*    top   0.2 TEST ../../../bin/varnishtest/tests/v00041.vtc FAILED
#    top  TEST ../../../bin/varnishtest/tests/v00041.vtc FAILED (0.243) exit=2

1 @ SunOS 5.11 i86pc 1.04 64_gcc4.7 uplex

*    top   0.0 TEST ../../../bin/varnishtest/tests/v00041.vtc starting
[...]
*    top   0.0 TEST Test priv_task
[...]
**** v1    0.2 CLI TX|\t\tset beresp.http.bx1 = debug.test_priv_task("");
**** v1    0.2 CLI TX|\t\tset beresp.http.bo1 = obj.test_priv_task("");
**** v1    0.2 CLI TX|\t}
**** v1    0.2 CLI TX|
**** v1    0.2 CLI TX|\tsub vcl_fini {
**** v1    0.2 CLI TX|\t\tdebug.test_priv_task("cleaning");
**** v1    0.2 CLI TX|\t\tdebug.test_priv_task("up");
**** v1    0.2 CLI TX|\t\tstd.log("func " + debug.test_priv_task());
**** v1    0.2 CLI TX|\t\tstd.log("obj "  + obj.test_priv_task());
**** v1    0.2 CLI TX|\t}
**** v1    0.2 CLI TX|
**** v1    0.2 CLI TX|
**** v1    0.2 CLI TX|%XJEIFLH|)Xspa8P
***  v1    0.2 CLI RX  106
**** v1    0.2 CLI RX|Message from VCC-compiler:
**** v1    0.2 CLI RX|Security: Privilege proc_setid missing, will not change uid/gid
**** v1    0.2 CLI RX|Could not load VMOD debug
**** v1    0.2 CLI RX|\tFile name: libvmod_debug.so
**** v1    0.2 CLI RX|\tdlerror: ld.so.1: varnishd: fatal: /tmp/vtest.64_gcc4.7/varnish-cache/varnish-trunk/_build/lib/libvmod_blob/.libs/libvmod_debug.so: open failed: No such file or directory
**** v1    0.2 CLI RX|('<vcl.inline>' Line 5 Pos 16)
**** v1    0.2 CLI RX|        import debug;
**** v1    0.2 CLI RX|---------------#####-
**** v1    0.2 CLI RX|
**** v1    0.2 CLI RX|Running VCC-compiler failed, exited with 2
**** v1    0.2 CLI RX|VCL compilation failed
---- v1    0.2 FAIL VCL does not compile
*    top   0.2 RESETTING after ../../../bin/varnishtest/tests/v00041.vtc
**   s1    0.2 Waiting for server (3/-1)
**** s1    0.2 macro undef s1_addr
**** s1    0.2 macro undef s1_port
**** s1    0.2 macro undef s1_sock
**   v1    0.2 Wait
**** v1    0.2 CLI TX|panic.clear
***  v1    0.2 CLI RX  300
**** v1    0.2 CLI RX|No panic to clear
**** v1    0.2 STDOUT poll 0x10
**   v1    0.2 R 8593 Status: 0000 (u 0.013000 s 0.044000)
***  v1    0.3 vsl|No VSL chunk found (child not started ?)
*    top   0.3 TEST ../../../bin/varnishtest/tests/v00041.vtc FAILED
#    top  TEST ../../../bin/varnishtest/tests/v00041.vtc FAILED (0.275) exit=2

1 @ SunOS 5.11 i86pc 1.04 64_sun12.4 uplex

*    top   0.0 TEST ../../../bin/varnishtest/tests/v00041.vtc starting
[...]
*    top   0.0 TEST Test priv_task
[...]
**** v1    0.1 CLI TX|\t\tset beresp.http.bx1 = debug.test_priv_task("");
**** v1    0.1 CLI TX|\t\tset beresp.http.bo1 = obj.test_priv_task("");
**** v1    0.1 CLI TX|\t}
**** v1    0.1 CLI TX|
**** v1    0.1 CLI TX|\tsub vcl_fini {
**** v1    0.1 CLI TX|\t\tdebug.test_priv_task("cleaning");
**** v1    0.1 CLI TX|\t\tdebug.test_priv_task("up");
**** v1    0.1 CLI TX|\t\tstd.log("func " + debug.test_priv_task());
**** v1    0.1 CLI TX|\t\tstd.log("obj "  + obj.test_priv_task());
**** v1    0.1 CLI TX|\t}
**** v1    0.1 CLI TX|
**** v1    0.1 CLI TX|
**** v1    0.1 CLI TX|%XJEIFLH|)Xspa8P
***  v1    0.2 CLI RX  106
**** v1    0.2 CLI RX|Message from VCC-compiler:
**** v1    0.2 CLI RX|Security: Privilege proc_setid missing, will not change uid/gid
**** v1    0.2 CLI RX|Could not load VMOD debug
**** v1    0.2 CLI RX|\tFile name: libvmod_debug.so
**** v1    0.2 CLI RX|\tdlerror: ld.so.1: varnishd: fatal: /tmp/vtest.64_sun12.4/varnish-cache/varnish-trunk/_build/lib/libvmod_blob/.libs/libvmod_debug.so: open failed: No such file or directory
**** v1    0.2 CLI RX|('<vcl.inline>' Line 5 Pos 16)
**** v1    0.2 CLI RX|        import debug;
**** v1    0.2 CLI RX|---------------#####-
**** v1    0.2 CLI RX|
**** v1    0.2 CLI RX|Running VCC-compiler failed, exited with 2
**** v1    0.2 CLI RX|VCL compilation failed
---- v1    0.2 FAIL VCL does not compile
*    top   0.2 RESETTING after ../../../bin/varnishtest/tests/v00041.vtc
**   s1    0.2 Waiting for server (3/-1)
**** s1    0.2 macro undef s1_addr
**** s1    0.2 macro undef s1_port
**** s1    0.2 macro undef s1_sock
**   v1    0.2 Wait
**** v1    0.2 CLI TX|panic.clear
***  v1    0.2 CLI RX  300
**** v1    0.2 CLI RX|No panic to clear
**** v1    0.2 STDOUT poll 0x10
**   v1    0.2 R 89423 Status: 0000 (u 0.009000 s 0.030000)
***  v1    0.2 vsl|No VSL chunk found (child not started ?)
*    top   0.2 TEST ../../../bin/varnishtest/tests/v00041.vtc FAILED
#    top  TEST ../../../bin/varnishtest/tests/v00041.vtc FAILED (0.254) exit=2