1 of 145 tests failed

Donny Jekels djekels at DRWHoldings.com
Tue Feb 23 18:02:34 CET 2010

PASS: ./tests/v00024.vtc


1 of 145 tests failed

Please report to varnish-dev at projects.linpro.no


make[3]: *** [check-TESTS] Error 1

make[3]: Leaving directory `/opt/varnish-2.0.6/bin/varnishtest'

make[2]: *** [check-am] Error 2

make[2]: Leaving directory `/opt/varnish-2.0.6/bin/varnishtest'

make[1]: *** [check-recursive] Error 1

make[1]: Leaving directory `/opt/varnish-2.0.6/bin'

make: *** [check-recursive] Error 1



Donny Jekels | Sr. Unix Engineer | DRW Trading Group

T  312.542.3257 | C  312.342.8212 | F 312.526.5627 

Chicago, IL  60661-2555


This e-mail and any attachments may contain information that is confidential and proprietary and otherwise protected from disclosure. If you are not the intended recipient of this e-mail, do not read, duplicate or redistribute it by any means. Please immediately delete it and any attachments and notify the sender that you have received it in error. Unintended recipients are prohibited from taking action on the basis of information in this e-mail or any attachments. The DRW Companies make no representations that this e-mail or any attachments are free of computer viruses or other defects. 
-------------- next part --------------
An HTML attachment was scrubbed...
URL: <https://www.varnish-cache.org/lists/pipermail/varnish-dev/attachments/20100223/a2249cfe/attachment-0001.html>

More information about the varnish-dev mailing list