5.1.1 compile

Alex Evonosky alex.evonosky at gmail.com
Thu Mar 16 18:28:35 CET 2017

Hello all-

Quick question:

I compiled 5.1.1 on two servers without issue, yet on another I get the

make[3]: Nothing to be done for 'all'.
make[3]: Leaving directory '/root/varnish/varnish-5.1.1/doc/graphviz'
Making all in sphinx
make[3]: Entering directory '/root/varnish/varnish-5.1.1/doc/sphinx'
../../bin/varnishd/varnishd -x parameter > include/params.rst
FAILED to set maximum for param critbit_cooloff: 254.000
Must be less than or equal to 254.000

FAILED to set maximum for param vsm_free_cooldown: 600.000
Must be less than or equal to 600.000

Makefile:621: recipe for target 'include/params.rst' failed
make[3]: *** [include/params.rst] Error 2
make[3]: Leaving directory '/root/varnish/varnish-5.1.1/doc/sphinx'
Makefile:396: recipe for target 'all-recursive' failed
make[2]: *** [all-recursive] Error 1
make[2]: Leaving directory '/root/varnish/varnish-5.1.1/doc'
Makefile:543: recipe for target 'all-recursive' failed
make[1]: *** [all-recursive] Error 1
make[1]: Leaving directory '/root/varnish/varnish-5.1.1'
Makefile:428: recipe for target 'all' failed
make: *** [all] Error 2

Has anyone seen this before?

Thank you!
-------------- next part --------------
An HTML attachment was scrubbed...
URL: <https://www.varnish-cache.org/lists/pipermail/varnish-misc/attachments/20170316/77df2c62/attachment.html>

More information about the varnish-misc mailing list